{
  "packages": {
    "default": {
      "chain": "0.2.4",
      "docker": "0.3.6",
      "dotenv": "0.1.6",
      "envcache": "0.3.1",
      "gnu": "0.1.0",
      "prisma": "0.1.3",
      "yarn": "0.4.0"
    }
  },
  "repos": {
    "default": "https://gitlab.com/bitspur/mkpm/packages.git"
  },
  "binaries": {
    "psql": {
      "darwin": "brew install postgresql@14",
      "debian": "sudo apt-get install -y postgresql-client-common postgresql-client-15"
    }
  }
}
