[
  {
    "url": "https://github.com/frappe/payments",
    "branch": "version-15"
  },
  {
    "url": "https://github.com/frappe/erpnext",
    "branch": "v15.28.2"
  },
  {
    "url": "https://github.com/frappe/ecommerce_integrations.git",
    "branch": "v1.20.1"
  },
  {
    "url": "https://github.com/frappe/erpnext-shipping.git",
    "branch": "version-15"
  },
  {
    "url": "https://github.com/frappe/desk.git",
    "branch": "main"
  },
  {
    "url": "https://github.com/frappe/gameplan.git",
    "branch": "main"
  },
  {
    "url": "https://github.com/frappe/hrms.git",
    "branch": "v15.23.0"
  },
  {
    "url": "https://github.com/resilient-tech/india-compliance.git",
    "branch": "v15.7.3"
  },
  {
    "url": "https://github.com/frappe/insights.git",
    "branch": "main"
  },
  {
    "url": "https://github.com/frappe/lms.git",
    "branch": "main"
  },
  {
    "url": "https://github.com/frappe/education.git",
    "branch": "v15.4.0"
  },
  {
    "url": "https://github.com/yrestom/POS-Awesome.git",
    "branch": "Version-6-2-0"
  },
  {
    "url": "https://github.com/frappe/storage_integration.git",
    "branch": "master"
  },
  {
    "url": "https://github.com/frappe/wiki.git",
    "branch": "master"
  },
  {
    "url": "git@gitlab.com:bitspur/rock8s/erpnext/visa-management.git",
    "branch": "14.0"
  },
  {
    "url": "git@github.com:bitspur/frappe-scrum.git",
    "branch": "main"
  }
]