{
  "user_id": 1,
  "script_id":27,
  "corpus_id": "${getCorpusCortext.corpusHash}",
  "job_name": "contingency-matrix/${self.name}/${self.uid}",
  "form": {
    "field1": "PC_Terms_Terms",
    "field2": "Cities",
    "top": "10",
    "advanced_settings_nodes": "no",
    "norm": "No",
    "freeze_nodes": "no",
    "simplified_label": "no",
    "top2": "",
    "lowering": "no",
    "localcooc": "no",
    "localcoocrange": "5",
    "contextdecay": "None",
    "democratic": "no",
    "periods": "Standard Periods",
    "nb_period": "1",
    "time_cut_type": "homogeneous",
    "overlap": "no",
    "sequence_type": "snapshot",
    "contingencyanalysismeasure": "chi2",
    "computepvaluecontingency": "no",
    "blockreordering": "yes",
    "contlogsc": "no",
    "scalemaxvalue": "no",
    "scalemaxvalue_value": "2.5"
  }
}