{
  "user_id": 1,
  "script_id":122,
  "corpus_id": "${getCorpusCortext.corpusHash}",
  "job_name": "geo-explorer/${self.name}/${self.uid}",
  "form": {
    "legend_label": "Addresses",
    "custom_lon_lat_table": "no",
    "lon_lat_table": "geo_longitude_latitude",
    "approximate_non_located": "yes",
    "max_approximation_distance": "2",
    "two_pass_ura": "yes",
    "topn": "yes",
    "topn_field": "PC_Terms_Terms",
    "topn_number": "3",
    "aggregate": "no",
    "aggregation": "sum",
    "aggregation_linked": "no",
    "external_layer": "RISIS adapted NUTS 2021",
    "initial_scale": "Countries",
    "initial_viz_value": "Number of addresses"
  }
}

