{
  "user_id": 1,
  "script_id": 8,
  "corpus_id": "${uploadFile.id}",
  "job_name": "parsing/${self.name}/${self.uid}",
  "form": {
    "corpusorigin": "dataset",
    "corpustype": "csv",
    "jsonuniqueid": "",
    "corpustype2": "other",
    "formatting": "tab separated",
    "uniquefield": "yes",
    "paragraph": "no",
    "paragraphid": "yes",
    "sentenced": "no",
    "simplify_name": "yes",
    "yearfield": "",
    "xlsyearfield": "",
    "separatorxls": "***",
    "secondary_separatorxls": "|&|",
    "separator": "***",
    "robustformatting": "tabulation",
    "secondary_separator": "|&|",
    "robustseparator": "***",
    "robustsecondary_separator": "|&|",
    "jsonformat": "other",
    "yearfieldjson": "",
    "yearfieldjsonml": "",
    "factivatimeresolution": "month",
    "timegranularity": "year",
    "robustyearfield": "year",
    "timegranularityjsonml": "year",
    "timegranularitytips": "year",
    "startingyear": "2000",
    "factivastartingyear": "1990",
    "startingyearjsonml": "2000",
    "startingyearcsvradaraly": "2000",
    "timegranularitycsv": "year",
    "robustyearfield": "",
    "xlsspecialtime": "no",
    "xlsspecialtimeresolution": "year",
    "europressespecialtimeresolution": "year",
    "startingyearxls": "2000",
    "startingyeareuropresse": "2000",
    "csvspecialtime": "no",
    "csvspecialtimeresolution": "year",
    "startingyearcsv": "2000",
    "robustcsvspecialtime": "no",
    "robustcsvspecialtimeresolution": "year",
    "startingyearrobustcsv": "2000",
    "weights_tablename_json": "",
    "weights_tablename": "",
    "permissive_time_check": "yes"
  }
}
