{
    "user_id": 1,
    "script_id": 3,
    "corpus_id": "${getCorpusCorText.corpusHash}",
    "job_name": "network-mapping/${self.name}/${self.uid}",
    "form": {
        "field1": "${params.inputs.analysisData3.analysis3-field1}",
        "field2": "${params.inputs.analysisData3.analysis3-field2}",
        "top": "${params.inputs.analysisData3.analysis3-top}",
        "advanced_settings_nodes": "no",
        "norm": "No",
        "freeze_nodes": "no",
        "fixed": "no",
        "plot_only_pos": "yes",
        "show_labels": "yes",
        "simplified_label": "no",
        "scale_nodes": "yes",
        "size_node": "cooc-sum",
        "top2": "",
        "lowering": "no",
        "distancemetricschoice": "yes",
        "distance_type": "distributional",
        "bipartweighting": "no",
        "advanced_settings_edges_filtering": "no",
        "computeoptimaldistancethres": "yes",
        "distance_thres": "0.1",
        "top_edges": "99999",
        "k_nearest": "99999",
        "advanced_settings_edges": "no",
        "type_biparti": "no",
        "color_edges": "no",
        "localcooc": "no",
        "localcoocrange": "5",
        "contextdecay": "None",
        "democratic": "no",
        "periods": "Standard Periods",
        "nb_period": "1",
        "time_cut_type": "homogeneous",
        "overlap": "no",
        "sequence_type": "snapshot",
        "community_detection_method": "louvain resolution",
        "weighted_graph": "no",
        "resolution": "1",
        "historical": "no",
        "logscale": "no",
        "compute_projection": "yes",
        "projectionalias": "",
        "univoque_mapping": "yes",
        "oldschool": "no",
        "tagging": "yes",
        "tagging_field": "described_entity_type",
        "tagging_dist": "chi2",
        "heatmap": "no",
        "projected_item": "",
        "logarithmicheatmap": "no",
        "homogeneizecolormaps": "no",
        "maxheatmapvalue": "100",
        "profile_dynamic_step": "None",
        "taggingadvancedoption": "no",
        "tagging_label_number": "3",
        "toptagging": "100",
        "advanced_settings_sect4": "no",
        "potato_shape": "no",
        "automatic_intertemporal_threshold": "yes",
        "intertemporal_threshold": "0.27",
        "maximal_intertemporal_threshold": "0.45",
        "secondstep": "yes",
        "no_orphan": "no",
        "keep_scaled": "no",
        "multiprocessing_activated": "no",
        "cross_opitmization": "yes",
        "size_community_threshold": "1",
        "only_comp_connex": "no",
        "avoid_label_overlap": "yes",
        "robustness": "no",
        "font": "no",
        "labelremove": "no"
    }
}
  