{
  "title": "{{ params.inputs.dataset_title }}",
  "descriptions": [
      {
          "text": "D4Science scenario output",
          "date": "{{ now }}"
      }
  ],
  "authors": [
      {
          "fullname": "D4Science query scenario"
      }
  ],
  "contact": [
      {
          "email": "contact@risis2.eu",
          "fullname": "RCF team"
      }
  ],
  "subject": [
      "Other"
  ]
}
