{
  "source": {
    "includePattern": ".+\\.js(doc|x)?$",
    "include": ["api", "controllers", "fixtures", "services", "test", "utils"],
    "exclude": []
  },
  "recurseDepth": 10,
  "opts": {
    "destination": "./jsdoc/",
    "recurse": true
  }
}
