<?xml version="1.0" encoding="utf-8"?>
<!-- Generator: Adobe Illustrator 16.0.0, SVG Export Plug-In . SVG Version: 6.00 Build 0)  -->
<!DOCTYPE svg PUBLIC "-//W3C//DTD SVG 1.1//EN" "http://www.w3.org/Graphics/SVG/1.1/DTD/svg11.dtd">
<svg version="1.1" id="Layer_1" xmlns="http://www.w3.org/2000/svg" xmlns:xlink="http://www.w3.org/1999/xlink" x="0px" y="0px"
	 width="256px" height="256px" viewBox="0 0 256 256" enable-background="new 0 0 256 256" xml:space="preserve">
<g id="Layer_3_1_">
	<path fill="#EBEBEB" d="M1.214-4.006v260.203h260.203V-4.006H1.214z M230.951,201.169c-11.16,6.611-21.569,13.233-32.238,20.729
		c-10.701,7.515-24.474,17.021-38.19,16.935c-30.049-0.191-46.912-24.686-41.771-52.733c2.556-13.957,15.168-17.192,25.53-13.194
		c2.037-1.626,4.442-2.76,7.158-3.143c18.689-2.605,34.867-18.698,52.57-24.351c-0.843-1.649-1.459-3.411-1.77-5.269
		c-7.961-3.647-14.771-10.444-16.956-18.632c-1.786-6.693-0.796-14.807-3.72-20.967c-2.583-5.465-5.049-10.958-6.941-16.688
		c-1.733-0.168-3.455-0.405-5.146-0.781c-14.02-3.137-26.322-10.757-39.854-15.303c-0.14,6.999-3.489,13.981-9.968,17.18
		c-5.465,2.696-10.995,5.248-16.541,7.755c1.672,2.998,2.643,6.393,2.643,9.862c0,9.498-6.393,16.869-14.885,19.429
		c-0.699,1.14-1.354,2.307-2.107,3.415c-3.832,5.65-8.923,11.19-14.92,14.59c-11.714,6.635-28.461,10.138-40.611,2.285
		c-21.311-13.765-21.638-45.552-2.778-61.852c4.414-3.817,9.858-5.854,15.236-5.796c-1.694-4.909-1.468-10.697,1.506-16.65
		c3.389-6.795,9.121-11.72,13.934-17.434c7.186-8.532,21.548-7.376,28.923,0c1.281,1.279,2.265,2.666,3.112,4.09
		c3.501,0.671,6.569,1.943,9.133,3.681c0.171-0.056,0.351-0.078,0.523-0.129c-15.48-9.886-12.252-39.018,10.092-37.664
		c22.738,1.378,43.3,3.045,56.514,23.937c1.134,1.803,1.902,3.901,2.325,6.117c4.802,1.404,8.836,1.354,15.666,0.274
		c12.67-1.999,30.078-3.459,33.661,13.83c1.785,8.586,1.066,14.214-2.92,22.017c-0.536,0.786-1.135,1.522-1.722,2.267
		c0.778,1.664,1.574,3.326,2.353,4.989c0.911,1.927,1.63,3.825,2.232,5.714c8.903-2.9,19.576-0.687,24.071,8.698
		c8.671,18.126,5.8,32.439-4.603,49.274c-0.99,1.61-2.13,2.917-3.319,4.095C251.091,165.1,248.919,190.533,230.951,201.169z"/>
	<path fill="#EBEBEB" d="M1.214-4.006v260.203h260.203V-4.006H1.214z M230.951,201.169c-11.16,6.611-21.569,13.233-32.238,20.729
		c-10.701,7.515-24.474,17.021-38.19,16.935c-30.049-0.191-46.912-24.686-41.771-52.733c2.556-13.957,15.168-17.192,25.53-13.194
		c2.037-1.626,4.442-2.76,7.158-3.143c18.689-2.605,34.867-18.698,52.57-24.351c-0.843-1.649-1.459-3.411-1.77-5.269
		c-7.961-3.647-14.771-10.444-16.956-18.632c-1.786-6.693-0.796-14.807-3.72-20.967c-2.583-5.465-5.049-10.958-6.941-16.688
		c-1.733-0.168-3.455-0.405-5.146-0.781c-14.02-3.137-26.322-10.757-39.854-15.303c-0.14,6.999-3.489,13.981-9.968,17.18
		c-5.465,2.696-10.995,5.248-16.541,7.755c1.672,2.998,2.643,6.393,2.643,9.862c0,9.498-6.393,16.869-14.885,19.429
		c-0.699,1.14-1.354,2.307-2.107,3.415c-3.832,5.65-8.923,11.19-14.92,14.59c-11.714,6.635-28.461,10.138-40.611,2.285
		c-21.311-13.765-21.638-45.552-2.778-61.852c4.414-3.817,9.858-5.854,15.236-5.796c-1.694-4.909-1.468-10.697,1.506-16.65
		c3.389-6.795,9.121-11.72,13.934-17.434c7.186-8.532,21.548-7.376,28.923,0c1.281,1.279,2.585-0.746,3.432,0.683
		c3.501,0.671,6.25,5.354,8.814,7.088c0.171-0.056,0.351-0.078,0.523-0.129c-15.48-9.886-12.252-39.018,10.092-37.664
		c22.738,1.378,43.3,3.045,56.514,23.937c1.134,1.803,1.902,3.901,2.325,6.117c4.802,1.404,8.836,1.354,15.666,0.274
		c12.67-1.999,30.078-3.459,33.661,13.83c1.785,8.586,1.066,14.214-2.92,22.017c-0.536,0.786-1.135,1.522-1.722,2.267
		c0.778,1.664,1.574,3.326,2.353,4.989c0.911,1.927,1.63,3.825,2.232,5.714c8.903-2.9,19.576-0.687,24.071,8.698
		c8.671,18.126,5.8,32.439-4.603,49.274c-0.99,1.61-2.13,2.917-3.319,4.095C251.091,165.1,240.746,188.371,230.951,201.169z"/>
</g>
<g id="Layer_1_2_">
	<g id="Layer_3">
	</g>
	<g id="Layer_1_1_">
		<path fill="#676767" d="M132.533,0.975C64.31,0.975,9.001,57.555,9.001,127.354c0,14.575,1.674,24.069,6.381,38.645
			c9.171,27.114,57.301-23.861,78.014,6.209c20.709,30.045-46.706,56.449-1.497,74.505c20.567,5.107,26.387,7.036,40.634,7.036
			c68.225,0,123.535-56.585,123.535-126.379C256.068,57.551,200.762,0.975,132.533,0.975z M170.608,53.9
			c1.29-2.025,2.948-3.809,4.985-5.216c4.502-3.463,10.39-5.583,16.868-5.583c0.016,0,0.031,0.004,0.048,0.004
			c0.854-0.102,1.733-0.172,2.656-0.172c5.061,0,9.096,1.644,12.106,4.242c2.143,1.169,3.942,2.729,5.369,4.576
			c3.335,3.759,5.348,8.46,5.348,13.577c0,4.204-1.37,8.126-3.706,11.479c-1.729,3.2-4.35,5.857-7.816,7.509
			c-3.124,2.431-7.203,3.941-12.247,3.941c-2.801,0-5.273-0.483-7.478-1.301c-1.47-0.299-2.908-0.688-4.274-1.199
			c-7.761-1.594-12.535-7.241-14.349-13.821c-0.755-2.089-1.149-4.31-1.149-6.612C166.953,61.144,168.304,57.242,170.608,53.9z
			 M69.746,125.126c-1.514,2.239-3.493,4.157-5.956,5.57c-0.654,0.427-1.313,0.854-2.016,1.237
			c-3.179,2.686-7.423,4.387-12.778,4.387c-4.274,0-7.841-1.091-10.733-2.884c-1.907-0.726-3.66-1.678-5.288-2.765
			c-0.144-0.074-0.296-0.127-0.434-0.216c-0.132-0.096-0.258-0.197-0.389-0.3c-0.11-0.078-0.212-0.167-0.324-0.247
			c-1.145-0.883-2.287-1.771-3.431-2.652c-3.817-3.818-5.988-9.059-5.988-14.462c0-5.404,2.171-10.643,5.988-14.463
			c2.393-2.393,6.085-4.68,9.812-5.616c3.123-1.19,6.561-1.857,10.182-1.857c0.278,0,0.539,0.054,0.817,0.062
			c0.757-0.078,1.538-0.114,2.345-0.114c1.574,0,3.052,0.154,4.434,0.429c8.545,0.629,13.89,6.054,16.042,12.736
			c0.363,1.01,0.643,2.045,0.858,3.102c0.629,1.917,1.022,3.919,1.022,6.012C73.914,117.557,72.356,121.667,69.746,125.126z
			 M99.326,74.47c-2.567,4.336-6.814,7.599-12.731,8.45c-0.07,0.021-0.144,0.028-0.208,0.05c-2.14,0.761-4.538,1.203-7.22,1.203
			c-0.226,0-0.434-0.027-0.659-0.035c-0.082,0-0.16,0.018-0.242,0.018c-0.515,0-1.022-0.042-1.534-0.069
			c-0.546,0.036-1.092,0.082-1.659,0.082c-6.877,0-11.939-2.79-15.232-6.9c-4.376-3.989-7.081-9.384-7.081-15.343
			c0-12.271,11.424-22.215,25.502-22.215c2.303,0,4.504,0.328,6.62,0.827c4.929,0.414,8.762,2.455,11.537,5.398
			c1.624,1.452,2.95,3.162,3.977,5.051c2.131,3.228,3.383,6.946,3.383,10.938C103.782,66.582,102.132,70.898,99.326,74.47z
			 M111.487,45.281c-1.313-2.679-2.111-5.59-2.111-8.688c0-12.271,11.417-22.233,25.519-22.233c14.076,0,25.492,9.966,25.492,22.233
			c0,1.837-0.287,3.609-0.768,5.319c-1.118,5.757-4.481,10.936-10.001,13.566c-3.028,2.655-7.087,4.345-12.228,4.345
			c-0.771,0-1.449-0.13-2.17-0.204c-0.11,0-0.215,0.016-0.326,0.016c-4.143,0-7.635-1.014-10.478-2.715
			C117.888,55.298,113.574,50.774,111.487,45.281z M177.339,220.57c-1.367,4.074-3.938,7.689-7.713,9.969
			c-4.454,3.31-10.205,5.307-16.509,5.307c-14.101,0-25.502-9.955-25.502-22.212c0-12.28,11.41-22.237,25.502-22.237
			c4.526,0,8.776,1.045,12.462,2.852c7.554,2.26,11.792,8.852,12.715,15.998c0.192,1.106,0.323,2.229,0.323,3.378
			C178.617,216.064,178.162,218.391,177.339,220.57z M227.859,183.71c-1.973,5.983-6.525,10.944-13.641,12.304
			c-3.096,1.165-6.507,1.82-10.094,1.82c-5.425,0-10.449-1.492-14.579-4.002c-16.138-7.413-14.556-35.327,4.737-38.736
			c0.32-0.089,0.615-0.216,0.942-0.285c2.772-0.914,5.76-1.426,8.899-1.426c1.443,0,2.829,0.123,4.21,0.319
			c0.133,0,0.268-0.016,0.42-0.016c7.555,0,12.814,3.619,15.806,8.667c3.163,3.703,5.072,8.278,5.072,13.251
			C229.633,178.471,228.994,181.193,227.859,183.71z M227.691,140.443c-2.748,1.762-6.135,2.812-10.197,2.812
			c-3.023,0-5.635-0.622-7.929-1.645c-3.172-0.924-5.8-2.55-7.869-4.65c-4.921-3.574-8.28-8.716-9.043-14.574
			c-1.617-9.516,2.685-20.198,12.881-23.421c2.781-1.586,6.152-2.531,10.144-2.531c3.603,0,6.694,0.782,9.306,2.101
			c2.229,0.565,4.339,1.384,6.275,2.418c3.512,1.436,6.22,3.865,8.099,6.855c2.596,3.481,4.12,7.625,4.12,12.087
			C243.486,129.188,236.968,137.124,227.691,140.443z"/>
	</g>
</g>
</svg>
