<?xml version="1.0" encoding="utf-8"?>
<!-- Generator: Adobe Illustrator 16.0.0, SVG Export Plug-In . SVG Version: 6.00 Build 0)  -->
<!DOCTYPE svg PUBLIC "-//W3C//DTD SVG 1.1//EN" "http://www.w3.org/Graphics/SVG/1.1/DTD/svg11.dtd">
<svg version="1.1" id="Layer_1" xmlns="http://www.w3.org/2000/svg" xmlns:xlink="http://www.w3.org/1999/xlink" x="0px" y="0px"
	 width="768px" height="1024px" viewBox="0 0 768 1024" enable-background="new 0 0 768 1024" xml:space="preserve">
<path fill="#666666" d="M0,960V64h576l192,192v704H0z M704,320L512,128H64v768h640V320z M320,512H128V256h192V512z M256,320h-64v128
	h64V320z M256,768h64v64H128v-64h64V640h-64v-64h128V768z M512,448h64v64H384v-64h64V320h-64v-64h128V448z M576,832H384V576h192V832
	z M512,640h-64v128h64V640z"/>
</svg>
