<?xml version="1.0" encoding="utf-8"?>
<!-- Generator: Adobe Illustrator 16.0.0, SVG Export Plug-In . SVG Version: 6.00 Build 0)  -->
<!DOCTYPE svg PUBLIC "-//W3C//DTD SVG 1.1//EN" "http://www.w3.org/Graphics/SVG/1.1/DTD/svg11.dtd">
<svg version="1.1" id="Layer_1" xmlns="http://www.w3.org/2000/svg" xmlns:xlink="http://www.w3.org/1999/xlink" x="0px" y="0px"
	 width="100px" height="100px" viewBox="-34.66 -34.833 100 100" enable-background="new -34.66 -34.833 100 100"
	 xml:space="preserve">
<g>
	<path fill="#666666" d="M-20.651,32.104l-11.201,31.249l29.881-13.199L46.627,1.273L46.655,1.3L62.34-14.476L43.901-33.019
		L28.215-17.247l0.035,0.032L-20.651,32.104z M38.091-20.274l5.802-5.834l11.572,11.637l-5.807,5.838L38.091-20.274z
		 M-24.846,51.033l6.383-17.844l1.596-1.605l0.079,9.427l7.249-1.295l-1.668,6.917l9.894-0.596l-2.21,2.23l-16.757,7.355
		L-24.846,51.033z"/>
</g>
</svg>
