<?xml version="1.0" encoding="utf-8"?>
<!-- Generator: Adobe Illustrator 16.0.0, SVG Export Plug-In . SVG Version: 6.00 Build 0)  -->
<!DOCTYPE svg PUBLIC "-//W3C//DTD SVG 1.1//EN" "http://www.w3.org/Graphics/SVG/1.1/DTD/svg11.dtd">
<svg version="1.1" id="Layer_1" xmlns="http://www.w3.org/2000/svg" xmlns:xlink="http://www.w3.org/1999/xlink" x="0px" y="0px"
	 width="320px" height="320px" viewBox="0 0 320 320" enable-background="new 0 0 320 320" xml:space="preserve">
<title>Back X</title>
<g>
	<title>Layer 1</title>
	<g id="layer1">
		<path id="path4950" fill="#666666" d="M100,60l-40,40l170,170l40-40L100,60z"/>
		<path id="path4952" fill="#666666" d="M60,230L230,60l40,40L100,270L60,230z"/>
	</g>
</g>
</svg>
