<?xml version="1.0" encoding="utf-8"?>
<!-- Generator: Adobe Illustrator 16.0.0, SVG Export Plug-In . SVG Version: 6.00 Build 0)  -->
<!DOCTYPE svg PUBLIC "-//W3C//DTD SVG 1.1//EN" "http://www.w3.org/Graphics/SVG/1.1/DTD/svg11.dtd">
<svg version="1.1" id="Layer_1" xmlns="http://www.w3.org/2000/svg" xmlns:xlink="http://www.w3.org/1999/xlink" x="0px" y="0px"
	 width="100px" height="100px" viewBox="0 0 100 100" enable-background="new 0 0 100 100" xml:space="preserve">
<path fill="#666666" d="M76.614,41.502c-0.057-0.345-0.276-0.685-0.603-1.01c-2.633,2.6-13.216,3.034-25.874,3.034
	c-12.657,0-23.231-0.434-25.876-3.034c-0.324,0.326-0.525,0.665-0.601,1.01h-0.025l0.007,0.187c0,0.022-0.007,0.045-0.007,0.066
	c0,0.051,0.013,0.096,0.021,0.144l2.061,41.07h0.005c0.184,3.219,3.975,8.087,24.417,8.087c20.443,0,24.232-4.868,24.414-8.087
	h0.019l2.06-41.07c0.002-0.048,0.021-0.093,0.021-0.144c0-0.021-0.02-0.044-0.02-0.066l0.02-0.187H76.614z"/>
<path fill="#666666" d="M62.734,20.008v-9.696c0-1.75-1.472-3.197-3.28-3.197H39.726c-1.799,0-3.278,1.446-3.278,3.197v9.807
	c-9.752,1.078-16.427,3.258-16.427,5.782v4.791c0,0.982,1.025,1.923,2.861,2.763c4.812,2.198,15.21,3.724,27.258,3.724
	c12.055,0,22.45-1.525,27.268-3.724c1.822-0.844,2.858-1.779,2.858-2.763v-4.794C80.266,23.286,73.075,21.034,62.734,20.008
	 M42.756,19.605l-0.831,0.05v-4.017c0-1.757,0.252-3.194,0.548-3.194h3.836h6.574h3.826c0.306,0,0.557,1.438,0.557,3.194v3.951
	c-2.293-0.113-4.668-0.187-7.124-0.187C47.59,19.403,45.113,19.479,42.756,19.605"/>
</svg>
