<?xml version="1.0" encoding="utf-8"?>
<!-- Generator: Adobe Illustrator 16.0.0, SVG Export Plug-In . SVG Version: 6.00 Build 0)  -->
<!DOCTYPE svg PUBLIC "-//W3C//DTD SVG 1.1//EN" "http://www.w3.org/Graphics/SVG/1.1/DTD/svg11.dtd">
<svg version="1.1" id="Layer_1" xmlns="http://www.w3.org/2000/svg" xmlns:xlink="http://www.w3.org/1999/xlink" x="0px" y="0px"
	 width="100px" height="100px" viewBox="0 0 100 100" enable-background="new 0 0 100 100" xml:space="preserve">
<g>
	<path fill="#666766" d="M87.874,14.667l1.032,16.868h-2.611c-0.505-2.971-1.192-5.092-2.063-6.365
		c-1.421-2.05-3.312-3.562-5.671-4.535c-2.36-0.973-5.463-1.459-9.313-1.459H56.123v54.953c0,4.42,0.618,7.179,1.855,8.274
		c1.74,1.485,4.421,2.228,8.041,2.228h3.229v1.963H29.731v-1.963h3.299c3.939,0,6.735-0.919,8.384-2.758
		c1.007-1.132,1.512-3.714,1.512-7.744V19.176H31.724c-4.354,0-7.446,0.248-9.278,0.742c-2.382,0.672-4.422,1.962-6.117,3.872
		c-1.695,1.91-2.704,4.492-3.024,7.745h-2.612l1.1-16.868H87.874z"/>
</g>
</svg>
