<?xml version="1.0" encoding="UTF-8"?>
<!-- Generator: Adobe Illustrator 16.0.0, SVG Export Plug-In . SVG Version: 6.00 Build 0)  -->
<!DOCTYPE svg PUBLIC "-//W3C//DTD SVG 1.1//EN" "http://www.w3.org/Graphics/SVG/1.1/DTD/svg11.dtd">
<svg version="1.1" id="Capa_1" xmlns="http://www.w3.org/2000/svg" xmlns:xlink="http://www.w3.org/1999/xlink" x="0px" y="0px" width="100px" height="100px" viewBox="-38.348 -38.347 100 100" enable-background="new -38.348 -38.347 100 100" xml:space="preserve">
<polygon fill="#666666" points="58.152,12.995 38.897,-5.526 38.897,6.618 18.381,6.618 18.381,-13.123 31.001,-13.123   11.746,-31.651 -7.513,-13.123 5.119,-13.123 5.119,6.618 -15.396,6.618 -15.396,-5.526 -34.651,12.995 -15.396,31.528   -15.396,19.371 5.119,19.371 5.119,39.132 -7.513,39.132 11.746,57.653 31.001,39.132 18.381,39.132 18.381,19.371 38.897,19.371   38.897,31.528 "/>
</svg>