<?xml version="1.0" encoding="UTF-8"?>
<!-- Generator: Adobe Illustrator 16.0.0, SVG Export Plug-In . SVG Version: 6.00 Build 0)  -->
<!DOCTYPE svg PUBLIC "-//W3C//DTD SVG 1.1//EN" "http://www.w3.org/Graphics/SVG/1.1/DTD/svg11.dtd">
<svg version="1.1" id="Layer_1" xmlns:dc="http://purl.org/dc/elements/1.1/" xmlns:cc="http://creativecommons.org/ns#" xmlns:rdf="http://www.w3.org/1999/02/22-rdf-syntax-ns#" xmlns:svg="http://www.w3.org/2000/svg" xmlns:sodipodi="http://sodipodi.sourceforge.net/DTD/sodipodi-0.dtd" xmlns:inkscape="http://www.inkscape.org/namespaces/inkscape" sodipodi:docname="page_add.svg" inkscape:version="0.48.4 r9939" xmlns="http://www.w3.org/2000/svg" xmlns:xlink="http://www.w3.org/1999/xlink" x="0px" y="0px" width="512px" height="512px" viewBox="0 0 512 512" enable-background="new 0 0 512 512" xml:space="preserve">
<sodipodi:namedview gridtolerance="10" objecttolerance="10" borderopacity="1" pagecolor="#ffffff" bordercolor="#666666" id="namedview5" inkscape:current-layer="Layer_1" inkscape:window-maximized="0" inkscape:window-y="114" inkscape:window-x="407" inkscape:window-height="795" inkscape:window-width="1091" inkscape:pageshadow="2" inkscape:pageopacity="0" inkscape:cy="204.6732" inkscape:cx="268.53104" inkscape:zoom="0.921875" showgrid="false" guidetolerance="10">
	</sodipodi:namedview>
<path id="path3" sodipodi:nodetypes="ccccccccccccccccc" inkscape:connector-curvature="0" fill="#666666" d="M76.5,296.661V462  h359.209V154.107L333.077,51.476H76.5v220.06 M76.5,271.536v25.125 M333.077,87.758l66.35,66.35h-66.35V87.758z M410.051,436.342  H102.158V297.161v-25.875V77.134H307.42v102.631h102.631V436.342z"/>
<line fill="none" stroke="#666666" stroke-width="35" x1="6.5" y1="256.738" x2="45.5" y2="256.738"/>
<line fill="none" stroke="#666666" stroke-width="35" x1="467.5" y1="256.738" x2="506.5" y2="256.738"/>
<line fill="none" stroke="#666666" stroke-width="35" x1="256" y1="39" x2="256" y2="0"/>
<line fill="none" stroke="#666666" stroke-width="35" x1="256" y1="512" x2="256" y2="473"/>
<line fill="none" stroke="#666666" stroke-width="35" x1="470.788" y1="497.289" x2="443.211" y2="469.711"/>
<line fill="none" stroke="#666666" stroke-width="35" x1="69.789" y1="43.289" x2="42.211" y2="15.711"/>
<line fill="none" stroke="#666666" stroke-width="35" x1="474.078" y1="15.423" x2="446.5" y2="43"/>
<line fill="none" stroke="#666666" stroke-width="35" x1="67.789" y1="470.711" x2="40.211" y2="498.288"/>
</svg>