<?xml version="1.0" encoding="utf-8"?>
<!-- Generator: Adobe Illustrator 16.0.0, SVG Export Plug-In . SVG Version: 6.00 Build 0)  -->
<!DOCTYPE svg PUBLIC "-//W3C//DTD SVG 1.1//EN" "http://www.w3.org/Graphics/SVG/1.1/DTD/svg11.dtd">
<svg version="1.1" id="Layer_1" xmlns="http://www.w3.org/2000/svg" xmlns:xlink="http://www.w3.org/1999/xlink" x="0px" y="0px"
	 width="100px" height="100px" viewBox="0 0 100 100" enable-background="new 0 0 100 100" xml:space="preserve">
<path fill="#666666" d="M32.854,37.336V49.2L8.521,30.371l24.333-18.825v11.745v0.049h13.992C74.349,23.34,92,31.838,92,56.889
	c0,25.041-17.648,33.539-45.154,33.539H15.351V76.483h31.497c23.429,0,31.937-5.312,31.937-19.595
	c0-14.286-8.508-19.602-31.937-19.602H32.854V37.336z"/>
</svg>
