<?xml version="1.0" encoding="utf-8"?>
<!-- Generator: Adobe Illustrator 16.0.0, SVG Export Plug-In . SVG Version: 6.00 Build 0)  -->
<!DOCTYPE svg PUBLIC "-//W3C//DTD SVG 1.1//EN" "http://www.w3.org/Graphics/SVG/1.1/DTD/svg11.dtd">
<svg version="1.1" xmlns="http://www.w3.org/2000/svg" xmlns:xlink="http://www.w3.org/1999/xlink" x="0px" y="0px" width="100px"
	 height="100px" viewBox="0 0 100 100" enable-background="new 0 0 100 100" xml:space="preserve">
<g id="Layer_2">
</g>
<g id="Layer_1">
	<g>
		
			<image overflow="visible" opacity="0.75" width="95" height="61" xlink:href="24906AFD.png"  transform="matrix(1 0 0 1 2.5 19.5)">
		</image>
		<g>
			<polyline fill="#666666" points="50.002,55.313 23.501,34.724 18.028,40.434 50.002,65.277 81.973,40.434 76.492,34.724 			"/>
		</g>
	</g>
</g>
</svg>
