<?xml version="1.0" encoding="utf-8"?>
<!-- Generator: Adobe Illustrator 16.0.0, SVG Export Plug-In . SVG Version: 6.00 Build 0)  -->
<!DOCTYPE svg PUBLIC "-//W3C//DTD SVG 1.1//EN" "http://www.w3.org/Graphics/SVG/1.1/DTD/svg11.dtd">
<svg version="1.1" id="Layer_1" xmlns="http://www.w3.org/2000/svg" xmlns:xlink="http://www.w3.org/1999/xlink" x="0px" y="0px"
	 width="100px" height="100px" viewBox="0 0 100 100" enable-background="new 0 0 100 100" xml:space="preserve">
<path id="Dropbox_1_" fill="#666666" d="M77.538,41.998L49.871,24.987l17.447-14.581l27.685,17.197L77.538,41.998z M67.134,74.15
	l26.569-15.701l-15.98-13.646L51.71,60.691L67.134,74.15z M45.8,60.691L19.785,44.803L3.807,58.449L30.379,74.15L45.8,60.691z
	 M21.086,71.908v5.048l26.553,16.45V62.186L30.007,76.768L21.086,71.908z M76.42,71.908l-8.914,4.859L49.871,62.186v31.222
	l26.549-16.45V71.908z M47.639,24.987L30.19,10.406L2.504,27.604l17.468,14.395L47.639,24.987z"/>
</svg>
