<?xml version="1.0" encoding="utf-8"?>
<!-- Generator: Adobe Illustrator 16.0.0, SVG Export Plug-In . SVG Version: 6.00 Build 0)  -->
<!DOCTYPE svg PUBLIC "-//W3C//DTD SVG 1.1//EN" "http://www.w3.org/Graphics/SVG/1.1/DTD/svg11.dtd">
<svg version="1.1" id="Capa_1" xmlns="http://www.w3.org/2000/svg" xmlns:xlink="http://www.w3.org/1999/xlink" x="0px" y="0px"
	 width="100px" height="100px" viewBox="206 206 100 100" enable-background="new 206 206 100 100" xml:space="preserve">
<path fill="#666666" d="M297.235,287.438l-19.86-16.629c-2.055-1.818-4.249-2.655-6.023-2.573c4.688-5.406,7.52-12.42,7.52-20.086
	c0-17.095-14.077-30.954-31.443-30.954c-17.365,0-31.443,13.858-31.443,30.954c0,17.096,14.078,30.953,31.443,30.953
	c7.787,0,14.912-2.787,20.404-7.402c-0.082,1.745,0.767,3.908,2.614,5.929l16.892,19.551c2.892,3.164,7.617,3.431,10.499,0.594
	S300.449,290.285,297.235,287.438z M247.428,268.785c-11.577,0-20.962-9.239-20.962-20.636s9.385-20.636,20.962-20.636
	s20.961,9.239,20.961,20.636S259.006,268.785,247.428,268.785z M231.707,242.991h31.443v10.318h-31.443V242.991z"/>
</svg>
