<?xml version="1.0" encoding="UTF-8" standalone="no"?>

<!-- Created with Inkscape (http://www.inkscape.org/) -->

<svg id="svg2" xmlns:rdf="http://www.w3.org/1999/02/22-rdf-syntax-ns#" xmlns="http://www.w3.org/2000/svg" x="0px" y="0px"
   width="512px" height="512px" viewBox="0 0 512 512" version="1.1" xmlns:cc="http://creativecommons.org/ns#" xmlns:dc="http://purl.org/dc/elements/1.1/">

 <metadata id="metadata7">

  <rdf:RDF>

   <cc:Work rdf:about="">

    <dc:format>image/svg+xml</dc:format>

    <dc:type rdf:resource="http://purl.org/dc/dcmitype/StillImage"/>

    <dc:title/>

   </cc:Work>

  </rdf:RDF>

 </metadata>

 <g id="layer1" transform="translate(0,-540.36218)">

  <g id="text2985" style="letter-spacing:0px;word-spacing:0px;" font-weight="normal" transform="scale(1.0090542,0.99102705)" font-size="196.43026732999999000px" font-style="normal" font-family="Sans" line-height="125%" fill="#666">

   <path id="path4290" fill="#666" d="m50.093,549.93,202.34,0c40.053,0.00051,69.92,1.6694,89.602,5.0067,19.681,3.3383,37.291,10.302,52.829,20.89,15.538,10.589,28.486,24.689,38.845,42.298,10.358,17.61,15.537,37.349,15.538,59.217-0.00045,23.71-6.3883,45.463-19.163,65.259-12.776,19.797-30.098,34.644-51.966,44.542,30.845,8.9777,54.555,24.285,71.129,45.923,16.573,21.638,24.86,47.074,24.861,76.309-0.00048,23.019-5.3524,45.405-16.056,67.158s-25.322,39.133-43.852,52.138c-18.531,13.006-41.377,21.005-68.54,23.998-17.035,1.8415-58.124,2.9925-123.27,3.4529h-172.3zm102.21,84.25,0,117.05,66.986,0c39.823,0.00031,64.568-0.57517,74.237-1.7264,17.494-2.0714,31.248-8.114,41.262-18.128,10.013-10.013,15.02-23.191,15.02-39.535-0.00035-15.653-4.3164-28.371-12.948-38.154-8.6325-9.7827-21.466-15.71-38.5-17.782-10.129-1.1505-39.248-1.726-87.358-1.7264zm0,201.3,0,135.35,94.609,0c36.83,0.00009,60.195-1.0358,70.093-3.1076,15.192-2.7622,27.565-9.4953,37.118-20.199,9.5526-10.704,14.329-25.033,14.329-42.988-0.00037-15.192-3.6834-28.083-11.049-38.672-7.3665-10.589-18.013-18.3-31.939-23.134-13.927-4.8338-44.14-7.2508-90.638-7.251z"/>

  </g>

 </g>

</svg>

