<?xml version="1.0" encoding="utf-8"?>
<!-- Generator: Adobe Illustrator 16.0.0, SVG Export Plug-In . SVG Version: 6.00 Build 0)  -->
<!DOCTYPE svg PUBLIC "-//W3C//DTD SVG 1.1//EN" "http://www.w3.org/Graphics/SVG/1.1/DTD/svg11.dtd">
<svg version="1.1" id="Capa_1" xmlns="http://www.w3.org/2000/svg" xmlns:xlink="http://www.w3.org/1999/xlink" x="0px" y="0px"
	 width="100px" height="100px" viewBox="-39.123 -39.177 100 100" enable-background="new -39.123 -39.177 100 100"
	 xml:space="preserve">
<path fill="#666666" d="M14.412-0.211L9.674-4.897l12.734-12.582L40.223,0.132L27.493,12.714l-9.247-9.132l6.59-6.516
	c1.055-1.042,1.055-2.746,0-3.792c-1.055-1.042-2.779-1.042-3.834,0L14.412-0.211z M-12.807,34.256c-1.057,1.043-2.78,1.043-3.835,0
	c-1.056-1.042-1.056-2.746,0-3.788l15.914-15.729l-4.733-4.678l-20.286,20.052l-7.146,24.66l24.961-7.057L12.354,27.66l-9.247-9.133
	L-12.807,34.256z M56.754-16.3L38.988-33.858l-11.781,11.64L44.973-4.655L56.754-16.3z M34.802,18.479
	c-1.463,0.003-2.886,0.173-4.251,0.483L2.181-8.912c0.746-2.007,1.145-4.177,1.139-6.439C3.292-25.61-5.161-33.911-15.545-33.883
	c-0.133,0-0.272,0-0.407,0.004l1.413,5.134c3.632,1.741,6.144,5.417,6.152,9.687c0.012,5.954-4.859,10.796-10.888,10.816
	c-5.416,0.013-9.919-3.873-10.79-8.983l-3.458-3.397c-0.519,1.705-0.792,3.518-0.787,5.38c0.033,10.26,8.48,18.565,18.87,18.533
	c1.78-0.004,3.499-0.262,5.128-0.715L17.49,29.889c-0.944,2.222-1.459,4.661-1.451,7.223c0.037,10.26,8.474,18.561,18.874,18.532
	c0.134,0,0.266,0,0.4-0.005l-1.406-5.134c-3.638-1.745-6.148-5.429-6.165-9.682c-0.012-5.954,4.86-10.797,10.891-10.813
	c5.412-0.021,9.916,3.87,10.791,8.979l3.459,3.396c0.523-1.704,0.789-3.518,0.789-5.38C53.639,26.751,45.189,18.451,34.802,18.479z"
	/>
</svg>
