<?xml version="1.0" encoding="utf-8"?>
<!-- Generator: Adobe Illustrator 16.0.0, SVG Export Plug-In . SVG Version: 6.00 Build 0)  -->
<!DOCTYPE svg PUBLIC "-//W3C//DTD SVG 1.1//EN" "http://www.w3.org/Graphics/SVG/1.1/DTD/svg11.dtd">
<svg version="1.1" id="Layer_1" xmlns="http://www.w3.org/2000/svg" xmlns:xlink="http://www.w3.org/1999/xlink" x="0px" y="0px"
	 width="512px" height="512px" viewBox="0 0 512 512" enable-background="new 0 0 512 512" xml:space="preserve">
<g>
	<path fill="none" stroke="#666666" stroke-width="17" stroke-miterlimit="10" d="M59.792,414.5
		c-23.357,0-42.292,18.389-42.292,41.07c0,22.686,18.935,41.071,42.292,41.071c23.359,0,42.292-18.387,42.292-41.071
		C102.084,432.888,83.152,414.5,59.792,414.5z"/>
</g>
<g>
	<path fill="none" stroke="#666666" stroke-width="17" stroke-miterlimit="10" d="M451.971,18.5C428.238,18.5,409,36.807,409,59.39
		c0,22.585,19.238,40.89,42.971,40.89s42.969-18.304,42.969-40.89C494.939,36.807,475.703,18.5,451.971,18.5z"/>
</g>
<g id="Layer_3" display="none">
	
		<line display="inline" fill="none" stroke="#666666" stroke-width="23" stroke-miterlimit="10" x1="68.97" y1="446.5" x2="448.698" y2="86.5"/>
</g>
<line fill="none" stroke="#666666" stroke-width="40" stroke-miterlimit="10" x1="89.5" y1="429" x2="422.5" y2="87"/>
</svg>
