
      24076
      47750
      71836
      95667
     119912
     143277
     167638
     191542
     215646
     239290
     263581
     287866
     311786
     336266
     360198
     384507
     408028
     431942
     455894
     480337
     504031
     527611
     551565
     567204
     579486
     589984
     596571
     599334
     600982
     603840
