
      24074
      47746
      71834
      95660
     119898
     143263
     167626
     191528
     215627
     239267
     263549
     287840
     311759
     336231
     360157
     384476
     407997
     431905
     455864
     480287
     503960
     527558
     551499
     567126
     579401
     589903
     596481
     599244
     600897
     603745
