
               214308
               426089
               642822
               858658
              1079442
              1292845
              1518230
              1740962
              1970091
              2192531
              2428393
              2660777
              2904747
              3153065
              3403178
              3669539
              3936002
              4230571
              4538917
              4894527
              5336824
              5853809
              6515972
              7223294
              7946263
              8639326
              9191764
              9747899
             10260134
             10616365
