{
    "version": 3,
    "cmakeMinimumRequired": {
      "major": 3,
      "minor": 22,
      "patch": 0
    },
    "configurePresets": [
        {
            "name": "default",
            "displayName": "Default Config",
            "description": "Default build using Ninja generator",
            "generator": "Ninja",
            "binaryDir": "${sourceDir}/out/build/${presetName}"
        },
        {
            "name": "ninja-multi",
            "inherits": "default",
            "displayName": "Ninja Multi-Config",
            "description": "Default build using Ninja Multi-Config generator",
            "generator": "Ninja Multi-Config"
        }
    ]
}
