<svg xmlns="http://www.w3.org/2000/svg" width="10" height="9" viewBox="0 0 10 9">
    <path fill="#7F36DA" fill-rule="nonzero" d="M8.973 2.043c.006.09.006.178.006.266 0 2.71-2.062 5.832-5.831 5.832A5.791 5.791 0 0 1 0 7.221c.165.019.324.025.495.025.958 0 1.84-.323 2.545-.875a2.054 2.054 0 0 1-1.917-1.422 2.18 2.18 0 0 0 .927-.038A2.05 2.05 0 0 1 .407 2.9v-.026c.273.152.59.247.926.26A2.047 2.047 0 0 1 .698.394a5.83 5.83 0 0 0 4.226 2.144 2.33 2.33 0 0 1-.05-.47C4.873.94 5.786.02 6.922.02c.59 0 1.123.247 1.498.647.463-.089.906-.26 1.3-.495a2.046 2.046 0 0 1-.901 1.13A4.108 4.108 0 0 0 10 .983a4.399 4.399 0 0 1-1.027 1.06z"/>
</svg>
