<svg xmlns="http://www.w3.org/2000/svg" width="32" height="32" viewBox="0 0 32 32">
    <g fill="none" fill-rule="evenodd">
        <path fill="#B375FF" d="M8.567 5.855C10.434 3.291 12.3 1.673 14.164 1c-.026.159-.039.322-.039.489 0 1.612.322 2.918 1.875 2.918s1.875-1.306 1.875-2.918c0-.167-.013-.33-.04-.489 1.865.673 3.73 2.291 5.598 4.855a7 7 0 0 0 2.814 2.276L31 10.244a5.353 5.353 0 0 1-3.702 5.092L16 19 4.702 15.336A5.353 5.353 0 0 1 1 10.244l4.753-2.113a7 7 0 0 0 2.814-2.276z"/>
        <path fill="#ECDDFF" stroke="#B375FF" stroke-width="2" d="M16 10c3.805 0 6.447.513 7.639 1.615C26.332 13.853 27 15.847 27 19.77 27 25.44 22.058 30 16 30S5 25.438 5 19.77c0-3.881.68-5.927 3.322-8.12C9.552 10.513 12.195 10 16 10z"/>
        <path fill="#B375FF" d="M23 16v3a2 2 0 0 1-2 2h-2a2 2 0 0 1-2-2v-5l6 2z"/>
        <circle cx="12" cy="18" r="2" stroke="#B375FF" stroke-width="2"/>
        <path stroke="#B375FF" stroke-width="2" d="M7.5 11.5L27 17M12 23a2 2 0 0 0 2 2h6"/>
    </g>
</svg>
