<svg xmlns="http://www.w3.org/2000/svg" width="24" height="24" viewBox="0 0 24 24">
    <path fill="#7A767F" fill-rule="nonzero" d="M16.463 15.05l4.244 4.243a1 1 0 0 1-1.414 1.414l-4.244-4.244a7.5 7.5 0 1 1 1.414-1.414zM10.5 16a5.5 5.5 0 1 0 0-11 5.5 5.5 0 0 0 0 11z"/>
</svg>
