<?xml version="1.0" encoding="UTF-8"?>
<svg width="24px" height="24px" viewBox="0 0 24 24" version="1.1" xmlns="http://www.w3.org/2000/svg" xmlns:xlink="http://www.w3.org/1999/xlink">
    <!-- Generator: Sketch 58 (84663) - https://sketch.com -->
    <title>not favorite</title>
    <desc>Created with Sketch.</desc>
    <g id="Symbols" stroke="none" stroke-width="1" fill="none" fill-rule="evenodd" stroke-opacity="0.5">
        <g id="not-favorite" fill="#FFFFFF" stroke="#7F36DA" stroke-width="2">
            <g id="star-lighter" transform="translate(0.000000, 1.000000)">
                <path d="M17.725292,19.8801884 L16.6318585,13.5049821 L21.2637171,8.99003587 L14.862646,8.0599058 L12,2.25955146 L9.137354,8.0599058 L2.73628295,8.99003587 L7.36814147,13.5049821 L6.274708,19.8801884 L12,16.8702243 L17.725292,19.8801884 Z" id="Star-Copy"></path>
            </g>
        </g>
    </g>
</svg>