<?xml version="1.0" encoding="UTF-8"?>
<svg width="24px" height="24px" viewBox="0 0 24 24" version="1.1" xmlns="http://www.w3.org/2000/svg" xmlns:xlink="http://www.w3.org/1999/xlink">
    <!-- Generator: Sketch 58 (84663) - https://sketch.com -->
    <title>back-2</title>
    <desc>Created with Sketch.</desc>
    <g id="Page-2" stroke="none" stroke-width="1" fill="none" fill-rule="evenodd" stroke-linecap="round" stroke-linejoin="round">
        <g id="Artboard-Copy" stroke="#B375FF" stroke-width="2">
            <g id="Group-20" transform="translate(7.000000, 3.000000)">
                <g id="Group-19">
                    <polyline id="Path-5" points="8 18 0 9 8 -6.81954493e-13"></polyline>
                </g>
            </g>
        </g>
    </g>
</svg>