<?xml version="1.0" encoding="UTF-8"?>
<svg width="32px" height="32px" viewBox="0 0 32 32" version="1.1" xmlns="http://www.w3.org/2000/svg" xmlns:xlink="http://www.w3.org/1999/xlink">
    <!-- Generator: Sketch 64 (93537) - https://sketch.com -->
    <title>Ecosia</title>
    <desc>Created with Sketch.</desc>
    <g id="Symbols" stroke="none" stroke-width="1" fill="none" fill-rule="evenodd">
        <g id="Ecosia-Copy">
            <rect id="circle-back" fill="#FFFFFF" x="0" y="0" width="32" height="32" rx="16"></rect>
            <g id="ecosia-icon" transform="translate(7.000000, 4.000000)" fill-rule="nonzero">
                <path d="M16.1740757,17.7083894 C15.3755963,17.1760699 14.9731108,17.4422297 14.9731108,17.4422297 C14.9731108,17.4422297 14.98934,18.0579676 15.5888487,18.5740579 C16.1883574,19.0901482 16.9865122,19.0232837 16.9865122,19.0232837 C16.9865122,19.0232837 16.9702829,18.2442795 16.1711544,17.708714 L16.1740757,17.7083894 Z M4.22934389,20.803633 C3.66359205,21.7689491 3.913198,22.5843069 3.913198,22.5843069 C3.913198,22.5843069 4.5623682,22.7673729 5.37772598,21.7024091 C6.19308376,20.6374454 5.86038403,19.592606 5.86038403,19.592606 C5.86038403,19.592606 4.79574489,19.8425365 4.22934389,20.807528 L4.22934389,20.803633 Z M1.71640602,18.3737889 C1.11722192,18.8931251 1.10066808,19.5056172 1.10066808,19.5056172 C1.10066808,19.5056172 1.49990776,19.7717769 2.30163296,19.2394574 C3.10335817,18.7071378 3.11699074,17.9248877 3.11699074,17.9248877 C3.11699074,17.9248877 2.33798649,17.8417939 1.71932729,18.3741135 L1.71640602,18.3737889 Z M9.1052613,20.5040409 C9.1052613,20.5040409 8.4560911,21.0032528 8.37299731,22.0685411 C8.28990352,23.1338294 9.00528909,23.9186762 9.00528909,23.9186762 C9.00528909,23.9186762 9.83752529,23.2863844 9.77066076,22.0049225 C9.72067466,20.706582 9.1052613,20.5072868 9.1052613,20.5072868 L9.1052613,20.5040409 Z M13.4488591,20.4878117 C13.4488591,20.4878117 13.2657931,21.0701174 13.6650328,21.7523952 C14.0642725,22.4346731 14.8465226,22.6177391 14.8465226,22.6177391 C14.8465226,22.6177391 15.0795747,21.8689213 14.4969444,21.1201035 C13.8977603,20.3547318 13.4485346,20.4878117 13.4485346,20.4878117 L13.4488591,20.4878117 Z M16.1779707,5.76008723 C16.97645,5.22776766 16.9933285,4.44551757 16.9933285,4.44551757 C16.9933285,4.44551757 16.2143242,4.36242378 15.5953404,4.89474335 C14.9961563,5.41407951 14.9796025,6.02624702 14.9796025,6.02624702 C14.9796025,6.02624702 15.3788422,6.2924068 16.1805674,5.76008723 L16.1779707,5.76008723 Z M2.16563181,6.80849711 C2.16563181,6.80849711 2.14940255,6.02949287 1.35027403,5.49392745 C0.551145504,4.95836203 0.149309147,5.22776766 0.149309147,5.22776766 C0.149309147,5.22776766 0.165538402,5.8435056 0.765047087,6.35959592 C1.3639066,6.89191549 2.16271054,6.8088217 2.16271054,6.8088217 L2.16563181,6.80849711 Z M4.81164956,3.913198 C4.81164956,3.913198 5.04470167,3.16438017 4.46207141,2.41523775 C3.87976573,1.64986608 3.41366152,1.78294597 3.41366152,1.78294597 C3.41366152,1.78294597 3.23059553,2.36525164 3.6298352,3.04752953 C4.0459533,3.74668584 4.81132498,3.91287341 4.81132498,3.91287341 L4.81164956,3.913198 Z M13.8312204,2.98163875 C14.6465782,1.93322887 14.3138784,0.904294096 14.3138784,0.904294096 C14.3138784,0.904294096 13.2492393,1.15422463 12.6831629,2.10525898 C12.1170865,3.05629333 12.3835708,3.86937901 12.3835708,3.86937901 C12.3835708,3.86937901 13.0158626,4.05244501 13.8312204,2.98748129 L13.8312204,2.98163875 Z M8.95530298,2.05007951 C9.00528909,0.868589735 8.23959283,0.285959475 8.23959283,0.285959475 C8.23959283,0.285959475 7.59042263,1.00166963 7.65728716,1.98353956 C7.74038094,2.9654095 8.33956504,3.41171401 8.33956504,3.41171401 C8.33956504,3.41171401 8.90531688,3.22864802 8.95530298,2.04715824 L8.95530298,2.05007951 Z" id="Shape" fill="#36ACB8"></path>
                <path d="M9.1685554,5.6432366 C5.76041182,5.6432366 2.99494674,8.40220997 2.99494674,11.8168452 C2.99494674,15.2314805 5.75392012,17.9904539 9.1685554,17.9904539 C12.5831907,17.9904539 15.342164,15.2314805 15.342164,11.8168452 C15.342164,8.40220997 12.5831907,5.6432366 9.1685554,5.6432366 Z M9.1685554,17.2757175 C6.15640564,17.2757175 3.72688615,14.8293196 3.72688615,11.8174944 C3.72688615,8.80566925 6.15673023,6.35927133 9.1685554,6.35927133 C12.1803806,6.35927133 14.6102246,8.80566925 14.6102246,11.8174944 C14.6102246,14.8293196 12.1803806,17.2757175 9.1685554,17.2757175 Z" id="Shape" fill="#DC7E58"></path>
                <path d="M9.23509534,7.34081668 C6.72215748,7.34081668 4.70875608,9.38765034 4.70875608,11.8671559 C4.70875608,14.3800938 6.72248206,16.3934952 9.23509534,16.3934952 C11.7344006,16.3934952 13.7448808,14.3632154 13.7448808,11.8671559 C13.7448808,9.3710965 11.7311548,7.34081668 9.23509534,7.34081668 Z" id="Path" fill="#36ACB8"></path>
                <path d="M13.6455577,12.7659321 C13.6455577,12.7990398 13.6455577,12.832472 13.661787,12.8659043 C13.6780162,12.8159182 13.6780162,12.7659321 13.6948947,12.6993921 C13.661787,12.7156214 13.661787,12.7490537 13.6452331,12.7659321 L13.6455577,12.7659321 Z M10.5334358,13.5978437 C10.3841266,13.6978159 10.2835052,13.7977881 10.2503975,14.0470695 C10.2838298,14.0970556 10.3003836,14.1304879 10.3672482,14.1639201 C10.5503142,14.0973802 10.7502586,13.7977881 10.6171787,13.6121255 C10.5837464,13.595247 10.5671926,13.595247 10.5340849,13.595247 L10.5334358,13.5978437 Z M8.37007604,7.85658241 C8.28698226,7.82347473 8.18701005,7.8065963 8.10391626,7.77348862 C7.88774258,7.82347473 7.62125821,7.77348862 7.37165227,7.72350252 C7.18858627,7.8065963 7.00552027,7.90656852 6.8393327,8.00654073 C6.87561507,8.04368323 6.90389549,8.08787138 6.92242648,8.13637477 C6.8893188,8.25322541 6.77311734,8.36942687 6.82277886,8.50250676 C6.83965728,8.58560055 6.87276496,8.6193574 6.9396295,8.66901892 C7.15612776,8.68524818 7.27265381,8.55216829 7.43884138,8.50250676 L7.95817755,8.41941298 C8.15779739,8.36942687 8.50737554,8.08671325 8.37429565,7.85366114 L8.37007604,7.85658241 Z M5.72405829,12.0167897 L5.47412776,11.6506577 C5.25795408,11.434484 5.04145581,11.251418 4.75841761,11.1848781 C4.72498534,11.4010517 4.7084315,11.6341038 4.7084315,11.8671559 C4.7084315,12.6325276 4.8914975,13.3647916 5.24075107,13.997408 C5.29073717,13.9474219 5.34072328,13.9143142 5.39070939,13.8675739 L5.60688306,13.5179958 C5.7237337,13.4011451 5.90647511,13.3680375 6.00612274,13.2349576 L6.12297338,12.9188117 C6.18951332,12.7889776 6.35602548,12.6857596 6.32259322,12.5026936 C6.23949943,12.2365338 5.90647511,12.2031015 5.72340912,12.0200355 L5.72405829,12.0167897 Z M5.8240305,9.22113818 C5.97398881,9.15459824 6.0570826,9.33798882 6.17360865,9.20490893 C6.32356697,9.05495061 6.12362255,8.80566925 6.12362255,8.63915709 C6.12362255,8.60572483 6.1398518,8.55606331 6.15705481,8.52230646 C5.85746276,8.78846624 5.60785682,9.10461213 5.39103397,9.43763645 C5.4578985,9.42140719 5.52086801,9.42140719 5.57442455,9.40420418 C5.67407218,9.35421807 5.74061213,9.28735354 5.82435508,9.22113818 L5.8240305,9.22113818 Z M12.4975002,8.72192629 C12.397528,8.72192629 12.2978804,8.72192629 12.1979082,8.73880472 L10.7833663,8.88876304 C10.3341405,8.88876304 10.1010884,8.52263104 9.66841645,8.62260325 C9.50222888,8.65603552 9.18575841,8.83877693 9.10266462,8.97218141 C8.98581398,9.15557199 9.1357723,9.27177346 8.91959862,9.37142108 C8.7696403,9.33798882 8.71997878,9.22146277 8.58689889,9.15524741 C8.49282874,9.16122655 8.40680355,9.21034957 8.35384679,9.2883273 C8.33761753,9.48794714 8.48368083,9.5213794 8.48368083,9.72099924 C8.40058704,9.83784988 8.20064262,9.85083328 8.1509811,9.98715902 C8.08444115,10.1364682 8.1509811,10.3033049 8.05100889,10.419831 L7.61833695,10.8359491 C7.33529874,11.1855272 7.46837863,11.7512791 7.68487689,11.9674527 C7.88449673,12.1670726 8.18408878,12.000885 8.45089773,12.1174111 C8.65051757,12.2005048 8.68394984,12.5831907 8.73328677,12.7665813 C8.83325898,13.0661733 8.65019299,13.1992532 8.65019299,13.4819668 C8.65019299,13.7646804 8.74984061,14.5803628 9.14940487,14.5634844 C9.59863066,14.5472551 9.70119955,14.0977048 9.94788423,13.7981127 C10.030978,13.6981405 10.1640579,13.6481544 10.2309224,13.4985207 L10.2471517,13.032741 C10.3471239,12.7665813 10.6632698,12.6831629 10.829782,12.483543 C10.9962941,12.3004771 10.8460112,12.1505187 10.9297542,12.000885 C10.9297542,12.000885 10.9459834,12.000885 10.9459834,11.9846557 L11.3621015,11.7516036 L11.5617214,11.5185515 L11.7116797,11.4685654 C12.2310158,11.7347252 12.0443794,12.2670448 12.4105114,12.550083 C12.4436191,12.5338537 12.4604975,12.5169753 12.4936052,12.5000969 C12.5435913,12.4335569 12.5098344,12.3702628 12.5435913,12.2670448 C12.6101312,12.0671004 12.8431833,11.8678051 13.0927893,11.9174666 C13.2096399,12.0667758 13.4089352,12.2670448 13.4423674,12.4832185 C13.4757997,12.6828383 13.3427198,12.7993644 13.3427198,12.9658765 C13.3427198,13.0827271 13.4092598,13.2320363 13.5089074,13.3819946 C13.5763301,13.2099356 13.6265609,13.031627 13.6588657,12.849675 C13.6588657,12.8162428 13.6588657,12.7831351 13.6426365,12.7497028 C13.6588657,12.7334736 13.6588657,12.7165952 13.6757441,12.6831629 C13.7289303,12.4088897 13.7567457,12.1303013 13.7588379,11.8509267 C13.7588379,10.6499618 13.2761799,9.53760866 12.4939298,8.72192629 L12.4975002,8.72192629 Z M10.01767,10.799271 C9.91769781,10.8155002 9.81805019,10.7492848 9.75151024,10.7161772 C9.6346596,10.6999479 9.50157971,10.6999479 9.38537824,10.6830695 C9.36914899,10.6830695 8.78619414,10.2172899 8.7696403,10.1838576 C8.80307257,10.1007638 8.83618025,10.1007638 8.88649094,10.067007 C9.10266462,10.1169931 9.15265073,10.250073 9.30260904,10.3169375 L9.53566115,10.3669236 C9.61875493,10.4334635 9.7021733,10.4837742 9.78559168,10.5499896 C9.88556389,10.5999757 10.0186438,10.5999757 10.1017376,10.6165295 C10.1017376,10.6327588 10.1179668,10.6499618 10.1179668,10.6665156 L10.1179668,10.7496094 C10.0679807,10.7658387 10.0514269,10.7827171 10.0183192,10.7995955 L10.01767,10.799271 Z M9.36849982,10.6824203 L8.75276188,10.1832084 C8.78619414,10.2166407 9.35194598,10.6824203 9.36849982,10.6824203 Z" id="Shape" fill="#D4DB34"></path>
            </g>
        </g>
    </g>
</svg>