<?xml version="1.0" encoding="UTF-8"?>
<svg width="277px" height="209px" viewBox="0 0 277 209" version="1.1" xmlns="http://www.w3.org/2000/svg" xmlns:xlink="http://www.w3.org/1999/xlink">
    <!-- Generator: Sketch 57.1 (83088) - https://sketch.com -->
    <title>bobbing-ship</title>
    <desc>Created with Sketch.</desc>
    <g id="Symbols" stroke="none" stroke-width="1" fill="none" fill-rule="evenodd">
        <g id="argh-ship-copy" fill="#F5EEFF">
            <g id="argh-ship">
                <path d="M190.184281,191.5 L82.8157185,191.5 C71.772843,180.621383 64.0205088,166.411822 61.1873984,150.5 L52,150.5 C50.3431458,150.5 49,149.156854 49,147.5 L49,122.5 C49,120.843146 50.3431458,119.5 52,119.5 L93,119.5 C95.209139,119.5 97,121.290861 97,123.5 L97,137.5 L133,137.5 L133,113.5 L103.071522,113.5 C108.681684,105.811102 112,96.2913226 112,85.983871 C112,75.2395348 108.394427,65.3510574 102.345883,57.5 L133,57.5 L133,51.5 L117.093888,51.5 C120.30215,47.0628477 122.203673,41.5447334 122.203673,35.5645161 C122.203673,29.5261929 120.265019,23.9589961 117,19.5 L133,19.5 L133,14.0510204 L116.5,9 L141,1 L141,19.5 L149.781934,19.5 C153.766569,23.8306147 156.203673,29.6357035 156.203673,36.016129 C156.203673,41.9024263 154.129432,47.2990494 150.679439,51.5 L141,51.5 L141,57.5 L161.62817,57.5 C168.684295,65.0785756 173,75.2374811 173,86.4032258 C173,96.704246 169.326866,106.148337 163.217503,113.5 L141,113.5 L141,137.5 L170,137.5 L170,135.751865 C170,133.300532 171.777139,131.210698 174.196622,130.816829 L211.839324,124.688947 C212.384433,124.600209 212.898269,124.97017 212.987007,125.515279 C212.995655,125.5684 213,125.622134 213,125.675954 L213,139.5 L212.959922,139.5 C212.30696,159.837149 203.716136,178.169425 190.184281,191.5 L190.184281,191.5 Z" id="Path"></path>
            </g>
        </g>
    </g>
</svg>