<?xml version="1.0" encoding="UTF-8"?>
<svg width="277px" height="209px" viewBox="0 0 277 209" version="1.1" xmlns="http://www.w3.org/2000/svg" xmlns:xlink="http://www.w3.org/1999/xlink">
    <!-- Generator: Sketch 57.1 (83088) - https://sketch.com -->
    <title>bobbing-ship-water</title>
    <desc>Created with Sketch.</desc>
    <g id="Symbols" stroke="none" stroke-width="1" fill="none" fill-rule="evenodd">
        <g id="argh-ship-copy" fill="#B375FF">
            <g id="argh-ship">
                <ellipse id="Oval" cx="138.5" cy="189" rx="138.5" ry="19.5"></ellipse>
            </g>
        </g>
    </g>
</svg>