<?xml version="1.0" encoding="UTF-8"?>
<svg width="42px" height="24px" viewBox="0 0 42 24" version="1.1" xmlns="http://www.w3.org/2000/svg" xmlns:xlink="http://www.w3.org/1999/xlink">
    <!-- Generator: Sketch 57.1 (83088) - https://sketch.com -->
    <title>Group 2</title>
    <desc>Created with Sketch.</desc>
    <g id="Symbols" stroke="none" stroke-width="1" fill="none" fill-rule="evenodd">
        <g id="ship-bubble">
            <g id="Group-2">
                <g>
                    <g id="Group-3" transform="translate(10.000000, 0.000000)">
                        <ellipse id="Oval" fill="#ECDDFF" transform="translate(16.000000, 22.000000) scale(-1, 1) translate(-16.000000, -22.000000) " cx="16" cy="22" rx="16" ry="2"></ellipse>
                        <path d="M23.3567154,22 L10.9176747,22 C9.63831718,20.7436768 8.7401809,19.1026776 8.41195469,17.2650919 L7.34756098,17.2650919 C7.15560835,17.2650919 7,17.1099779 7,16.9186352 L7,14.0314961 C7,13.8401533 7.15560835,13.6850394 7.34756098,13.6850394 L12.097561,13.6850394 C12.3534978,13.6850394 12.5609756,13.891858 12.5609756,14.1469816 L12.5609756,15.7637795 L16.7317073,15.7637795 L16.7317073,12.992126 L13.2643837,12.992126 C13.9143414,12.1041693 14.2987805,11.0047722 14.2987805,9.8144103 C14.2987805,8.57359457 13.8810616,7.43161818 13.1803157,6.52493438 L16.7317073,6.52493438 L16.7317073,5.832021 L14.888926,5.832021 C15.260615,5.31959397 15.4809133,4.68233141 15.4809133,3.99170265 C15.4809133,3.29436349 15.2563132,2.65143262 14.8780488,2.13648294 L16.7317073,2.13648294 L16.7317073,1.50720446 L14.820122,0.923884514 L17.6585366,0 L17.6585366,2.13648294 L18.6759557,2.13648294 C19.1375903,2.63660642 19.4199377,3.30701038 19.4199377,4.04385742 C19.4199377,4.72363978 19.1796293,5.34687185 18.779935,5.832021 L17.6585366,5.832021 L17.6585366,6.52493438 L20.0483856,6.52493438 C20.8658635,7.40015047 21.3658537,8.5733574 21.3658537,9.86283973 C21.3658537,11.0524589 20.9403076,12.143115 20.2325156,12.992126 L17.6585366,12.992126 L17.6585366,15.7637795 L21.0182927,15.7637795 L21.0182927,15.5618952 C21.0182927,15.2788016 21.2241807,15.037456 21.5044867,14.9919698 L25.8655315,14.2842879 C25.9286844,14.2740398 25.988214,14.316765 25.9984947,14.3797172 C25.9994966,14.385852 26,14.3920574 26,14.398273 L26,15.9947507 L25.9953568,15.9947507 C25.9197088,18.3433978 24.9244304,20.460511 23.3567154,22 L23.3567154,22 Z" id="Path" fill="#B375FF" transform="translate(16.500000, 11.000000) scale(-1, 1) translate(-16.500000, -11.000000) "></path>
                    </g>
                    <path d="M0,0 C6.02155109,0 11.0072103,4.43518041 11.8684456,10.2170092 L19,12 L11.8682968,13.7839898 C11.021227,19.4674319 6.18886376,23.8494246 0.304974784,23.9962001 L0,24 L0,0 Z" id="Path" fill="#27261E"></path>
                </g>
            </g>
        </g>
    </g>
</svg>