<?xml version="1.0" encoding="UTF-8"?>
<svg width="1440px" height="464px" viewBox="0 0 1440 464" version="1.1" xmlns="http://www.w3.org/2000/svg" xmlns:xlink="http://www.w3.org/1999/xlink">
    <!-- Generator: Sketch 58 (84663) - https://sketch.com -->
    <title>signed-in-wave copy</title>
    <desc>Created with Sketch.</desc>
    <g id="Page-1" stroke="none" stroke-width="1" fill="none" fill-rule="evenodd" fill-opacity="0.5">
        <g id="signed-in-wave-copy" fill="#F5EEFF" fill-rule="nonzero">
            <path d="M0,0 C81,0 172.5,149 309.5,149 C446.5,149 482,74 671,74 C860,74 907.5,211.5 1026,211.5 C1144.5,211.5 1144.5,149 1248,149 C1351.5,149 1355.5,220.5 1440,220.5 C1440,221.5 1440,302.666667 1440,464 L0,464 L0,0 Z" id="Path"></path>
        </g>
    </g>
</svg>