<?xml version="1.0" encoding="UTF-8"?>
<svg width="60px" height="60px" viewBox="0 0 60 60" version="1.1" xmlns="http://www.w3.org/2000/svg" xmlns:xlink="http://www.w3.org/1999/xlink">
    <!-- Generator: Sketch 62 (91390) - https://sketch.com -->
    <title>Logo-60x60</title>
    <desc>Created with Sketch.</desc>
    <g id="Logo-60x60" stroke="none" stroke-width="1" fill="none" fill-rule="evenodd">
        <g id="Logo-24x40" transform="translate(18.000000, 10.000000)" fill="#000000">
            <g id="Group-3">
                <path d="M9,0 L9,7 L15,7 L15,0 L24,0 L24,24 L15,24 L15,15 L9,15 L9,24 L0,24 L0,0 L9,0 Z M22,2 L17,2 L17,9 L7,9 L7,2 L2,2 L2,22 L7,22 L7,13 L17,13 L17,22 L22,22 L22,2 Z" id="Path" fill-rule="nonzero"></path>
                <rect id="Rectangle-Copy-2" x="0" y="34" width="24" height="6"></rect>
            </g>
        </g>
    </g>
</svg>