<?xml version="1.0" encoding="UTF-8"?>
<svg width="170px" height="90px" viewBox="0 0 170 90" version="1.1" xmlns="http://www.w3.org/2000/svg" xmlns:xlink="http://www.w3.org/1999/xlink">
    <!-- Generator: Sketch 62 (91390) - https://sketch.com -->
    <title>Logo-178h</title>
    <desc>Created with Sketch.</desc>
    <g id="Logo-178h" stroke="none" stroke-width="1" fill="none" fill-rule="evenodd">
        <g id="Logo-24x40" transform="translate(81.000000, 65.000000)" fill="#000000">
            <g id="Group-3">
                <path d="M3.375,0 L3.375,2.625 L5.625,2.625 L5.625,0 L9,0 L9,9 L5.625,9 L5.625,5.625 L3.375,5.625 L3.375,9 L0,9 L0,0 L3.375,0 Z M8.25,0.75 L6.375,0.75 L6.375,3.375 L2.625,3.375 L2.625,0.75 L0.75,0.75 L0.75,8.25 L2.625,8.25 L2.625,4.875 L6.375,4.875 L6.375,8.25 L8.25,8.25 L8.25,0.75 Z" id="Path" fill-rule="nonzero"></path>
                <rect id="Rectangle-Copy-2" x="0" y="12.75" width="9" height="2.25"></rect>
            </g>
        </g>
    </g>
</svg>