<?xml version="1.0" encoding="UTF-8"?>
<svg width="984px" height="600px" viewBox="0 0 984 600" version="1.1" xmlns="http://www.w3.org/2000/svg" xmlns:xlink="http://www.w3.org/1999/xlink">
    <!-- Generator: Sketch 62 (91390) - https://sketch.com -->
    <title>zigzag</title>
    <desc>Created with Sketch.</desc>
    <g id="zigzag" stroke="none" stroke-width="1" fill="none" fill-rule="evenodd">
        <rect fill="#F7F7FF" x="0" y="0" width="984" height="600"></rect>
        <g id="Group-2" transform="translate(-358.000000, -470.000000)">
            <g id="Group-3">
                <g id="Group" transform="translate(579.500000, 766.500000) rotate(90.000000) translate(-579.500000, -766.500000) translate(123.000000, 187.000000)" fill-rule="nonzero">
                    <rect id="Rectangle-Copy-4" fill="#E6E8E6" transform="translate(637.000000, 846.281274) rotate(-38.000000) translate(-637.000000, -846.281274) " x="533.5" y="530.781274" width="207" height="631"></rect>
                    <rect id="Rectangle-Copy-3" fill="#231F20" transform="translate(517.000000, 846.281274) rotate(-38.000000) translate(-517.000000, -846.281274) " x="413.5" y="530.781274" width="207" height="631"></rect>
                    <rect id="Rectangle-Copy-2" fill="#4D5061" transform="translate(397.000000, 846.281274) rotate(-38.000000) translate(-397.000000, -846.281274) " x="293.5" y="530.781274" width="207" height="631"></rect>
                    <rect id="Rectangle-Copy" fill="#E7E247" transform="translate(276.721532, 846.281274) rotate(-38.000000) translate(-276.721532, -846.281274) " x="173.221532" y="530.781274" width="207" height="631"></rect>
                    <rect id="Rectangle" fill="#E7E247" x="120" y="0" width="120" height="631"></rect>
                    <rect id="Rectangle" fill="#4D5061" x="240" y="0" width="120" height="631"></rect>
                    <rect id="Rectangle" fill="#231F20" x="360" y="0" width="120" height="631"></rect>
                    <rect id="Rectangle" fill="#E6E8E6" x="480" y="0" width="120" height="631"></rect>
                    <rect id="Rectangle" fill="#F7F7FF" x="600" y="0" width="120" height="631"></rect>
                </g>
                <g id="Group-Copy" transform="translate(1102.500000, 515.000000) scale(-1, 1) rotate(90.000000) translate(-1102.500000, -515.000000) translate(588.000000, -47.000000)"></g>
                <rect id="Rectangle-Copy-4" fill="#E6E8E6" fill-rule="nonzero" transform="translate(1351.781274, 637.278468) scale(-1, -1) rotate(-128.000000) translate(-1351.781274, -637.278468) " x="1248.28127" y="321.778468" width="207" height="631"></rect>
                <rect id="Rectangle-Copy-3" fill="#231F20" fill-rule="nonzero" transform="translate(1351.781274, 517.278468) scale(-1, -1) rotate(-128.000000) translate(-1351.781274, -517.278468) " x="1248.28127" y="201.778468" width="207" height="631"></rect>
                <rect id="Rectangle-Copy-2" fill="#4D5061" fill-rule="nonzero" transform="translate(1351.781274, 397.278468) scale(-1, -1) rotate(-128.000000) translate(-1351.781274, -397.278468) " x="1248.28127" y="81.7784678" width="207" height="631"></rect>
                <rect id="Rectangle-Copy" fill="#E7E247" fill-rule="nonzero" transform="translate(1351.781274, 277.000000) scale(-1, -1) rotate(-128.000000) translate(-1351.781274, -277.000000) " x="1248.28127" y="-38.5" width="207" height="631"></rect>
                <rect id="Rectangle" fill="#E7E247" fill-rule="nonzero" transform="translate(856.000000, 489.500000) scale(-1, 1) rotate(90.000000) translate(-856.000000, -489.500000) " x="796" y="174" width="120" height="631"></rect>
                <rect id="Rectangle" fill="#4D5061" fill-rule="nonzero" transform="translate(856.000000, 609.500000) scale(-1, 1) rotate(90.000000) translate(-856.000000, -609.500000) " x="796" y="294" width="120" height="631"></rect>
                <rect id="Rectangle" fill="#231F20" fill-rule="nonzero" transform="translate(856.000000, 729.500000) scale(-1, 1) rotate(90.000000) translate(-856.000000, -729.500000) " x="796" y="414" width="120" height="631"></rect>
                <rect id="Rectangle" fill="#E6E8E6" fill-rule="nonzero" transform="translate(856.000000, 849.500000) scale(-1, 1) rotate(90.000000) translate(-856.000000, -849.500000) " x="796" y="534" width="120" height="631"></rect>
                <rect id="Rectangle" fill="#F7F7FF" fill-rule="nonzero" transform="translate(856.000000, 969.500000) scale(-1, 1) rotate(90.000000) translate(-856.000000, -969.500000) " x="796" y="654" width="120" height="631"></rect>
            </g>
            <polygon id="Shape" fill-opacity="0.1" fill="#000000" points="1342 431 1342 776 1172 908.819 1172 431"></polygon>
        </g>
        <rect id="Rectangle-Copy-5" fill-opacity="0.1" fill="#FFFFFF" x="-2.84217094e-14" y="0" width="170" height="600"></rect>
    </g>
</svg>