{
  "@quasar/qcalendar": {},
  "@quasar/icon-genie": {
    "minify_dev": "pngquant",
    "minify_build": "zopfli",
    "cordova": {
      "background_color": "#ffffff",
      "splashscreen_type": "generate"
    },
    "build_always": false,
    "__internal": {
      "dev": {
        "pwa": {
          "iconHash": "87359718659a5f87e828068634c8b4d7"
        },
        "spa": {
          "iconHash": "87359718659a5f87e828068634c8b4d7"
        },
        "capacitor": {
          "iconHash": "87359718659a5f87e828068634c8b4d7",
          "splashscreenHash": false,
          "splashscreenType": "generate",
          "backgroundColor": "#ffffff"
        }
      },
      "build": {
        "pwa": {
          "iconHash": "87359718659a5f87e828068634c8b4d7"
        },
        "capacitor": {
          "iconHash": "87359718659a5f87e828068634c8b4d7",
          "splashscreenHash": false,
          "splashscreenType": "generate",
          "backgroundColor": "#ffffff"
        },
        "spa": {
          "iconHash": "87359718659a5f87e828068634c8b4d7"
        },
        "electron": {
          "iconHash": "87359718659a5f87e828068634c8b4d7"
        }
      }
    }
  },
  "@quasar/qoverlay": {}
}