<?xml version="1.0" encoding="UTF-8"?>
<svg width="368px" height="96px" viewBox="0 0 368 96" version="1.1" xmlns="http://www.w3.org/2000/svg" xmlns:xlink="http://www.w3.org/1999/xlink">
    <!-- Generator: Sketch 58 (84663) - https://sketch.com -->
    <title>top-circle</title>
    <desc>Created with Sketch.</desc>
    <defs>
        <rect id="path-1" x="0" y="0" width="368" height="96"></rect>
    </defs>
    <g id="Symbols" stroke="none" stroke-width="1" fill="none" fill-rule="evenodd">
        <g id="top-circle">
            <mask id="mask-2" fill="white">
                <use xlink:href="#path-1"></use>
            </mask>
            <g id="Rectangle"></g>
            <ellipse id="Oval" fill="#B375FF" mask="url(#mask-2)" cx="183.5" cy="-40" rx="191.5" ry="136"></ellipse>
        </g>
    </g>
</svg>