<svg xmlns="http://www.w3.org/2000/svg" width="24" height="24" viewBox="0 0 24 24">
    <path fill="#7F36DA" fill-rule="evenodd" stroke="#7F36DA" stroke-width="2" d="M17.725 21.08l-1.093-6.375 4.632-4.515-6.401-.93L12 3.46l-2.863 5.8-6.4.93 4.631 4.515-1.093 6.375L12 18.07l5.725 3.01z"/>
</svg>
