{
    "initial_powers_of_exponents": {
        "real": [
            -0.8,
            -1.1
        ],
        "complex": []
    },
    "norm_f_minus_h(0,c)": [
        1.3662174310725255,
        1.3662174311541544
    ],
    "difference_norm_given_system_minus_expanded": [
        0.36042672955442434,
        0.36038699290153065
    ],
    "coefficients_of_the_best_polynom_real_exp": [
        -15.164099328490854,
        13.616123649158235
    ],
    "coefficients_of_the_best_polynom_complex_exp": [],
    "powers of exponents": {
        "real": [
            -0.8,
            -1.1
        ],
        "complex": []
    }
}