{
    "initial_powers_of_exponents": {
        "real": [
            -1.9996865079948223,
            -2.9997008694093825
        ],
        "complex": []
    },
    "norm_f_minus_h(0,c)": [
        1.1489485689077354,
        1.141230989783233,
        1.1337474749360283,
        1.1265086850498944,
        1.1195351181581263,
        1.1128088641824827,
        1.1062940336063989,
        1.1000392392592875,
        1.0940192692470365,
        1.0882500070515722,
        1.0827873645605877,
        1.0774414372674406,
        1.0723344368493901,
        1.067442774858263,
        1.0627588602104945,
        1.058275196796579,
        1.0538902331000202,
        1.049930235948778,
        1.0449601089205895,
        1.0423936256953463,
        1.038895712514051,
        1.0355133892094883,
        1.0322841223090338,
        1.029245335680936,
        1.0263445746231996,
        1.023621614830431,
        1.0210022416036377,
        1.0183854293858792,
        1.0162309221929318,
        1.0137360326537226,
        1.0119864990313556,
        1.0097098133526412,
        1.008170223155874,
        1.0065282793589319,
        1.004883818452165,
        1.0032342614603036,
        1.002029674332261,
        1.0007242819707423,
        1.000005392969669,
        1.000000424414829
    ],
    "difference_norm_given_system_minus_expanded": [
        0.1473760170617171,
        0.1398161956728412,
        0.1325086603555179,
        0.12550357138054458,
        0.11856742500415551,
        0.1119009109580138,
        0.10549334676080213,
        0.09936783137845628,
        0.09340659515323768,
        0.08791628778034166,
        0.08234777767651869,
        0.07703784805106983,
        0.07196827264495864,
        0.06713717727821322,
        0.06248117660266672,
        0.05804675412885363,
        0.053693558373608674,
        0.04976890213237639,
        0.04481918827428277,
        0.04231660263867143,
        0.038796877549718056,
        0.035423599299707176,
        0.032209770511286706,
        0.02919440318876787,
        0.026306860020514744,
        0.02358557064621447,
        0.020998425583649505,
        0.018367649528049146,
        0.0162206621001888,
        0.013728629071765974,
        0.011975644790095608,
        0.009704020470188812,
        0.008167350152354924,
        0.006525979862734843,
        0.004882549689708915,
        0.0032340188477215648,
        0.002030573064360275,
        0.0007240331501785491,
        5.896390572468491e-06,
        2.0694913649421665e-07
    ],
    "coefficients_of_the_best_polynom_real_exp": [
        1.9985166421520115,
        3.0014794871278143
    ],
    "coefficients_of_the_best_polynom_complex_exp": [],
    "powers of exponents": {
        "real": [
            -1.9996865079948223,
            -2.9997008694093825
        ],
        "complex": []
    }
}