<?xml version="1.0" encoding="UTF-8" standalone="no"?>
<!DOCTYPE svg PUBLIC "-//W3C//DTD SVG 1.1//EN" "http://www.w3.org/Graphics/SVG/1.1/DTD/svg11.dtd">
<!-- Created with Vectornator (http://vectornator.io/) -->
<svg height="100%" stroke-miterlimit="10" style="fill-rule:nonzero;clip-rule:evenodd;stroke-linecap:round;stroke-linejoin:round;" version="1.1" viewBox="0 0 5472 3072" width="100%" xml:space="preserve" xmlns="http://www.w3.org/2000/svg" xmlns:vectornator="http://vectornator.io" xmlns:xlink="http://www.w3.org/1999/xlink">
<defs/>
<clipPath id="ArtboardFrame">
<rect height="3072" width="5472" x="0" y="0"/>
</clipPath>
<g clip-path="url(#ArtboardFrame)" id="Livello-2" vectornator:layerName="Livello 2">
<path d="M2920.27-72.3514L2862.18 1517.97" fill="none" opacity="1" stroke="#007aff" stroke-linecap="butt" stroke-linejoin="round" stroke-width="10"/>
</g>
<g id="Livello-4" vectornator:layerName="Livello 4">
<path d="M2449.58 1918.56C2429.71 1928.49 2404.62 1911.1 2387.49 1902.54C2325.89 1871.73 2295.72 1815.33 2287.34 1748.31C2284.28 1723.81 2279.98 1686.48 2293.35 1664.19C2334.95 1594.87 2420.18 1556.92 2497.65 1544.01C2530.77 1538.49 2564.58 1539.32 2597.8 1536C2644.82 1531.3 2691.91 1521.18 2740.01 1525.99C2776.72 1529.66 2814.91 1536.62 2852.17 1540.01C2938.22 1547.83 3026.41 1534.83 3112.55 1542.01C3193.68 1548.77 3267.44 1547.89 3346.89 1531.99C3375.86 1526.2 3406.69 1525.7 3435.02 1517.97C3521.41 1494.41 3617.29 1416.23 3617.29 1321.69" fill="none" opacity="1" stroke="#007aff" stroke-linecap="round" stroke-linejoin="round" stroke-width="10"/>
</g>
</svg>
