<?xml version="1.0" encoding="UTF-8" standalone="no"?>
<!DOCTYPE svg PUBLIC "-//W3C//DTD SVG 1.1//EN" "http://www.w3.org/Graphics/SVG/1.1/DTD/svg11.dtd">
<!-- Created with Vectornator (http://vectornator.io/) -->
<svg height="100%" stroke-miterlimit="10" style="fill-rule:nonzero;clip-rule:evenodd;stroke-linecap:round;stroke-linejoin:round;" version="1.1" viewBox="0 0 5472 3648" width="100%" xml:space="preserve" xmlns="http://www.w3.org/2000/svg" xmlns:vectornator="http://vectornator.io" xmlns:xlink="http://www.w3.org/1999/xlink">
<defs/>
<clipPath id="ArtboardFrame">
<rect height="3648" width="5472" x="0" y="0"/>
</clipPath>
<g clip-path="url(#ArtboardFrame)" id="Livello-2" vectornator:layerName="Livello 2">
<path d="M2986.38 4815.3L4327.55 2066.4" fill="none" opacity="1" stroke="#007aff" stroke-linecap="butt" stroke-linejoin="round" stroke-width="10"/>
</g>
<g id="Livello-4" vectornator:layerName="Livello 4">
<path d="M3652.25 2654.23C3543.88 2511.23 3559.76 2177.34 3775.04 2058.81C4006.03 1931.64 4445.58 2035.02 4669.11 2275.56C4848.05 2468.13 4841.38 2813.23 4656.52 2982.3C4593.73 3039.72 4438.89 3136.64 4294.05 3108.24" fill="none" opacity="1" stroke="#007aff" stroke-linecap="round" stroke-linejoin="round" stroke-width="10"/>
</g>
</svg>
