caso carino di super chiusura

ottima approssimazione ellittica
riga risultati

specimen	CUR_EFF_MED		OLD_STY_ANGLE		NEW_ANGLE
a23_c_a_2_e     4.01468477578183e-02    -1.12913121993190e+02   -5.82976466198617e+01
