<?xml version="1.0" encoding="UTF-8" standalone="no"?>
<!DOCTYPE svg PUBLIC "-//W3C//DTD SVG 1.1//EN" "http://www.w3.org/Graphics/SVG/1.1/DTD/svg11.dtd">
<!-- Created with Vectornator (http://vectornator.io/) -->
<svg height="100%" stroke-miterlimit="10" style="fill-rule:nonzero;clip-rule:evenodd;stroke-linecap:round;stroke-linejoin:round;" version="1.1" viewBox="0 0 5472 3648" width="100%" xml:space="preserve" xmlns="http://www.w3.org/2000/svg" xmlns:vectornator="http://vectornator.io" xmlns:xlink="http://www.w3.org/1999/xlink">
<defs/>
<g id="Livello-2" vectornator:layerName="Livello 2">
<path d="M2692.45 2019.36L2581.26 3379.2" fill="none" opacity="1" stroke="#007aff" stroke-linecap="round" stroke-linejoin="round" stroke-width="10"/>
</g>
<g id="Livello-4" vectornator:layerName="Livello 4">
<path d="M2762.35 1785.31C2763.08 1777.32 2748.25 1761.42 2743.74 1754.86C2718.87 1718.76 2695.21 1701.62 2650.29 1693.68C2635.9 1691.14 2621.33 1697.01 2607.06 1698.27C2535.36 1704.62 2498.45 1762.12 2492.25 1829.61C2491.1 1842.19 2487.5 1856.6 2490.45 1869.19C2495.36 1890.12 2507.24 1913.83 2523.04 1929.89C2536.35 1943.43 2562.52 1972.01 2579.04 1980.96C2628.3 2007.65 2683.36 2033.11 2740.63 2008.37C2756.5 2001.51 2769.34 1989.49 2783.06 1979.24C2850.24 1929.1 2895.17 1841.68 2894.04 1756.44C2893.84 1741.42 2889.94 1728.53 2886.3 1714.14C2864.34 1627.28 2805.19 1573.13 2711.7 1584.35C2673.93 1588.89 2632.99 1601.67 2606.02 1629.69C2597.82 1638.2 2588.55 1652.19 2582.83 1662.41C2580.73 1666.18 2578.14 1669.82 2575.71 1673.38C2574.53 1675.11 2570.57 1679.9 2572.18 1678.56C2573.4 1677.54 2574.42 1676.32 2575.54 1675.2" fill="none" opacity="1" stroke="#007aff" stroke-linecap="round" stroke-linejoin="round" stroke-width="10"/>
</g>
</svg>
