<?xml version="1.0" encoding="UTF-8" standalone="no"?>
<!DOCTYPE svg PUBLIC "-//W3C//DTD SVG 1.1//EN" "http://www.w3.org/Graphics/SVG/1.1/DTD/svg11.dtd">
<!-- Created with Vectornator (http://vectornator.io/) -->
<svg height="100%" stroke-miterlimit="10" style="fill-rule:nonzero;clip-rule:evenodd;stroke-linecap:round;stroke-linejoin:round;" version="1.1" viewBox="0 0 283.5 283.5" width="100%" xml:space="preserve" xmlns="http://www.w3.org/2000/svg" xmlns:vectornator="http://vectornator.io" xmlns:xlink="http://www.w3.org/1999/xlink">
<defs/>
<clipPath id="ArtboardFrame">
<rect height="283.5" width="283.5" x="0" y="0"/>
</clipPath>
<g clip-path="url(#ArtboardFrame)" id="Livello-1" vectornator:layerName="Livello 1">
<path d="M0.0511968 3.72896C45.0733-18.7821 34.4774 67.9827 49.8237 83.3289C82.0052 115.51 153.271 46.2298 178.657 88.5398C208.298 137.941 105.067 184.418 150.267 244.685C170.934 272.241 230.542 229.81 248.374 218.272C250.035 217.197 280.897 198.075 280.897 201.022" fill="none" opacity="1" stroke="#bf1010" stroke-linecap="butt" stroke-linejoin="miter" stroke-width="6"/>
<path d="M0.769933 145.32L0.769933 281.341" fill="none" opacity="1" stroke="#bf1010" stroke-linecap="butt" stroke-linejoin="miter" stroke-width="6"/>
</g>
</svg>
