<?xml version="1.0" encoding="UTF-8" standalone="no"?>
<!DOCTYPE svg PUBLIC "-//W3C//DTD SVG 1.1//EN" "http://www.w3.org/Graphics/SVG/1.1/DTD/svg11.dtd">
<!-- Created with Vectornator (http://vectornator.io/) -->
<svg height="100%" stroke-miterlimit="10" style="fill-rule:nonzero;clip-rule:evenodd;stroke-linecap:round;stroke-linejoin:round;" version="1.1" viewBox="0 0 5472 3072" width="100%" xml:space="preserve" xmlns="http://www.w3.org/2000/svg" xmlns:vectornator="http://vectornator.io" xmlns:xlink="http://www.w3.org/1999/xlink">
<defs/>
<g id="Livello-2" vectornator:layerName="Livello 2">
<path d="M2338.96 1919.04L3785.99 1052.81" fill="none" opacity="1" stroke="#007aff" stroke-linecap="round" stroke-linejoin="round" stroke-width="10"/>
</g>
<g id="Livello-4" vectornator:layerName="Livello 4">
<path d="M2217.24 2403.27C2254.79 2365.72 2295.39 2325.89 2321.39 2279.09C2341.13 2243.56 2350.4 2199.59 2361.45 2160.91C2369.54 2132.6 2375.19 2098.58 2371.47 2068.78C2365.1 2017.86 2336.96 1979.42 2319.39 1932.58C2306.09 1897.12 2303.99 1865.26 2279.33 1834.44C2249.22 1796.8 2213.01 1783.77 2171.17 1766.34C2127.54 1748.16 2091.14 1734.29 2042.99 1734.29C2016.9 1734.29 1986.76 1722.58 1960.87 1726.28C1951.46 1727.62 1942.08 1730.74 1932.83 1732.29C1929.28 1732.88 1919.32 1737.16 1922.81 1736.29C1926.91 1735.27 1930.82 1733.62 1934.83 1732.29" fill="none" opacity="1" stroke="#007aff" stroke-linecap="round" stroke-linejoin="round" stroke-width="10"/>
</g>
</svg>
