<?xml version="1.0" encoding="UTF-8" standalone="no"?>
<!DOCTYPE svg PUBLIC "-//W3C//DTD SVG 1.1//EN" "http://www.w3.org/Graphics/SVG/1.1/DTD/svg11.dtd">
<!-- Created with Vectornator (http://vectornator.io/) -->
<svg height="100%" stroke-miterlimit="10" style="fill-rule:nonzero;clip-rule:evenodd;stroke-linecap:round;stroke-linejoin:round;" version="1.1" viewBox="0 0 5472 3072" width="100%" xml:space="preserve" xmlns="http://www.w3.org/2000/svg" xmlns:vectornator="http://vectornator.io" xmlns:xlink="http://www.w3.org/1999/xlink">
<defs/>
<g id="Livello-2" vectornator:layerName="Livello 2">
<path d="M1323.62 1819.99L2702.27 1598.52" fill="none" opacity="1" stroke="#007aff" stroke-linecap="round" stroke-linejoin="round" stroke-width="10"/>
</g>
<g id="Livello-4" vectornator:layerName="Livello 4">
<path d="M2679.92 1233.56C2679.92 1336.29 2670.61 1439.59 2679.92 1542.01C2687.23 1622.45 2716.28 1704.02 2746.01 1778.35C2767.97 1833.25 2783.1 1891.94 2800.09 1948.6C2804.98 1964.88 2808.73 1981.78 2812.11 1998.68C2813.32 2004.71 2814.73 2010.71 2816.12 2016.7C2817.03 2020.66 2816.3 2032.35 2818.12 2028.72C2819.35 2026.26 2819.46 2023.38 2820.12 2020.71" fill="none" opacity="1" stroke="#007aff" stroke-linecap="round" stroke-linejoin="round" stroke-width="10"/>
</g>
</svg>
