<?xml version="1.0" encoding="UTF-8" standalone="no"?>
<!DOCTYPE svg PUBLIC "-//W3C//DTD SVG 1.1//EN" "http://www.w3.org/Graphics/SVG/1.1/DTD/svg11.dtd">
<!-- Created with Vectornator (http://vectornator.io/) -->
<svg height="100%" stroke-miterlimit="10" style="fill-rule:nonzero;clip-rule:evenodd;stroke-linecap:round;stroke-linejoin:round;" version="1.1" viewBox="0 0 3648 2048" width="100%" xml:space="preserve" xmlns="http://www.w3.org/2000/svg" xmlns:vectornator="http://vectornator.io" xmlns:xlink="http://www.w3.org/1999/xlink">
<defs/>
<g id="Livello-2" vectornator:layerName="Livello 2">
<path d="M1906.06 902.48L2432.28 840.226" fill="none" opacity="1" stroke="#007aff" stroke-linecap="round" stroke-linejoin="round" stroke-width="10"/>
</g>
<g id="Livello-4" vectornator:layerName="Livello 4">
<path d="M1780.5 671.062C1793.87 653.58 1795.62 651.287 1800.04 647.753C1823.64 628.876 1857.78 615.645 1886.76 624.101C1927.9 636.098 1929.65 695.769 1933.73 732.42C1937.07 762.482 1937.47 792.712 1930.98 821.887C1927.2 838.93 1925.16 849.652 1908.36 869.534C1899.53 879.986 1907.61 892.325 1905.96 905.526C1904.73 915.392 1900.48 930.892 1903.56 950.088C1908.53 981.02 1928.49 1007.13 1946.75 1029.96C1962 1049.01 1995.43 1077.26 1975.2 1118.39C1966.14 1136.82 1922.88 1141.18 1904.93 1138.62C1898.66 1137.72 1885.05 1133.48 1871.68 1119.77" fill="none" opacity="1" stroke="#007aff" stroke-linecap="round" stroke-linejoin="round" stroke-width="10"/>
</g>
</svg>
