<?xml version="1.0" encoding="UTF-8" standalone="no"?>
<!DOCTYPE svg PUBLIC "-//W3C//DTD SVG 1.1//EN" "http://www.w3.org/Graphics/SVG/1.1/DTD/svg11.dtd">
<!-- Created with Vectornator (http://vectornator.io/) -->
<svg height="100%" stroke-miterlimit="10" style="fill-rule:nonzero;clip-rule:evenodd;stroke-linecap:round;stroke-linejoin:round;" version="1.1" viewBox="0 0 5472 3648" width="100%" xml:space="preserve" xmlns="http://www.w3.org/2000/svg" xmlns:vectornator="http://vectornator.io" xmlns:xlink="http://www.w3.org/1999/xlink">
<defs/>
<g id="Livello-2" vectornator:layerName="Livello 2">
<path d="M2692.45 2019.36L2581.26 3379.2" fill="none" opacity="1" stroke="#007aff" stroke-linecap="round" stroke-linejoin="round" stroke-width="10" vectornator:layerName="path"/>
</g>
<g id="Livello-4" vectornator:layerName="Livello 4">
<path d="M2437.89 2173.23C2465.73 2248.1 2559.26 2306.89 2673.3 2313.64C2813.29 2321.93 2931.14 2248.69 2936.54 2150.06C2941.94 2051.43 2832.85 1964.75 2692.86 1956.47C2581.69 1933.35 2472.82 1985.26 2452.43 2072.67C2432.03 2160.07 2507.83 2249.9 2621.73 2273.29C2691.21 2287.55 2758.83 2273.8 2805.63 2241.06" fill="none" opacity="1" stroke="#007aff" stroke-linecap="butt" stroke-linejoin="round" stroke-width="10" vectornator:layerName="Curva 3"/>
</g>
</svg>
