<?xml version="1.0" encoding="UTF-8" standalone="no"?>
<!DOCTYPE svg PUBLIC "-//W3C//DTD SVG 1.1//EN" "http://www.w3.org/Graphics/SVG/1.1/DTD/svg11.dtd">
<!-- Created with Vectornator (http://vectornator.io/) -->
<svg height="100%" stroke-miterlimit="10" style="fill-rule:nonzero;clip-rule:evenodd;stroke-linecap:round;stroke-linejoin:round;" version="1.1" viewBox="0 0 3670 5496" width="100%" xml:space="preserve" xmlns="http://www.w3.org/2000/svg" xmlns:vectornator="http://vectornator.io" xmlns:xlink="http://www.w3.org/1999/xlink">
<defs/>
<g id="Livello-2" vectornator:layerName="Livello 2">
<path d="M1375.81 4587.74L1907.34 2963.2" fill="none" opacity="1" stroke="#007aff" stroke-linecap="round" stroke-linejoin="round" stroke-width="10"/>
</g>
<g id="Livello-4" vectornator:layerName="Livello 4">
<path d="M1869.73 4799.29C1850.55 4782.85 1829.02 4770.37 1809.69 4754.26C1760.03 4712.88 1700.96 4660.6 1637.07 4643.56C1592.18 4631.59 1542.7 4619.74 1496.36 4617.3C1423.29 4613.45 1347.85 4614.21 1278.72 4585.4C1251.42 4574.03 1230.96 4554.24 1205.54 4540.37C1162.23 4516.75 1120.66 4483.91 1074.21 4465.32C1041.88 4452.39 1008.7 4448.68 974.767 4444.68C938.007 4440.36 901.106 4452.19 865.946 4452.19C863.149 4452.19 870.949 4454.69 873.45 4455.94" fill="none" opacity="1" stroke="#007aff" stroke-linecap="round" stroke-linejoin="round" stroke-width="10"/>
</g>
</svg>
