<?xml version="1.0" encoding="UTF-8" standalone="no"?>
<!DOCTYPE svg PUBLIC "-//W3C//DTD SVG 1.1//EN" "http://www.w3.org/Graphics/SVG/1.1/DTD/svg11.dtd">
<!-- Created with Vectornator (http://vectornator.io/) -->
<svg height="100%" stroke-miterlimit="10" style="fill-rule:nonzero;clip-rule:evenodd;stroke-linecap:round;stroke-linejoin:round;" version="1.1" viewBox="0 0 595.35 841.995" width="100%" xml:space="preserve" xmlns="http://www.w3.org/2000/svg" xmlns:vectornator="http://vectornator.io" xmlns:xlink="http://www.w3.org/1999/xlink">
<defs/>
<g id="Livello-1" vectornator:layerName="Livello 1">
<path d="M299.936 255.461C396.324 255.461 474.461 333.599 474.461 429.986" fill="none" opacity="1" stroke="#bf1010" stroke-linecap="butt" stroke-linejoin="miter" stroke-width="6"/>
<path d="M165.291 255.312L165.702 434.976" fill="none" opacity="1" stroke="#bf1010" stroke-linecap="butt" stroke-linejoin="miter" stroke-width="6"/>
</g>
</svg>
