<?xml version="1.0" encoding="UTF-8" standalone="no"?>
<!DOCTYPE svg PUBLIC "-//W3C//DTD SVG 1.1//EN" "http://www.w3.org/Graphics/SVG/1.1/DTD/svg11.dtd">
<!-- Created with Vectornator (http://vectornator.io/) -->
<svg height="100%" stroke-miterlimit="10" style="fill-rule:nonzero;clip-rule:evenodd;stroke-linecap:round;stroke-linejoin:round;" version="1.1" viewBox="0 0 3648 2048" width="100%" xml:space="preserve" xmlns="http://www.w3.org/2000/svg" xmlns:vectornator="http://vectornator.io" xmlns:xlink="http://www.w3.org/1999/xlink">
<defs/>
<g id="Livello-2" vectornator:layerName="Livello 2">
<path d="M1519.31 1213.33L2084.92 1150.49" fill="none" opacity="1" stroke="#007aff" stroke-linecap="butt" stroke-linejoin="round" stroke-width="10"/>
</g>
<g id="Livello-4" vectornator:layerName="Livello 4">
<path d="M2131.34 1302.11C2121.77 1276.01 2113.98 1261.69 2109.7 1248.13C2103.47 1228.41 2093.18 1209.87 2087.45 1190.14C2084.88 1181.3 2077.55 1160.28 2075.69 1151.22C2072.18 1134.14 2074.92 1120.69 2074.18 1103.41C2073.28 1082.34 2074.97 1070.52 2075.3 1049.39C2075.64 1027.82 2076.91 1006.16 2078.19 984.61C2078.47 979.837 2078.72 967.846 2079.6 954.549" fill="none" opacity="1" stroke="#007aff" stroke-linecap="round" stroke-linejoin="round" stroke-width="10"/>
</g>
</svg>
