<?xml version="1.0" encoding="UTF-8" standalone="no"?>
<!DOCTYPE svg PUBLIC "-//W3C//DTD SVG 1.1//EN" "http://www.w3.org/Graphics/SVG/1.1/DTD/svg11.dtd">
<!-- Created with Vectornator (http://vectornator.io/) -->
<svg height="100%" stroke-miterlimit="10" style="fill-rule:nonzero;clip-rule:evenodd;stroke-linecap:round;stroke-linejoin:round;" version="1.1" viewBox="0 0 5472 3648" width="100%" xml:space="preserve" xmlns="http://www.w3.org/2000/svg" xmlns:vectornator="http://vectornator.io" xmlns:xlink="http://www.w3.org/1999/xlink">
<defs/>
<g id="Livello-2" vectornator:layerName="Livello 2">
<path d="M2722.04 1878.44L3637.8 910.912" fill="none" opacity="1" stroke="#007aff" stroke-linecap="round" stroke-linejoin="round" stroke-width="10"/>
</g>
<g id="Livello-4" vectornator:layerName="Livello 4">
<path d="M2718.49 1842.88C2729.09 1848.93 2733.6 1859.83 2746.86 1862.24C2779.06 1868.1 2802.37 1837.39 2801.13 1807.7C2799.27 1763.15 2770.79 1736.81 2726.95 1742.79C2717.04 1744.14 2705.99 1748.95 2698.04 1755.06C2674.59 1773.1 2672.67 1813.76 2689.86 1835.24C2692.13 1838.09 2699.92 1844.28 2702.68 1846.43C2714.42 1855.56 2727.32 1862.28 2736.49 1874.52C2746.59 1887.98 2748.58 1905.94 2761.31 1917.88C2770.2 1926.21 2786.57 1929.1 2798.13 1930.15C2820.64 1932.2 2851.3 1922.21 2863.31 1901.79C2868.81 1892.44 2872.63 1871.06 2873.13 1860.61C2874.7 1827.61 2864.45 1792.2 2839.86 1767.61" fill="none" opacity="1" stroke="#007aff" stroke-linecap="round" stroke-linejoin="round" stroke-width="10"/>
</g>
</svg>
