<?xml version="1.0" encoding="UTF-8" standalone="no"?>
<!DOCTYPE svg PUBLIC "-//W3C//DTD SVG 1.1//EN" "http://www.w3.org/Graphics/SVG/1.1/DTD/svg11.dtd">
<!-- Created with Vectornator (http://vectornator.io/) -->
<svg height="100%" stroke-miterlimit="10" style="fill-rule:nonzero;clip-rule:evenodd;stroke-linecap:round;stroke-linejoin:round;" version="1.1" viewBox="0 0 5472 3072" width="100%" xml:space="preserve" xmlns="http://www.w3.org/2000/svg" xmlns:vectornator="http://vectornator.io" xmlns:xlink="http://www.w3.org/1999/xlink">
<defs/>
<clipPath id="ArtboardFrame">
<rect height="3072" width="5472" x="0" y="0"/>
</clipPath>
<g clip-path="url(#ArtboardFrame)" id="Livello-2" vectornator:layerName="Livello 2">
<path d="M2525.45 729.911L2798.47-3618.75" fill="none" opacity="1" stroke="#007aff" stroke-linecap="butt" stroke-linejoin="round" stroke-width="10" vectornator:layerName="path"/>
</g>
<g id="Livello-3" vectornator:layerName="Livello 3">
<path d="M2338.72 1911.29C2274.93 1886.87 2213.97 1851.4 2158.73 1804.68C1901.11 1586.8 1865.42 1206.73 2079.02 955.773C2292.63 704.81 2674.63 677.995 2932.26 895.887C3007.57 959.583 3063.91 1037.15 3100.61 1121.29C3100.61 1121.29 3063.08 1017.62 3091.49 1105.15C3116.05 1180.81 3111.97 1259.45 3084.68 1332.94C3035.26 1466.03 2909.71 1582.18 2740.26 1632.98C2477.25 1711.82 2208.08 1603.33 2139.05 1390.66C2094.15 1252.32 2144.99 1103.98 2258.4 995.489" fill="none" opacity="1" stroke="#007aff" stroke-linecap="butt" stroke-linejoin="round" stroke-width="10" vectornator:layerName="path"/>
</g>
</svg>
