<?xml version="1.0" encoding="UTF-8" standalone="no"?>
<!DOCTYPE svg PUBLIC "-//W3C//DTD SVG 1.1//EN" "http://www.w3.org/Graphics/SVG/1.1/DTD/svg11.dtd">
<!-- Created with Vectornator (http://vectornator.io/) -->
<svg height="100%" stroke-miterlimit="10" style="fill-rule:nonzero;clip-rule:evenodd;stroke-linecap:round;stroke-linejoin:round;" version="1.1" viewBox="0 0 5472 3072" width="100%" xml:space="preserve" xmlns="http://www.w3.org/2000/svg" xmlns:vectornator="http://vectornator.io" xmlns:xlink="http://www.w3.org/1999/xlink">
<defs/>
<clipPath id="ArtboardFrame">
<rect height="3072" width="5472" x="0" y="0"/>
</clipPath>
<g clip-path="url(#ArtboardFrame)" id="Livello-2" vectornator:layerName="Livello 2">
<path d="M3501.23 400.323L4297.42-4108.12" fill="none" opacity="1" stroke="#007aff" stroke-linecap="round" stroke-linejoin="round" stroke-width="10"/>
</g>
<g id="Livello-4" vectornator:layerName="Livello 4">
<path d="M3291.45 1238.62C3256.4 1252.08 3240.77 1255.25 3180.11 1247.01C3049.48 1229.25 2980.55 1144.43 2950.21 1032.78C2893.45 823.919 3175.19 440.965 3395.34 427.236C3510.23 420.07 3660.74 491.032 3747.71 565.891C3918.93 713.276 4017.46 1183.75 3839.5 1353.49C3731.21 1456.77 3610.11 1536.52 3457.72 1526.05C3411.68 1522.88 3296.07 1482.52 3261.67 1449.57" fill="none" opacity="1" stroke="#007aff" stroke-linecap="round" stroke-linejoin="round" stroke-width="10"/>
</g>
</svg>
