<?xml version="1.0" encoding="UTF-8" standalone="no"?>
<!DOCTYPE svg PUBLIC "-//W3C//DTD SVG 1.1//EN" "http://www.w3.org/Graphics/SVG/1.1/DTD/svg11.dtd">
<!-- Created with Vectornator (http://vectornator.io/) -->
<svg height="100%" stroke-miterlimit="10" style="fill-rule:nonzero;clip-rule:evenodd;stroke-linecap:round;stroke-linejoin:round;" version="1.1" viewBox="0 0 5472 3648" width="100%" xml:space="preserve" xmlns="http://www.w3.org/2000/svg" xmlns:vectornator="http://vectornator.io" xmlns:xlink="http://www.w3.org/1999/xlink">
<defs/>
<g id="Livello-2" vectornator:layerName="Livello 2">
<path d="M2692.45 2019.36L2581.26 3379.2" fill="none" opacity="1" stroke="#007aff" stroke-linecap="round" stroke-linejoin="round" stroke-width="10" vectornator:layerName="path"/>
</g>
<g id="Livello-4" vectornator:layerName="Livello 4">
<path d="M2888.48 1793.08C2860.78 1728.56 2780.27 1682.97 2686.35 1685.03C2571.06 1687.56 2479.23 1760.92 2481.23 1848.88C2483.24 1936.84 2578.32 2006.1 2693.61 2003.57C2786.25 2016.24 2872.11 1962.46 2883.12 1883.4C2894.14 1804.35 2826.15 1729.94 2731.26 1717.22C2673.37 1709.46 2618.84 1726.45 2582.61 1758.83" fill="none" opacity="1" stroke="#007aff" stroke-linecap="butt" stroke-linejoin="round" stroke-width="10" vectornator:layerName="Curva 3"/>
</g>
</svg>
