<?xml version="1.0" encoding="UTF-8" standalone="no"?>
<!DOCTYPE svg PUBLIC "-//W3C//DTD SVG 1.1//EN" "http://www.w3.org/Graphics/SVG/1.1/DTD/svg11.dtd">
<!-- Created with Vectornator (http://vectornator.io/) -->
<svg height="100%" stroke-miterlimit="10" style="fill-rule:nonzero;clip-rule:evenodd;stroke-linecap:round;stroke-linejoin:round;" version="1.1" viewBox="0 0 3648 5472" width="100%" xml:space="preserve" xmlns="http://www.w3.org/2000/svg" xmlns:vectornator="http://vectornator.io" xmlns:xlink="http://www.w3.org/1999/xlink">
<defs/>
<g id="Livello-2" vectornator:layerName="Livello 2">
<path d="M1544.49 2491.24L2678.2 4040.25" fill="none" opacity="1" stroke="#007aff" stroke-linecap="butt" stroke-linejoin="round" stroke-width="10"/>
</g>
<g id="Livello-4" vectornator:layerName="Livello 4">
<path d="M1320.1 2872.35C1410.74 2932.78 1580.56 2896.25 1589.35 2768.85C1594.81 2689.64 1539.57 2618.11 1520.61 2545.43C1511.93 2512.18 1539.21 2462.24 1572.55 2455.3C1654.03 2438.32 1640.17 2627.84 1719.2 2648.17C1855.67 2683.26 1905.39 2500.07 1793.29 2434.68C1644.33 2347.78 1669.63 2629.76 1782.22 2542.76C1801.99 2527.48 1798.26 2515.64 1788.71 2499.22" fill="none" opacity="1" stroke="#007aff" stroke-linecap="round" stroke-linejoin="round" stroke-width="10"/>
</g>
</svg>
