<?xml version="1.0" encoding="UTF-8" standalone="no"?>
<!DOCTYPE svg PUBLIC "-//W3C//DTD SVG 1.1//EN" "http://www.w3.org/Graphics/SVG/1.1/DTD/svg11.dtd">
<!-- Created with Vectornator (http://vectornator.io/) -->
<svg height="100%" stroke-miterlimit="10" style="fill-rule:nonzero;clip-rule:evenodd;stroke-linecap:round;stroke-linejoin:round;" version="1.1" viewBox="0 0 5472 3648" width="100%" xml:space="preserve" xmlns="http://www.w3.org/2000/svg" xmlns:vectornator="http://vectornator.io" xmlns:xlink="http://www.w3.org/1999/xlink">
<defs/>
<g id="Livello-2" vectornator:layerName="Livello 2">
<path d="M2759.23 1684.37L3621.2 1062.6" fill="none" opacity="1" stroke="#007aff" stroke-linecap="butt" stroke-linejoin="round" stroke-width="10"/>
</g>
<g id="Livello-4" vectornator:layerName="Livello 4">
<path d="M2655.79 1310.65C2650.87 1323.37 2645.7 1336.9 2645.12 1341.83C2641.04 1376.51 2633.64 1416.55 2640.61 1451.38C2654.14 1519.05 2669.96 1590.9 2712.41 1647.51C2729.11 1669.78 2753.44 1686.61 2774.37 1704.54C2794.14 1721.49 2810.5 1746.97 2826.07 1767.73C2852.16 1802.52 2855.39 1847.95 2849.05 1889.18C2846.98 1902.64 2840.73 1915.24 2834.69 1927.34C2832.95 1930.81 2822.03 1946.05 2827.71 1944.16" fill="none" opacity="1" stroke="#007aff" stroke-linecap="round" stroke-linejoin="round" stroke-width="10"/>
</g>
</svg>
