<?xml version="1.0" encoding="UTF-8" standalone="no"?>
<!DOCTYPE svg PUBLIC "-//W3C//DTD SVG 1.1//EN" "http://www.w3.org/Graphics/SVG/1.1/DTD/svg11.dtd">
<!-- Created with Vectornator (http://vectornator.io/) -->
<svg height="100%" stroke-miterlimit="10" style="fill-rule:nonzero;clip-rule:evenodd;stroke-linecap:round;stroke-linejoin:round;" version="1.1" viewBox="0 0 3648 2048" width="100%" xml:space="preserve" xmlns="http://www.w3.org/2000/svg" xmlns:vectornator="http://vectornator.io" xmlns:xlink="http://www.w3.org/1999/xlink">
<defs/>
<g id="Livello-2" vectornator:layerName="Livello 2">
<path d="M1562.68 966.44L2029.31 1128.1" fill="none" opacity="1" stroke="#007aff" stroke-linecap="butt" stroke-linejoin="round" stroke-width="10"/>
</g>
<g id="Livello-4" vectornator:layerName="Livello 4">
<path d="M1663.79 1340.67C1682.72 1325.21 1712.8 1309.28 1736.69 1314.75C1738.86 1315.24 1756.77 1325.42 1758.76 1326.37C1776.89 1334.99 1785.15 1352.99 1807.67 1346.17C1823.51 1341.37 1835.83 1329.36 1847.44 1318.08C1851.09 1314.52 1856.47 1302.81 1860.3 1299.47C1883.81 1278.98 1897.86 1264 1924.1 1232.24C1932.38 1222.23 1939.08 1218.34 1949.51 1210.33C1960.53 1201.85 1975.42 1195.06 1988.57 1190.38C1997.48 1187.21 2011.67 1180.17 2016.97 1171.47C2030.73 1148.85 2029.5 1114.82 2032.06 1089.5C2037.08 1039.92 2039.58 989.413 2040.28 939.679C2040.57 918.97 2039.9 906.466 2034.52 886.373C2031.93 876.711 2030.94 871.05 2026.33 857.54" fill="none" opacity="1" stroke="#007aff" stroke-linecap="round" stroke-linejoin="round" stroke-width="10"/>
</g>
</svg>
