<?xml version="1.0" encoding="UTF-8" standalone="no"?>
<!DOCTYPE svg PUBLIC "-//W3C//DTD SVG 1.1//EN" "http://www.w3.org/Graphics/SVG/1.1/DTD/svg11.dtd">
<!-- Created with Vectornator (http://vectornator.io/) -->
<svg height="100%" stroke-miterlimit="10" style="fill-rule:nonzero;clip-rule:evenodd;stroke-linecap:round;stroke-linejoin:round;" version="1.1" viewBox="0 0 3072 5472" width="100%" xml:space="preserve" xmlns="http://www.w3.org/2000/svg" xmlns:vectornator="http://vectornator.io" xmlns:xlink="http://www.w3.org/1999/xlink">
<defs/>
<g id="Livello-2" vectornator:layerName="Livello 2">
<path d="M1799.61 2511.83L234.365 1748.51" fill="none" opacity="1" stroke="#007aff" stroke-linecap="round" stroke-linejoin="round" stroke-width="10" vectornator:layerName="path"/>
<path d="M2070.63 1972.47C2074.94 1981.08 2072.32 1995.76 2073.93 2005.44C2082.41 2056.3 2077.07 2098.24 2060.74 2147.2C2039.03 2212.33 2011.58 2271.68 1975.03 2330.17C1933.51 2396.6 1873.79 2450.24 1838.21 2521.38C1791.33 2615.15 1778.42 2726.92 1739.31 2824.68C1711.21 2894.93 1649.46 2962.22 1592.61 3010.95C1573.47 3027.35 1553.07 3042.91 1533.26 3058.75C1525.01 3065.36 1505.24 3073.59 1505.24 3073.59C1505.24 3073.59 1514.03 3069.19 1518.43 3067" fill="none" opacity="1" stroke="#007aff" stroke-linecap="round" stroke-linejoin="round" stroke-width="10" vectornator:layerName="Curva 2"/>
</g>
<g id="Livello-4" vectornator:layerName="Livello 4"/>
</svg>
