<?xml version="1.0" encoding="UTF-8" standalone="no"?>
<!DOCTYPE svg PUBLIC "-//W3C//DTD SVG 1.1//EN" "http://www.w3.org/Graphics/SVG/1.1/DTD/svg11.dtd">
<!-- Created with Vectornator (http://vectornator.io/) -->
<svg height="100%" stroke-miterlimit="10" style="fill-rule:nonzero;clip-rule:evenodd;stroke-linecap:round;stroke-linejoin:round;" version="1.1" viewBox="0 0 5472 3072" width="100%" xml:space="preserve" xmlns="http://www.w3.org/2000/svg" xmlns:vectornator="http://vectornator.io" xmlns:xlink="http://www.w3.org/1999/xlink">
<defs/>
<clipPath id="ArtboardFrame">
<rect height="3072" width="5472" x="0" y="0"/>
</clipPath>
<g clip-path="url(#ArtboardFrame)" id="Livello-2" vectornator:layerName="Livello 2">
<path d="M2721.07 1260.36L2952.1-3146.07" fill="none" opacity="1" stroke="#007aff" stroke-linecap="round" stroke-linejoin="round" stroke-width="10"/>
</g>
<g id="Livello-4" vectornator:layerName="Livello 4">
<path d="M2275.47 322.697C2351.03 667.547 2352.96 826.411 2356.84 1000.77C2357.96 1051.13 2342.87 1312.07 2370.4 1353.37C2397.55 1394.1 2742.2 1334.01 2792.74 1330.12C3222.75 1297.05 4001.66 390.505 4125.65 260.702" fill="none" opacity="1" stroke="#007aff" stroke-linecap="round" stroke-linejoin="round" stroke-width="10"/>
</g>
</svg>
