<?xml version="1.0" encoding="UTF-8" standalone="no"?>
<!DOCTYPE svg PUBLIC "-//W3C//DTD SVG 1.1//EN" "http://www.w3.org/Graphics/SVG/1.1/DTD/svg11.dtd">
<!-- Created with Vectornator (http://vectornator.io/) -->
<svg height="100%" stroke-miterlimit="10" style="fill-rule:nonzero;clip-rule:evenodd;stroke-linecap:round;stroke-linejoin:round;" version="1.1" viewBox="0 0 5472 3648" width="100%" xml:space="preserve" xmlns="http://www.w3.org/2000/svg" xmlns:vectornator="http://vectornator.io" xmlns:xlink="http://www.w3.org/1999/xlink">
<defs/>
<clipPath id="ArtboardFrame">
<rect height="3648" width="5472" x="0" y="0"/>
</clipPath>
<g clip-path="url(#ArtboardFrame)" id="Livello-2" vectornator:layerName="Livello 2">
<path d="M803.361 3679.57L2721.79 2185.67" fill="none" opacity="1" stroke="#007aff" stroke-linecap="butt" stroke-linejoin="round" stroke-width="10"/>
</g>
<g id="Livello-4" vectornator:layerName="Livello 4">
<path d="M1866.98 1930.88C1932.21 1906.46 2005.22 1901.07 2055.52 1903.14C2387.35 1916.79 2722.94 2049.86 2855.56 2378.32C2912.05 2518.23 2946.93 2628.66 2956.29 2779.44C2959.44 2830.16 2951.65 2914.08 2917.03 3033.67" fill="none" opacity="1" stroke="#007aff" stroke-linecap="round" stroke-linejoin="round" stroke-width="10"/>
</g>
</svg>
