<?xml version="1.0" encoding="UTF-8" standalone="no"?>
<!DOCTYPE svg PUBLIC "-//W3C//DTD SVG 1.1//EN" "http://www.w3.org/Graphics/SVG/1.1/DTD/svg11.dtd">
<!-- Created with Vectornator (http://vectornator.io/) -->
<svg height="100%" stroke-miterlimit="10" style="fill-rule:nonzero;clip-rule:evenodd;stroke-linecap:round;stroke-linejoin:round;" version="1.1" viewBox="0 0 5472 3648" width="100%" xml:space="preserve" xmlns="http://www.w3.org/2000/svg" xmlns:vectornator="http://vectornator.io" xmlns:xlink="http://www.w3.org/1999/xlink">
<defs/>
<g id="Livello-2" vectornator:layerName="Livello 2">
<path d="M2599.06 1459.06L3509.3 799.461" fill="none" opacity="1" stroke="#007aff" stroke-linecap="round" stroke-linejoin="round" stroke-width="10" vectornator:layerName="path"/>
</g>
<g id="Livello-4" vectornator:layerName="Livello 4">
<path d="M2566.4 1403.87C2564.88 1385.14 2570.19 1370.07 2582.63 1363.29C2606.84 1350.09 2648.86 1373.28 2676.48 1415.09C2704.11 1456.89 2706.88 1501.48 2682.68 1514.68C2660.35 1526.85 2622.87 1508.06 2595.5 1472.26C2576.06 1448.13 2572.17 1421.09 2587.6 1409.81C2604.33 1397.58 2637.42 1408.49 2661.52 1434.19C2685.62 1459.89 2691.59 1490.64 2674.87 1502.87C2666.27 1509.16 2653.35 1509.33 2639.55 1504.53" fill="none" opacity="1" stroke="#0085ff" stroke-linecap="butt" stroke-linejoin="round" stroke-width="7.742" vectornator:layerName="Curva 2"/>
</g>
</svg>
