<?xml version="1.0" encoding="UTF-8" standalone="no"?>
<!DOCTYPE svg PUBLIC "-//W3C//DTD SVG 1.1//EN" "http://www.w3.org/Graphics/SVG/1.1/DTD/svg11.dtd">
<!-- Created with Vectornator (http://vectornator.io/) -->
<svg height="100%" stroke-miterlimit="10" style="fill-rule:nonzero;clip-rule:evenodd;stroke-linecap:round;stroke-linejoin:round;" version="1.1" viewBox="0 0 5496 3670" width="100%" xml:space="preserve" xmlns="http://www.w3.org/2000/svg" xmlns:vectornator="http://vectornator.io" xmlns:xlink="http://www.w3.org/1999/xlink">
<defs/>
<g id="Livello-2" vectornator:layerName="Livello 2">
<path d="M4446.77 861.369L4437.98 2568.46" fill="none" opacity="1" stroke="#007aff" stroke-linecap="round" stroke-linejoin="round" stroke-width="10"/>
</g>
<g id="Livello-4" vectornator:layerName="Livello 4">
<path d="M3722.14 2556.54C3711.88 2505.25 3725.32 2469.13 3756.06 2428.15C3769.58 2410.11 3776.99 2389.93 3797.24 2377.28C3838.6 2351.43 3898.91 2339.89 3947.43 2343.36C4029.72 2349.24 4118.36 2387.85 4182.42 2440.26C4237.53 2485.35 4303.94 2546.34 4373.8 2563.81C4475 2589.11 4577.74 2535.96 4669.34 2503.25C4751.54 2473.89 4828.51 2436.79 4909.17 2403.92C4998.19 2367.66 5091.43 2345.5 5178.07 2302.18" fill="none" opacity="1" stroke="#007aff" stroke-linecap="round" stroke-linejoin="round" stroke-width="10"/>
</g>
</svg>
