,assess,bdrms,lotsize,sqrft,colonial
0,202.4,4.0,4315.0,1535.0,1.0
1,253.6,6.0,5348.0,1386.0,1.0
2,336.5,4.0,8460.0,1915.0,1.0
3,354.9,4.0,9000.0,2066.0,1.0
4,278.5,3.0,6314.0,1662.0,1.0
5,256.8,3.0,5850.0,1536.0,1.0
6,208.0,4.0,5218.0,1732.0,0.0
7,388.6,2.0,20700.0,2205.0,0.0
8,212.1,3.0,5305.0,1171.0,0.0
9,298.7,3.0,6060.0,1925.0,1.0
10,232.9,4.0,3597.0,1760.0,1.0
11,359.5,3.0,8178.0,2186.0,1.0
12,254.0,3.0,5167.0,1980.0,1.0
13,267.4,3.0,6710.0,1932.0,0.0
14,232.0,2.0,6362.0,1185.0,0.0
15,282.3,4.0,5625.0,1780.0,1.0
16,319.1,4.0,6095.0,2514.0,1.0
17,198.7,3.0,5146.0,1408.0,1.0
18,318.8,3.0,7800.0,2124.0,1.0
19,318.3,3.0,6056.0,1837.0,1.0
20,231.8,3.0,4600.0,1448.0,1.0
21,482.0,5.0,15834.0,2617.0,1.0
22,217.8,4.0,4806.0,1573.0,1.0
23,230.7,4.0,5600.0,1674.0,1.0
24,273.3,4.0,7050.0,1656.0,1.0
25,475.5,4.0,8112.0,3733.0,0.0
26,279.8,2.0,15267.0,1478.0,0.0
27,543.6,4.0,11966.0,2638.0,1.0
28,239.7,3.0,9425.0,1440.0,1.0
29,236.1,3.0,6000.0,1767.0,0.0
30,305.6,3.0,7123.0,1774.0,1.0
31,349.1,4.0,6126.0,2438.0,1.0
32,276.2,4.0,5944.0,1928.0,1.0
33,287.0,4.0,6525.0,1850.0,1.0
34,294.2,3.0,6003.0,1768.0,0.0
35,286.4,4.0,5484.0,1664.0,1.0
36,300.2,3.0,6210.0,1731.0,1.0
37,259.4,3.0,5828.0,1715.0,0.0
38,279.3,3.0,6460.0,1899.0,0.0
39,276.3,3.0,4054.0,1736.0,1.0
40,287.5,3.0,6519.0,2312.0,1.0
41,355.3,4.0,9773.0,2051.0,1.0
42,478.1,7.0,8400.0,3529.0,1.0
43,416.5,5.0,7047.0,2634.0,1.0
44,266.7,3.0,5642.0,1376.0,1.0
45,294.3,3.0,5494.0,2048.0,1.0
46,313.9,3.0,6637.0,1972.0,1.0
47,294.1,3.0,6114.0,1932.0,0.0
48,367.8,3.0,9000.0,2067.0,1.0
49,250.7,3.0,6000.0,1536.0,1.0
50,295.2,4.0,92681.0,1696.0,1.0
51,351.5,3.0,9903.0,2076.0,1.0
52,303.8,4.0,5922.0,2000.0,0.0
53,384.3,4.0,8022.0,2321.0,1.0
54,249.8,3.0,18838.0,1294.0,0.0
55,414.5,5.0,8566.0,2754.0,1.0
56,252.5,3.0,5525.0,1502.0,0.0
57,256.3,3.0,2892.0,1890.0,0.0
58,708.6,5.0,31000.0,3662.0,0.0
59,434.0,3.0,12237.0,3375.0,1.0
60,518.1,5.0,15634.0,3880.0,1.0
