[
  {
    "name": "전북 고창 참기름",
    "ename": "Jeonbuk Gochang Sesame Oil",
    "hdate": "2018.08",
    "mdate": "2019.08.30",
    "mprocess": "저온 압착",
    "qc": "HACCP, ISO 22000, 전통식품",
    "info": "참깨의 불포화지방산은 콜레스테롤과 혈압을 낮추는 효과가 있으며, 리그난을 포함한 항산화 물질 및 비타민 E가 풍부합니다. 원적외선으로 볶고, 저온압착으로 짜내어 씨앗이 가진 고유의 영양, 맛과 향만을 그대로 담아 드립니다.",
    "code": "간장맛 통나무",
    "screen": "gochang",
    "map": "gochang",
    "oil": "표현고민중",
    "savor": "표현고민중",
    "finish": "표현고민중",
    "taste": "표현고민중",
    "stemp": "195도",
    "recipe": "샐러드 드레싱",
    "area": "전북 고창군 생산읍",
    "farmer": "김동우 농부님",
    "place": "노지",
    
    "ftemp": "저온보관(4도)",
    
    "fhtemp": "100도"
  },
  {
    "name": "강원 홍천 들기름",
    "ename": "Gangwon Hongcheon Perilla Oil",
    "hdate": "2018.09",
    "mdate": "2019.08.20",
    "mprocess": "저온 압착",
    "qc": "HACCP, ISO 22000, 전통식품",
    "info": "쿠엔즈버킷 들기름은 항산화 물질과 불포화 지방산이 풍부하며 오메가3 지방산이 올리브오일의 50배 이상 들어있어 심혈관계에 좋습니다. 들깨가 가진 영양성분을 그대로 담아낸 신선한 오일입니다.",
    "code": "해리맛 포터",
    "screen": "hongcheon",
    "map": "hongcheon",
    "oil": "표현고민중",
    "savor": "표현고민중",
    "finish": "표현고민중",
    "taste": "표현고민중",
    "stemp": "195도",
    "recipe": "샐러드 드레싱",
    "area": "전북 고창군 생산읍",
    "farmer": "김동우 농부님",
    "place": "노지",
    
    "ftemp": "저온보관(4도)",
    
    "fhtemp": "100도"
  },
  {
    "name": "충북 제천 들기름",
    "ename": "Chungbuk Jecheon Perilla Oil",
    "hdate": "2018.09",
    "mdate": "2019.08.10",
    "mprocess": "저온 압착",
    "qc": "HACCP, ISO 22000, 전통식품",
    "info": "쿠엔즈버킷 들기름은 항산화 물질과 불포화 지방산이 풍부하며 오메가3 지방산이 올리브오일의 50배 이상 들어있어 심혈관계에 좋습니다. 들깨가 가진 영양성분을 그대로 담아낸 신선한 오일입니다.",
    "code": "움직이는 헤드폰",
    "screen": "jecheon",
    "map": "jecheon",
    "oil": "표현고민중",
    "savor": "표현고민중",
    "finish": "표현고민중",
    "taste": "표현고민중",
    "stemp": "195도",
    "recipe": "샐러드 드레싱",
    "area": "전북 고창군 생산읍",
    "farmer": "김동우 농부님",
    "place": "노지",
    
    "ftemp": "저온보관(4도)",
    
    "fhtemp": "100도"
  },
  {
    "name": "전북 고창 생참기름",
    "ename": "Jeonbuk Gochang Raw Sesame Oil",
    "hdate": "2018.08",
    "mdate": "2019.07.30",
    "mprocess": "비가열 압착",
    "qc": "HACCP, ISO 22000, 전통식품",
    "info": "참깨의 불포화지방산은 콜레스테롤과 혈압을 낮추는 효과가 있으며, 리그난을 포함한 항산화 물질 및 비타민 E가 풍부합니다. 볶지 않는 비가열 압착으로 짜내어 씨앗이 가진 고유의 영양, 맛과 향만을 그대로 담아 드립니다.",
    "code": "보드게임 판데믹",
    "screen": "gochang",
    "map": "gochang",
    "oil": "표현고민중",
    "savor": "표현고민중",
    "finish": "표현고민중",
    "taste": "표현고민중",
    "stemp": "195도",
    "recipe": "샐러드 드레싱",
    "area": "전북 고창군 생산읍",
    "farmer": "김동우 농부님",
    "place": "노지",
    
    "ftemp": "저온보관(4도)",
    
    "fhtemp": "100도"
  },
  {
    "name": "강원 홍천 생들기름",
    "ename": "Gangwon Hongcheon Raw Perilla Oil",
    "hdate": "2018.09",
    "mdate": "2019.07.20",
    "mprocess": "비가열 압착",
    "qc": "HACCP, ISO 22000, 전통식품",
    "info": "쿠엔즈버킷 들기름은 항산화 물질과 불포화 지방산이 풍부하며 오메가3 지방산이 올리브오일의 50배 이상 들어있어 심혈관계에 좋습니다. 들깨가 가진 영양성분을 그대로 담아낸 신선한 오일입니다.",
    "code": "물맛 고기",
    "screen": "hongcheon",
    "map": "hongcheon",
    "oil": "표현고민중",
    "oil": "표현고민중",
    "savor": "표현고민중",
    "finish": "표현고민중",
    "taste": "표현고민중",
    "stemp": "195도",
    "recipe": "샐러드 드레싱",
    "area": "전북 고창군 생산읍",
    "farmer": "김동우 농부님",
    "place": "노지",
    
    "ftemp": "저온보관(4도)",
    
    "fhtemp": "100도"
  },
  {
    "name": "충북 제천 생들기름",
    "ename": "Chungbuk Jecheon Raw Perilla Oil",
    "hdate": "2018.09",
    "mdate": "2019.07.20",
    "mprocess": "비가열 압착",
    "qc": "HACCP, ISO 22000, 전통식품",
    "info": "쿠엔즈버킷 들기름은 항산화 물질과 불포화 지방산이 풍부하며 오메가3 지방산이 올리브오일의 50배 이상 들어있어 심혈관계에 좋습니다. 들깨가 가진 영양성분을 그대로 담아낸 신선한 오일입니다.",
    "code": "축구 브라질",
    "screen": "jecheon",
    "map": "jecheon",
    "oil": "표현고민중",
    "savor": "표현고민중",
    "finish": "표현고민중",
    "taste": "표현고민중",
    "stemp": "195도",
    "recipe": "샐러드 드레싱",
    "area": "전북 고창군 생산읍",
    "farmer": "김동우 농부님",
    "place": "노지",
    
    "ftemp": "저온보관(4도)",
    
    "fhtemp": "100도"
  },
  {
    "name": "전북 고창 참기름",
    "ename": "Jeonbuk Gochang Sesame Oil",
    "hdate": "2018.08",
    "mdate": "2019.07.10",
    "mprocess": "저온 압착",
    "qc": "HACCP, ISO 22000, 전통식품",
    "info": "참깨의 불포화지방산은 콜레스테롤과 혈압을 낮추는 효과가 있으며, 리그난을 포함한 항산화 물질 및 비타민 E가 풍부합니다. 원적외선으로 볶고, 저온압착으로 짜내어 씨앗이 가진 고유의 영양, 맛과 향만을 그대로 담아 드립니다.",
    "code": "고구마맛 감자",
    "screen": "gochang",
    "map": "gochang",
    "oil": "표현고민중",
    "savor": "표현고민중",
    "finish": "표현고민중",
    "taste": "표현고민중",
    "stemp": "195도",
    "recipe": "샐러드 드레싱",
    "area": "전북 고창군 생산읍",
    "farmer": "김동우 농부님",
    "place": "노지",
    
    "ftemp": "저온보관(4도)",
    
    "fhtemp": "100도"
  }
]