/*
WARNING: Do NOT edit the input and output ports in this file in a text
editor if you plan to continue editing the block that represents it in
the Block Editor! File corruption is VERY likely to occur.
*/
/*
Copyright (C) 2020  Intel Corporation. All rights reserved.
Your use of Intel Corporation's design tools, logic functions 
and other software and tools, and any partner logic 
functions, and any output files from any of the foregoing 
(including device programming or simulation files), and any 
associated documentation or information are expressly subject 
to the terms and conditions of the Intel Program License 
Subscription Agreement, the Intel Quartus Prime License Agreement,
the Intel FPGA IP License Agreement, or other applicable license
agreement, including, without limitation, that your use is for
the sole purpose of programming logic devices manufactured by
Intel and sold by Intel or its authorized distributors.  Please
refer to the applicable agreement for further details, at
https://fpgasoftware.intel.com/eula.
*/
(header "graphic" (version "1.4"))
(pin
	(input)
	(rect -152 160 16 176)
	(text "INPUT" (rect 125 0 154 10)(font "Arial" (font_size 6)))
	(text "clk50M" (rect 5 0 41 11)(font "Arial" ))
	(pt 168 8)
	(drawing
		(line (pt 84 12)(pt 109 12))
		(line (pt 84 4)(pt 109 4))
		(line (pt 113 8)(pt 168 8))
		(line (pt 84 12)(pt 84 4))
		(line (pt 109 4)(pt 113 8))
		(line (pt 109 12)(pt 113 8))
	)
	(text "VCC" (rect 128 7 149 17)(font "Arial" (font_size 6)))
	(annotation_block (location)(rect -208 176 -152 192))
)
(pin
	(input)
	(rect 1040 328 1208 344)
	(text "INPUT" (rect 125 0 154 10)(font "Arial" (font_size 6)))
	(text "spi_sdo" (rect 5 0 45 11)(font "Arial" ))
	(pt 168 8)
	(drawing
		(line (pt 84 12)(pt 109 12))
		(line (pt 84 4)(pt 109 4))
		(line (pt 113 8)(pt 168 8))
		(line (pt 84 12)(pt 84 4))
		(line (pt 109 4)(pt 113 8))
		(line (pt 109 12)(pt 113 8))
	)
	(text "VCC" (rect 128 7 149 17)(font "Arial" (font_size 6)))
	(annotation_block (location)(rect 968 344 1040 360))
)
(pin
	(input)
	(rect 16 296 184 312)
	(text "INPUT" (rect 125 0 154 10)(font "Arial" (font_size 6)))
	(text "rst_btn" (rect 5 0 41 11)(font "Arial" ))
	(pt 168 8)
	(drawing
		(line (pt 84 12)(pt 109 12))
		(line (pt 84 4)(pt 109 4))
		(line (pt 113 8)(pt 168 8))
		(line (pt 84 12)(pt 84 4))
		(line (pt 109 4)(pt 113 8))
		(line (pt 109 12)(pt 113 8))
	)
	(text "VCC" (rect 128 7 149 17)(font "Arial" (font_size 6)))
)
(pin
	(output)
	(rect 1040 280 1216 296)
	(text "OUTPUT" (rect 1 0 41 10)(font "Arial" (font_size 6)))
	(text "spi_cs" (rect 90 0 123 11)(font "Arial" ))
	(pt 0 8)
	(drawing
		(line (pt 0 8)(pt 52 8))
		(line (pt 52 4)(pt 78 4))
		(line (pt 52 12)(pt 78 12))
		(line (pt 52 12)(pt 52 4))
		(line (pt 78 4)(pt 82 8))
		(line (pt 82 8)(pt 78 12))
		(line (pt 78 12)(pt 82 8))
	)
	(annotation_block (location)(rect 1216 296 1288 312))
)
(pin
	(output)
	(rect 1040 296 1216 312)
	(text "OUTPUT" (rect 1 0 41 10)(font "Arial" (font_size 6)))
	(text "spi_clk" (rect 90 0 125 11)(font "Arial" ))
	(pt 0 8)
	(drawing
		(line (pt 0 8)(pt 52 8))
		(line (pt 52 4)(pt 78 4))
		(line (pt 52 12)(pt 78 12))
		(line (pt 52 12)(pt 52 4))
		(line (pt 78 4)(pt 82 8))
		(line (pt 82 8)(pt 78 12))
		(line (pt 78 12)(pt 82 8))
	)
	(annotation_block (location)(rect 1216 312 1280 328))
)
(pin
	(output)
	(rect 1040 312 1216 328)
	(text "OUTPUT" (rect 1 0 41 10)(font "Arial" (font_size 6)))
	(text "spi_sdi" (rect 90 0 125 11)(font "Arial" ))
	(pt 0 8)
	(drawing
		(line (pt 0 8)(pt 52 8))
		(line (pt 52 4)(pt 78 4))
		(line (pt 52 12)(pt 78 12))
		(line (pt 52 12)(pt 52 4))
		(line (pt 78 4)(pt 82 8))
		(line (pt 82 8)(pt 78 12))
		(line (pt 78 12)(pt 82 8))
	)
	(annotation_block (location)(rect 1216 328 1280 344))
)
(symbol
	(rect 72 96 232 240)
	(text "pll" (rect 74 -1 91 15)(font "Arial" (font_size 10)))
	(text "inst" (rect 8 128 26 139)(font "Arial" ))
	(port
		(pt 0 72)
		(input)
		(text "refclk" (rect 0 0 33 13)(font "Arial" (font_size 8)))
		(text "refclk" (rect 4 61 37 74)(font "Arial" (font_size 8)))
		(line (pt 0 72)(pt 48 72))
	)
	(port
		(pt 0 112)
		(input)
		(text "rst" (rect 0 0 15 13)(font "Arial" (font_size 8)))
		(text "rst" (rect 4 101 19 114)(font "Arial" (font_size 8)))
		(line (pt 0 112)(pt 48 112))
	)
	(port
		(pt 160 72)
		(output)
		(text "outclk_0" (rect 0 0 48 13)(font "Arial" (font_size 8)))
		(text "outclk_0" (rect 117 61 165 74)(font "Arial" (font_size 8)))
		(line (pt 160 72)(pt 112 72))
	)
	(drawing
		(text "refclk" (rect 16 43 51 57)(font "Arial" (color 128 0 0)(font_size 9)))
		(text "clk" (rect 53 67 68 78)(font "Arial" (color 0 0 0)))
		(text "reset" (rect 19 83 53 97)(font "Arial" (color 128 0 0)(font_size 9)))
		(text "reset" (rect 53 107 78 118)(font "Arial" (color 0 0 0)))
		(text "outclk0" (rect 113 43 159 57)(font "Arial" (color 128 0 0)(font_size 9)))
		(text "clk" (rect 97 67 112 78)(font "Arial" (color 0 0 0)))
		(text " altera_pll " (rect 118 128 168 139)(font "Arial" ))
		(line (pt 48 32)(pt 112 32))
		(line (pt 112 32)(pt 112 128))
		(line (pt 48 128)(pt 112 128))
		(line (pt 48 32)(pt 48 128))
		(line (pt 49 52)(pt 49 76))
		(line (pt 50 52)(pt 50 76))
		(line (pt 49 92)(pt 49 116))
		(line (pt 50 92)(pt 50 116))
		(line (pt 111 52)(pt 111 76))
		(line (pt 110 52)(pt 110 76))
		(line (pt 0 0)(pt 160 0))
		(line (pt 160 0)(pt 160 144))
		(line (pt 0 144)(pt 160 144))
		(line (pt 0 0)(pt 0 144))
	)
)
(symbol
	(rect 8 208 40 240)
	(text "GND" (rect 8 16 30 26)(font "Arial" (font_size 6)))
	(text "inst1" (rect 3 21 27 34)(font "Intel Clear" )(invisible))
	(port
		(pt 16 0)
		(output)
		(text "1" (rect 18 0 25 11)(font "Courier New" (bold))(invisible))
		(text "1" (rect 18 0 25 11)(font "Courier New" (bold))(invisible))
		(line (pt 16 8)(pt 16 0))
	)
	(drawing
		(line (pt 8 8)(pt 16 16))
		(line (pt 16 16)(pt 24 8))
		(line (pt 8 8)(pt 24 8))
	)
)
(symbol
	(rect 744 224 936 400)
	(text "spi_master" (rect 5 0 61 11)(font "Arial" ))
	(text "inst5" (rect 8 160 32 173)(font "Intel Clear" ))
	(port
		(pt 0 32)
		(input)
		(text "clk" (rect 0 0 15 11)(font "Arial" ))
		(text "clk" (rect 21 27 36 38)(font "Arial" ))
		(line (pt 0 32)(pt 16 32))
	)
	(port
		(pt 0 48)
		(input)
		(text "rst" (rect 0 0 14 11)(font "Arial" ))
		(text "rst" (rect 21 43 35 54)(font "Arial" ))
		(line (pt 0 48)(pt 16 48))
	)
	(port
		(pt 0 64)
		(input)
		(text "i_start" (rect 0 0 31 11)(font "Arial" ))
		(text "i_start" (rect 21 59 52 70)(font "Arial" ))
		(line (pt 0 64)(pt 16 64))
	)
	(port
		(pt 0 80)
		(input)
		(text "i_rw" (rect 0 0 22 11)(font "Arial" ))
		(text "i_rw" (rect 21 75 43 86)(font "Arial" ))
		(line (pt 0 80)(pt 16 80))
	)
	(port
		(pt 0 96)
		(input)
		(text "i_addr[5..0]" (rect 0 0 55 11)(font "Arial" ))
		(text "i_addr[5..0]" (rect 21 91 76 102)(font "Arial" ))
		(line (pt 0 96)(pt 16 96)(line_width 3))
	)
	(port
		(pt 0 112)
		(input)
		(text "i_data[7..0]" (rect 0 0 55 11)(font "Arial" ))
		(text "i_data[7..0]" (rect 21 107 76 118)(font "Arial" ))
		(line (pt 0 112)(pt 16 112)(line_width 3))
	)
	(port
		(pt 0 128)
		(input)
		(text "spi_sdo" (rect 0 0 40 11)(font "Arial" ))
		(text "spi_sdo" (rect 21 123 61 134)(font "Arial" ))
		(line (pt 0 128)(pt 16 128))
	)
	(port
		(pt 192 32)
		(output)
		(text "o_done" (rect 0 0 38 11)(font "Arial" ))
		(text "o_done" (rect 139 27 177 38)(font "Arial" ))
		(line (pt 192 32)(pt 176 32))
	)
	(port
		(pt 192 48)
		(output)
		(text "o_data[7..0]" (rect 0 0 59 11)(font "Arial" ))
		(text "o_data[7..0]" (rect 122 43 181 54)(font "Arial" ))
		(line (pt 192 48)(pt 176 48)(line_width 3))
	)
	(port
		(pt 192 64)
		(output)
		(text "spi_cs" (rect 0 0 33 11)(font "Arial" ))
		(text "spi_cs" (rect 144 59 177 70)(font "Arial" ))
		(line (pt 192 64)(pt 176 64))
	)
	(port
		(pt 192 80)
		(output)
		(text "spi_clk" (rect 0 0 35 11)(font "Arial" ))
		(text "spi_clk" (rect 142 75 177 86)(font "Arial" ))
		(line (pt 192 80)(pt 176 80))
	)
	(port
		(pt 192 96)
		(output)
		(text "spi_sdi" (rect 0 0 35 11)(font "Arial" ))
		(text "spi_sdi" (rect 142 91 177 102)(font "Arial" ))
		(line (pt 192 96)(pt 176 96))
	)
	(drawing
		(rectangle (rect 16 16 176 160))
	)
)
(symbol
	(rect 624 264 656 296)
	(text "GND" (rect 8 16 30 26)(font "Arial" (font_size 6)))
	(text "inst6" (rect 3 21 28 34)(font "Intel Clear" )(invisible))
	(port
		(pt 16 0)
		(output)
		(text "1" (rect 18 0 25 11)(font "Courier New" (bold))(invisible))
		(text "1" (rect 18 0 25 11)(font "Courier New" (bold))(invisible))
		(line (pt 16 8)(pt 16 0))
	)
	(drawing
		(line (pt 8 8)(pt 16 16))
		(line (pt 16 16)(pt 24 8))
		(line (pt 8 8)(pt 24 8))
	)
)
(symbol
	(rect 368 256 576 432)
	(text "lis3dh_master" (rect 5 0 75 11)(font "Arial" ))
	(text "inst2" (rect 8 160 32 171)(font "Arial" ))
	(port
		(pt 0 32)
		(input)
		(text "clk" (rect 0 0 15 11)(font "Arial" ))
		(text "clk" (rect 21 27 36 38)(font "Arial" ))
		(line (pt 0 32)(pt 16 32))
	)
	(port
		(pt 0 48)
		(input)
		(text "rst" (rect 0 0 14 11)(font "Arial" ))
		(text "rst" (rect 21 43 35 54)(font "Arial" ))
		(line (pt 0 48)(pt 16 48))
	)
	(port
		(pt 0 64)
		(input)
		(text "i_done" (rect 0 0 34 11)(font "Arial" ))
		(text "i_done" (rect 21 59 55 70)(font "Arial" ))
		(line (pt 0 64)(pt 16 64))
	)
	(port
		(pt 0 80)
		(input)
		(text "i_data[7..0]" (rect 0 0 55 11)(font "Arial" ))
		(text "i_data[7..0]" (rect 21 75 76 86)(font "Arial" ))
		(line (pt 0 80)(pt 16 80)(line_width 3))
	)
	(port
		(pt 208 32)
		(output)
		(text "o_start" (rect 0 0 35 11)(font "Arial" ))
		(text "o_start" (rect 158 27 193 38)(font "Arial" ))
		(line (pt 208 32)(pt 192 32))
	)
	(port
		(pt 208 48)
		(output)
		(text "o_rw" (rect 0 0 25 11)(font "Arial" ))
		(text "o_rw" (rect 166 43 191 54)(font "Arial" ))
		(line (pt 208 48)(pt 192 48))
	)
	(port
		(pt 208 64)
		(output)
		(text "o_addr[5..0]" (rect 0 0 59 11)(font "Arial" ))
		(text "o_addr[5..0]" (rect 138 59 197 70)(font "Arial" ))
		(line (pt 208 64)(pt 192 64)(line_width 3))
	)
	(port
		(pt 208 80)
		(output)
		(text "o_data[7..0]" (rect 0 0 59 11)(font "Arial" ))
		(text "o_data[7..0]" (rect 138 75 197 86)(font "Arial" ))
		(line (pt 208 80)(pt 192 80)(line_width 3))
	)
	(port
		(pt 208 96)
		(output)
		(text "o_id[7..0]" (rect 0 0 46 11)(font "Arial" ))
		(text "o_id[7..0]" (rect 149 91 195 102)(font "Arial" ))
		(line (pt 208 96)(pt 192 96)(line_width 3))
	)
	(port
		(pt 208 112)
		(output)
		(text "o_accl_x[15..0]" (rect 0 0 74 11)(font "Arial" ))
		(text "o_accl_x[15..0]" (rect 125 107 199 118)(font "Arial" ))
		(line (pt 208 112)(pt 192 112)(line_width 3))
	)
	(port
		(pt 208 128)
		(output)
		(text "o_accl_y[15..0]" (rect 0 0 74 11)(font "Arial" ))
		(text "o_accl_y[15..0]" (rect 125 123 199 134)(font "Arial" ))
		(line (pt 208 128)(pt 192 128)(line_width 3))
	)
	(port
		(pt 208 144)
		(output)
		(text "o_accl_z[15..0]" (rect 0 0 74 11)(font "Arial" ))
		(text "o_accl_z[15..0]" (rect 125 139 199 150)(font "Arial" ))
		(line (pt 208 144)(pt 192 144)(line_width 3))
	)
	(drawing
		(rectangle (rect 16 16 192 160))
	)
)
(symbol
	(rect 184 288 232 320)
	(text "NOT" (rect 1 0 22 10)(font "Arial" (font_size 6)))
	(text "inst4" (rect 3 21 28 34)(font "Intel Clear" ))
	(port
		(pt 0 16)
		(input)
		(text "IN" (rect 2 7 17 18)(font "Courier New" (bold))(invisible))
		(text "IN" (rect 2 7 17 18)(font "Courier New" (bold))(invisible))
		(line (pt 0 16)(pt 13 16))
	)
	(port
		(pt 48 16)
		(output)
		(text "OUT" (rect 32 7 53 18)(font "Courier New" (bold))(invisible))
		(text "OUT" (rect 32 7 53 18)(font "Courier New" (bold))(invisible))
		(line (pt 39 16)(pt 48 16))
	)
	(drawing
		(line (pt 13 25)(pt 13 7))
		(line (pt 13 7)(pt 31 16))
		(line (pt 13 25)(pt 31 16))
		(circle (rect 31 12 39 20))
	)
)
(connector
	(pt 24 208)
	(pt 72 208)
)
(connector
	(pt 72 168)
	(pt 16 168)
)
(connector
	(pt 368 288)
	(pt 328 288)
)
(connector
	(pt 328 288)
	(pt 328 168)
)
(connector
	(pt 744 256)
	(pt 696 256)
)
(connector
	(pt 696 256)
	(pt 696 168)
)
(connector
	(text "clk40M" (rect 259 152 295 165)(font "Intel Clear" ))
	(pt 232 168)
	(pt 328 168)
)
(connector
	(pt 328 168)
	(pt 696 168)
)
(connector
	(pt 640 264)
	(pt 680 264)
)
(connector
	(pt 680 264)
	(pt 680 272)
)
(connector
	(pt 680 272)
	(pt 744 272)
)
(connector
	(pt 936 272)
	(pt 976 272)
	(bus)
)
(connector
	(pt 976 272)
	(pt 976 424)
	(bus)
)
(connector
	(pt 976 424)
	(pt 336 424)
	(bus)
)
(connector
	(pt 336 424)
	(pt 336 336)
	(bus)
)
(connector
	(pt 368 336)
	(pt 336 336)
	(bus)
)
(connector
	(pt 368 320)
	(pt 320 320)
)
(connector
	(pt 320 320)
	(pt 320 440)
)
(connector
	(pt 320 440)
	(pt 992 440)
)
(connector
	(pt 992 440)
	(pt 992 256)
)
(connector
	(pt 992 256)
	(pt 936 256)
)
(connector
	(pt 936 288)
	(pt 1040 288)
)
(connector
	(pt 936 304)
	(pt 1040 304)
)
(connector
	(pt 936 320)
	(pt 1040 320)
)
(connector
	(pt 744 352)
	(pt 736 352)
)
(connector
	(pt 736 352)
	(pt 736 408)
)
(connector
	(pt 1208 336)
	(pt 1224 336)
)
(connector
	(pt 1224 336)
	(pt 1224 408)
)
(connector
	(pt 736 408)
	(pt 1224 408)
)
(connector
	(pt 576 288)
	(pt 744 288)
)
(connector
	(pt 744 304)
	(pt 576 304)
)
(connector
	(pt 576 320)
	(pt 744 320)
	(bus)
)
(connector
	(pt 576 336)
	(pt 744 336)
	(bus)
)
(connector
	(pt 232 304)
	(pt 368 304)
)
(junction (pt 328 168))
