[
    {
        "id": "efede95a3d07d24b",
        "type": "tab",
        "label": "Flow 1",
        "disabled": false,
        "info": "",
        "env": []
    },
    {
        "id": "3e5a9fb1664aa01a",
        "type": "inject",
        "z": "efede95a3d07d24b",
        "name": "",
        "props": [
            {
                "p": "payload"
            },
            {
                "p": "topic",
                "vt": "str"
            }
        ],
        "repeat": "",
        "crontab": "",
        "once": false,
        "onceDelay": 0.1,
        "topic": "",
        "payload": "",
        "payloadType": "date",
        "x": 300,
        "y": 120,
        "wires": [
            []
        ]
    }
]