<svg width="800" height="600" xmlns="http://www.w3.org/2000/svg">
 <!-- Created with Method Draw - http://github.com/duopixel/Method-Draw/ -->
 <g>
  <title>background</title>
  <rect fill="#fff" id="canvas_background" height="602" width="802" y="-1" x="-1"/>
  <g display="none" overflow="visible" y="0" x="0" height="100%" width="100%" id="canvasGrid">
   <rect fill="url(#gridpattern)" stroke-width="0" y="0" x="0" height="100%" width="100%"/>
  </g>
 </g>
 <g>
  <title>Layer 1</title>
  <path stroke="#000" id="svg_12" d="m406.00007,525.99995c134.76372,0 243.99992,-104.31813 243.99992,-232.99996c0,-128.6821 -109.2362,-233.00002 -243.99992,-233.00002c-134.75712,0 -244.00005,104.31792 -244.00005,233.00002c0,128.68183 109.24292,232.99996 244.00005,232.99996zm39.2001,-388.88985l59.36654,56.72116l-103.86929,99.18093l103.86929,99.18694l-59.36654,56.70244l-163.23036,-155.88936l163.23036,-155.90209l0,-0.00002z" stroke-opacity="null" stroke-dasharray="5,2,2,2" stroke-width="1.5" fill="#000000"/>
 </g>
</svg>