1.
http://172.16.160.128:8000/dukcapil/get_json/data_balikan/biodata_wni

{
      "NIK":"3123456777xxx",
 
       "user_id":"2523171201712211data_balik" ,
 
     "password":"123"
 
}

Header Content-Type : application/json

2.
http://172.16.160.128:8000/dukcapil/get_json/data_balikan/data_keluarga

{
      "No_kk":"3123456777xxx",
 
       "user_id":"2523171201712211data_balik" ,
 
     "password":"123"
 
}

Header Content-Type : application/json