<?xml version="1.0" encoding="UTF-8"?>
<svg width="50px" height="50px" viewBox="0 0 50 50" version="1.1" xmlns="http://www.w3.org/2000/svg" xmlns:xlink="http://www.w3.org/1999/xlink">
    <!-- Generator: Sketch 62 (91390) - https://sketch.com -->
    <title>halaal</title>
    <desc>Created with Sketch.</desc>
    <defs>
        <path d="M6.7755,1.5855 C6.7755,1.5855 7.0185,2.4 7.101,2.856 L7.101,2.856 C7.1835,3.312 7.737,5.0475 7.86,5.832 L7.86,5.832 C7.86,5.832 8.4525,8.712 8.4525,9.864 L8.4525,9.864 C8.4525,11.016 8.58,12.8835 7.4325,13.7055 L7.4325,13.7055 C6.447,14.4105 5.1615,14.748 4.1685,14.748 L4.1685,14.748 C3.1725,14.748 1.4055,14.4495 0.864,13.119 L0.864,13.119 C0.3195,11.7885 1.56,9.5205 1.56,9.5205 L1.56,9.5205 C0.711,10.8015 0.306,11.778 0.306,11.778 L0.306,11.778 C0,12.693 0,13.3515 0,13.3515 L0,13.3515 C0.189,14.6775 0.864,15.231 0.864,15.231 L0.864,15.231 C1.974,16.3815 4.1685,16.5 4.1685,16.5 L4.1685,16.5 C7.041,16.5 8.4525,14.8965 8.4525,14.8965 L8.4525,14.8965 C9.5505,13.4355 9.561,12.558 9.561,12.558 L9.561,12.558 C9.6645,10.83 9.6255,9.864 9.6255,9.864 L9.6255,9.864 C9.6255,8.25 8.7315,5.187 8.7315,4.194 L8.7315,4.194 C8.7315,3.2025 9.3825,2.2215 9.3825,2.2215 L9.3825,2.2215 C9.3825,2.2215 8.8875,1.8465 8.58,1.371 L8.58,1.371 C8.2725,0.8955 8.079,0 8.079,0 L8.079,0 L6.7755,1.5855 Z M18.15,2.2215 C17.835,2.8035 17.6175,6.207 16.5,9.2025 L16.5,9.2025 C15.3135,12.018 13.2465,13.2885 11.55,14.2785 L11.55,14.2785 C9.8475,15.372 7.26,16.1835 7.26,16.1835 L7.26,16.1835 C7.26,16.1835 9.645,16.3845 11.8785,15.8655 L11.8785,15.8655 C13.1865,15.489 14.5395,14.718 15.51,13.644 L15.51,13.644 C16.299,12.7065 16.554,12.018 17.16,10.7895 L17.16,10.7895 C17.8155,8.5095 18.15,6.3465 18.15,6.3465 L18.15,6.3465 L18.15,8.25 C18.15,8.25 18.174,11.2515 18.81,13.0095 L18.81,13.0095 C19.761,14.871 21.3795,14.973 22.1115,14.913 L22.1115,14.913 C22.674,14.973 24.7755,14.8275 27.06,13.962 L27.06,13.962 C29.5935,12.936 31.68,13.3275 31.68,13.3275 L31.68,13.3275 L33,11.106 C33,11.106 30.8955,11.3835 29.37,10.7895 L29.37,10.7895 C27.657,9.912 26.3325,8.886 24.42,8.8845 L24.42,8.8845 C22.38,8.886 21.186,12.336 21.12,12.375 L21.12,12.375 C21.186,12.336 21.7455,11.6235 23.1,11.106 L23.1,11.106 C24.6015,10.4565 27.39,12.0585 27.39,12.0585 L27.39,12.0585 C27.39,12.0585 27.186,12.336 25.74,12.693 L25.74,12.693 C24.291,13.1985 21.8415,13.3785 20.7885,13.0095 L20.7885,13.0095 C19.6185,12.3705 19.47,9.2025 19.47,9.2025 L19.47,9.2025 C19.47,9.2025 19.1715,5.0205 19.14,4.125 L19.14,4.125 C19.0815,3.4395 18.8115,2.1585 18.3375,2.1585 L18.3375,2.1585 C18.279,2.1585 18.216,2.178 18.15,2.2215 L18.15,2.2215 Z M10.56,6.981 C11.979,7.6965 12.5925,7.623 13.2,8.5665 L13.2,8.5665 C13.983,9.2235 14.85,11.424 14.85,11.424 L14.85,11.424 C14.85,11.424 15.18,9.294 14.19,7.2975 L14.19,7.2975 C13.08,5.493 9.57,3.8085 9.57,3.8085 L9.57,3.8085 C9.57,3.8085 9.1725,6.381 10.56,6.981 L10.56,6.981 Z" id="path-1"></path>
    </defs>
    <g id="halaal" stroke="none" stroke-width="1" fill="none" fill-rule="evenodd">
        <g id="Group-6-Copy" transform="translate(9.000000, 17.000000)">
            <path d="M24.4197,8.88435 C26.3322,8.88435 27.6567,9.91185 29.3697,10.78935 C30.8952,11.38485 32.9997,11.10585 32.9997,11.10585 L31.6797,13.32735 C31.6797,13.32735 29.5947,12.93585 27.0597,13.96185 C24.7767,14.82885 22.6737,14.97285 22.1097,14.91435 C21.3792,14.97285 19.7607,14.87085 18.8097,13.00935 C18.1737,11.25135 18.1497,8.24985 18.1497,8.24985 L18.1497,6.34635 C18.1497,6.34635 17.8152,8.50935 17.1597,10.78935 C16.5552,12.01635 16.2987,12.70485 15.5097,13.64385 C14.5392,14.71785 13.1862,15.48735 11.8797,15.86535 C9.6447,16.38435 7.2597,16.18335 7.2597,16.18335 C7.2597,16.18335 9.8472,15.37185 11.5497,14.27835 C13.2462,13.28835 15.3132,12.01635 16.4997,9.20235 C17.6157,6.20685 17.8347,2.80335 18.1497,2.22135 C18.7422,1.82685 19.0737,3.35235 19.1397,4.12485 C19.1727,5.02035 19.4697,9.20235 19.4697,9.20235 C19.4697,9.20235 19.6197,12.37185 20.7897,13.00935 C21.8412,13.37835 24.2907,13.19835 25.7397,12.69285 C27.1857,12.33585 27.3897,12.05835 27.3897,12.05835 C27.3897,12.05835 24.6027,10.45635 23.0997,11.10585 C21.7452,11.62335 21.1857,12.33585 21.1197,12.37485 C21.1857,12.33585 22.3797,8.88435 24.4197,8.88435 M9.5697,3.80835 C9.5697,3.80835 9.1722,6.38085 10.5597,6.98085 C11.9787,7.69635 12.5922,7.62285 13.1997,8.56785 C13.9827,9.22335 14.8497,11.42235 14.8497,11.42235 C14.8497,11.42235 15.1797,9.29385 14.1897,7.29735 C13.0797,5.49285 9.5697,3.80835 9.5697,3.80835 M6.7752,1.58685 L8.0787,-0.00015 C8.0787,-0.00015 8.2722,0.89535 8.5797,1.37085 C8.8872,1.84635 9.3837,2.22135 9.3837,2.22135 C9.3837,2.22135 8.7312,3.20085 8.7312,4.19385 C8.7312,5.18685 9.6252,8.24985 9.6252,9.86385 C9.6252,9.86385 9.6642,10.82985 9.5622,12.55935 C9.5622,12.55935 9.5502,13.43535 8.4537,14.89785 C8.4537,14.89785 7.0422,16.49985 4.1682,16.49985 C4.1682,16.49985 1.9752,16.38135 0.8622,15.23085 C0.8622,15.23085 0.1887,14.67735 -0.0003,13.35135 C-0.0003,13.35135 -0.0003,12.69285 0.3057,11.77935 C0.3057,11.77935 0.7107,10.80135 1.5597,9.51885 C1.5597,9.51885 0.3192,11.78835 0.8622,13.11885 C1.4052,14.44935 3.1722,14.74935 4.1682,14.74935 C5.1627,14.74935 6.4467,14.41185 7.4322,13.70535 C8.5797,12.88335 8.4537,11.01585 8.4537,9.86385 C8.4537,8.71185 7.8597,5.83185 7.8597,5.83185 C7.7382,5.04735 7.1847,3.31185 7.1007,2.85585 C7.0167,2.39985 6.7752,1.58685 6.7752,1.58685" id="Fill-1" fill="#D31046"></path>
            <g id="Group-5">
                <mask id="mask-2" fill="white">
                    <use xlink:href="#path-1"></use>
                </mask>
                <g id="Clip-4"></g>
                <polygon id="Fill-3" fill="#D31046" mask="url(#mask-2)" points="-7.5 24 40.5 24 40.5 -7.5 -7.5 -7.5"></polygon>
            </g>
        </g>
    </g>
</svg>