<?xml version="1.0" encoding="UTF-8"?>
<svg width="50px" height="50px" viewBox="0 0 50 50" version="1.1" xmlns="http://www.w3.org/2000/svg" xmlns:xlink="http://www.w3.org/1999/xlink">
    <!-- Generator: Sketch 62 (91390) - https://sketch.com -->
    <title>mail</title>
    <desc>Created with Sketch.</desc>
    <defs>
        <polygon id="path-1" points="0 0.0180675416 25.8749911 0.0180675416 25.8749911 15.5249885 0 15.5249885"></polygon>
    </defs>
    <g id="mail" stroke="none" stroke-width="1" fill="none" fill-rule="evenodd">
        <g id="Group-5-Copy" transform="translate(12.000000, 16.000000)">
            <polygon id="Fill-1" fill="#D31145" points="0 0 13.1903347 10.35 25.875 0"></polygon>
            <g id="Group-4" transform="translate(0.000000, 1.725000)">
                <mask id="mask-2" fill="white">
                    <use xlink:href="#path-1"></use>
                </mask>
                <g id="Clip-3"></g>
                <path d="M13.1905043,10.7295714 C12.9649926,10.7295714 12.739126,10.6535821 12.5572026,10.5015462 L0.0132687,0.0180675416 C0.00883298571,0.0609693438 -8.87142857e-06,0.102694575 -8.87142857e-06,0.146514677 L-8.87142857e-06,14.1631504 C-8.87142857e-06,14.9150655 0.634534843,15.5249885 1.42009984,15.5249885 L24.4536404,15.5249885 C25.2382296,15.5249885 25.8749911,14.9150655 25.8749911,14.1631504 L25.8749911,0.146514677 C25.8749911,0.109122671 25.8667998,0.0744855638 25.8636357,0.0376961922 L13.8377046,10.4892639 C13.653859,10.6492776 13.422019,10.7295714 13.1905043,10.7295714" id="Fill-2" fill="#D31145" mask="url(#mask-2)"></path>
            </g>
        </g>
    </g>
</svg>