<?xml version="1.0" encoding="UTF-8"?>
<svg width="50px" height="50px" viewBox="0 0 50 50" version="1.1" xmlns="http://www.w3.org/2000/svg" xmlns:xlink="http://www.w3.org/1999/xlink">
    <!-- Generator: Sketch 62 (91390) - https://sketch.com -->
    <title>lock</title>
    <desc>Created with Sketch.</desc>
    <g id="lock" stroke="none" stroke-width="1" fill="none" fill-rule="evenodd">
        <g id="Group-5-Copy-8" transform="translate(13.000000, 8.000000)" fill="#D31145">
            <path d="M6.10409158,14.2499998 L6.10409158,9.1607223 C6.10409158,8.35704431 6.26249083,7.57909676 6.57491494,6.84851146 C6.87732398,6.14126571 7.31096495,5.50540488 7.86386583,4.95868981 C8.41676671,4.41197473 9.0596881,3.98298214 9.77478705,3.6837803 C10.5134847,3.37478724 11.2999554,3.21824137 12.1124423,3.21824137 C12.9251594,3.21824137 13.7116301,3.37478724 14.4503278,3.6837803 C15.1654267,3.98298214 15.8083481,4.41197473 16.361249,4.95868981 C16.9140347,5.50540488 17.3477908,6.14126571 17.6501999,6.84851146 C17.962624,7.57909676 18.1210232,8.35704431 18.1210232,9.1607223 L18.1210232,14.2499998 L21.3749997,14.2499998 L21.3749997,9.1607223 C21.3749997,4.10127389 17.2280705,0 12.1124423,0 C6.99704434,0 2.84999996,4.10127389 2.84999996,9.1607223 L2.84999996,14.2499998 L6.10409158,14.2499998 Z" id="Fill-1"></path>
            <path d="M14.0117522,29.3416867 L10.2132475,29.3416867 L11.0871317,24.1513224 C10.1853699,23.744586 9.55524247,22.8181375 9.55524247,21.7399481 C9.55524247,20.286556 10.7001851,19.1083126 12.112615,19.1083126 C13.5248146,19.1083126 14.6698724,20.286556 14.6698724,21.7399481 C14.6698724,22.8181375 14.0396298,23.744586 13.137868,24.1513224 L14.0117522,29.3416867 Z M21.1958956,14.2499998 L3.02898894,14.2499998 C1.35621384,14.2499998 0,15.6456593 0,17.3672058 L0,31.0829121 C0,32.8044586 1.35621384,34.1999996 3.02898894,34.1999996 L21.1958956,34.1999996 C22.8689011,34.1999996 24.2249997,32.8044586 24.2249997,31.0829121 L24.2249997,17.3672058 C24.2249997,15.6456593 22.8689011,14.2499998 21.1958956,14.2499998 L21.1958956,14.2499998 Z" id="Fill-3"></path>
        </g>
    </g>
</svg>