<?xml version="1.0" encoding="UTF-8"?>
<svg width="50px" height="50px" viewBox="0 0 50 50" version="1.1" xmlns="http://www.w3.org/2000/svg" xmlns:xlink="http://www.w3.org/1999/xlink">
    <!-- Generator: Sketch 62 (91390) - https://sketch.com -->
    <title>cooking</title>
    <desc>Created with Sketch.</desc>
    <defs>
        <polygon id="path-1" points="0.000176470588 0.679852941 29.4529412 0.679852941 29.4529412 13.2348529 0.000176470588 13.2348529"></polygon>
    </defs>
    <g id="cooking" stroke="none" stroke-width="1" fill="none" fill-rule="evenodd">
        <g id="Group-10-Copy" transform="translate(10.000000, 11.000000)">
            <path d="M12.759,9.23902941 L12.759,9.2205 C12.5295882,8.14491176 13.2266471,7.07726471 14.3119412,6.85667647 C14.8325294,6.75079412 15.3707647,6.84785294 15.8207647,7.14785294 C16.2619412,7.43902941 16.5698824,7.88902941 16.6766471,8.40961765 L16.7207647,8.63020588 L12.759,9.23902941 Z M26.1442941,7.18314706 L17.5934118,8.49697059 L17.5413529,8.23226471 C17.3825294,7.48314706 16.9501765,6.83020588 16.3060588,6.40667647 C15.6619412,5.98314706 14.8854706,5.83314706 14.1354706,5.99108824 C12.5825294,6.30961765 11.5766471,7.82638235 11.8942941,9.3705 L3.17664706,10.7125588 C2.93841176,10.7478529 2.77076471,10.9772647 2.80605882,11.2146176 C2.84135294,11.4352059 3.02664706,11.5852059 3.23841176,11.5852059 L3.309,11.5852059 L26.2757647,8.04697059 C26.5148824,8.01167647 26.6825294,7.79108824 26.6472353,7.54491176 C26.6119412,7.30667647 26.3913529,7.14785294 26.1442941,7.18314706 L26.1442941,7.18314706 Z" id="Fill-1" fill="#D0113C"></path>
            <g id="Group-5" transform="translate(0.000000, 13.818088)">
                <mask id="mask-2" fill="white">
                    <use xlink:href="#path-1"></use>
                </mask>
                <g id="Clip-4"></g>
                <path d="M26.6560588,6.52102941 L26.6560588,2.51514706 C27.7148824,2.56808824 28.5707647,3.44161765 28.5707647,4.51720588 C28.5707647,5.59367647 27.7148824,6.46720588 26.6560588,6.52102941 L26.6560588,6.52102941 Z M25.7737059,8.38191176 C25.7737059,10.5710294 23.9904706,12.3525 21.7942941,12.3525 L7.659,12.3525 C5.47076471,12.3525 3.68841176,10.5710294 3.68841176,8.38191176 L3.68841176,1.56220588 L25.7737059,1.56220588 L25.7737059,8.38191176 Z M2.80605882,6.52102941 C1.73841176,6.47602941 0.882529412,5.59367647 0.882529412,4.51720588 C0.882529412,3.44161765 1.73841176,2.55926471 2.80605882,2.51514706 L2.80605882,6.52102941 Z M26.6560588,1.64161765 L26.6560588,0.679852941 L2.80605882,0.679852941 L2.80605882,1.64161765 C1.25311765,1.67691176 0.000176470588,2.94661765 0.000176470588,4.51720588 C0.000176470588,6.07985294 1.25311765,7.35838235 2.80605882,7.39367647 L2.80605882,8.38191176 C2.80605882,11.0563235 4.97664706,13.2348529 7.659,13.2348529 L21.7942941,13.2348529 C24.4766471,13.2348529 26.6560588,11.0563235 26.6560588,8.38191176 L26.6560588,7.39367647 C28.209,7.34955882 29.4531176,6.07985294 29.4531176,4.51720588 C29.4531176,2.94661765 28.209,1.68573529 26.6560588,1.64161765 L26.6560588,1.64161765 Z" id="Fill-3" fill="#D0113C" mask="url(#mask-2)"></path>
            </g>
            <path d="M20.6502353,6.18785294 C20.517,6.18785294 20.3837647,6.12697059 20.2972941,6.01138235 C20.1517059,5.81638235 20.1905294,5.54020588 20.3855294,5.39373529 L21.1417059,4.82638235 C21.3852353,4.64373529 21.5281765,4.36402941 21.5325882,4.05873529 C21.5378824,3.75344118 21.4037647,3.46844118 21.1646471,3.27785294 C20.7287647,2.92932353 20.4746471,2.40961765 20.4667059,1.85108824 C20.4578824,1.29255882 20.6987647,0.764911765 21.1240588,0.404029412 L21.477,0.104911765 C21.6622941,-0.0521470588 21.9411176,-0.0300882353 22.0981765,0.156088235 C22.2552353,0.341382353 22.2331765,0.619323529 22.047,0.777264706 L21.6949412,1.07638235 C21.4708235,1.26697059 21.3446471,1.54402941 21.3490588,1.83785294 C21.3525882,2.13167647 21.4867059,2.40520588 21.7161176,2.58873529 C22.1696471,2.95138235 22.4237647,3.49226471 22.4149412,4.07285294 C22.4052353,4.65255882 22.1352353,5.18373529 21.6702353,5.53226471 L20.9149412,6.09961765 C20.8355294,6.15961765 20.742,6.18785294 20.6502353,6.18785294" id="Fill-6" fill="#D0113C"></path>
            <path d="M24.3778235,6.18785294 C24.2445882,6.18785294 24.1113529,6.12697059 24.0248824,6.01138235 C23.8792941,5.81638235 23.9181176,5.54020588 24.1131176,5.39373529 L24.8692941,4.82638235 C25.1128235,4.64373529 25.2557647,4.36402941 25.2601765,4.05873529 C25.2654706,3.75344118 25.1313529,3.46844118 24.8922353,3.27785294 C24.4563529,2.92932353 24.2022353,2.40961765 24.1942941,1.85108824 C24.1854706,1.29255882 24.4263529,0.764911765 24.8516471,0.404029412 L25.2028235,0.104911765 C25.389,-0.0521470588 25.6669412,-0.0309705882 25.8248824,0.155205882 C25.9819412,0.341382353 25.9598824,0.619323529 25.7745882,0.777264706 L25.4234118,1.07638235 C25.1984118,1.26697059 25.0722353,1.54402941 25.0766471,1.83785294 C25.0801765,2.13167647 25.2142941,2.40520588 25.4437059,2.58873529 C25.8972353,2.95138235 26.1513529,3.49226471 26.1425294,4.07285294 C26.1328235,4.65255882 25.8628235,5.18373529 25.3978235,5.53226471 L24.6425294,6.09961765 C24.5631176,6.15961765 24.4695882,6.18785294 24.3778235,6.18785294" id="Fill-8" fill="#D0113C"></path>
        </g>
    </g>
</svg>