<?xml version="1.0" encoding="UTF-8"?>
<svg width="50px" height="50px" viewBox="0 0 50 50" version="1.1" xmlns="http://www.w3.org/2000/svg" xmlns:xlink="http://www.w3.org/1999/xlink">
    <!-- Generator: Sketch 62 (91390) - https://sketch.com -->
    <title>kosher</title>
    <desc>Created with Sketch.</desc>
    <defs>
        <path d="M11.0020909,0.24225 L4.31645455,11.7010227 L1.42684091,6.74127273 L5.20431818,6.74127273 C5.49293182,6.74127273 5.72590909,6.50713636 5.72590909,6.21968182 L5.72590909,6.21968182 C5.72590909,5.93106818 5.49293182,5.69925 5.20431818,5.69925 L5.20431818,5.69925 L0.520431818,5.69925 C0.333818182,5.69925 0.162272727,5.80704545 0.0695454545,5.96931818 L0.0695454545,5.96931818 C-0.0231818182,6.13043182 -0.0231818182,6.33443182 0.0707045455,6.49554545 L0.0707045455,6.49554545 L3.71372727,12.7442045 L0.0707045455,18.9917045 C-0.0231818182,19.1528182 -0.0231818182,19.3440682 0.0695454545,19.5051818 L0.0695454545,19.5051818 C0.162272727,19.6674545 0.333818182,19.7590227 0.520431818,19.7590227 L0.520431818,19.7590227 L7.81227273,19.7590227 L11.0020909,25.2380455 C11.0948182,25.3968409 11.2652045,25.5 11.4518182,25.5 L11.4518182,25.5 C11.6361136,25.5 11.8076591,25.4037955 11.9015455,25.2438409 L11.9015455,25.2438409 L18.5871818,13.77 L21.4756364,18.7181591 L17.1765682,18.7181591 C16.8891136,18.7181591 16.6561364,18.9488182 16.6561364,19.2385909 L16.6561364,19.2385909 C16.6561364,19.5248864 16.8891136,19.7590227 17.1765682,19.7590227 L17.1765682,19.7590227 L22.3820455,19.7590227 C22.5686591,19.7590227 22.7413636,19.6686136 22.8340909,19.5063409 L22.8340909,19.5063409 C22.9256591,19.3452273 22.9256591,19.1493409 22.8317727,18.9893864 L22.8317727,18.9893864 L19.1899091,12.7465227 L22.8317727,6.50018182 C22.9256591,6.33790909 22.9256591,6.13043182 22.8340909,5.96931818 L22.8340909,5.96931818 C22.7413636,5.80704545 22.5686591,5.69925 22.3820455,5.69925 L22.3820455,5.69925 L15.0902045,5.69925 L11.9015455,0.237613636 C11.8088182,0.0788181818 11.6314773,0 11.4552955,0 L11.4552955,0 C11.2756364,0 11.0959773,0.0811363636 11.0020909,0.24225 L11.0020909,0.24225 Z M4.91918182,12.73725 L11.4518182,1.52884091 L13.88475,5.69925 L10.4109545,5.69925 C10.1223409,5.69925 9.88936364,5.93106818 9.88936364,6.21968182 L9.88936364,6.21968182 C9.88936364,6.50713636 10.1223409,6.74127273 10.4109545,6.74127273 L10.4109545,6.74127273 L14.4921136,6.74127273 L17.9844545,12.7326136 L11.4518182,23.9410227 L9.01772727,19.7590227 L12.4926818,19.7590227 C12.7789773,19.7590227 13.0119545,19.5248864 13.0119545,19.2385909 L13.0119545,19.2385909 C13.0119545,18.9488182 12.7789773,18.7181591 12.4926818,18.7181591 L12.4926818,18.7181591 L8.41036364,18.7181591 L4.91918182,12.73725 Z M15.6975682,6.74011364 L21.4767955,6.74011364 L18.5871818,11.6952273 L15.6975682,6.74011364 Z M4.31645455,13.7618864 L7.20606818,18.7181591 L1.42684091,18.7181591 L4.31645455,13.7618864 Z" id="path-1"></path>
    </defs>
    <g id="kosher" stroke="none" stroke-width="1" fill="none" fill-rule="evenodd">
        <g id="Group-6-Copy" transform="translate(14.000000, 12.000000)">
            <path d="M22.831425,18.9891545 L19.1895614,12.7462909 L22.831425,6.49995 C22.9253114,6.33883636 22.9264705,6.13135909 22.8325841,5.96908636 C22.7410159,5.80681364 22.5683114,5.69901818 22.3816977,5.69901818 L15.0898568,5.69901818 L11.9011977,0.238540909 C11.7145841,-0.0825272727 11.1883568,-0.0778909091 11.0017432,0.242018182 L4.31610682,11.70195 L1.42649318,6.74104091 L5.20512955,6.74104091 C5.49258409,6.74104091 5.72556136,6.50690455 5.72556136,6.21945 C5.72556136,5.93199545 5.49258409,5.69901818 5.20512955,5.69901818 L0.520084091,5.69901818 C0.334629545,5.69901818 0.161925,5.80681364 0.0691977273,5.96908636 C-0.0235295455,6.13135909 -0.0235295455,6.3342 0.0703568182,6.49531364 L3.71337955,12.7439727 L0.0703568182,18.9926318 C-0.0235295455,19.1537455 -0.0235295455,19.3438364 0.0691977273,19.50495 C0.161925,19.6672227 0.334629545,19.7587909 0.520084091,19.7587909 L7.811925,19.7587909 L11.0017432,25.2378136 C11.0956295,25.3966091 11.2660159,25.4997682 11.4514705,25.4997682 C11.6357659,25.4997682 11.8073114,25.4035636 11.9011977,25.2436091 L18.5868341,13.7697682 L21.4752886,18.7179273 L17.1773795,18.7179273 C16.889925,18.7179273 16.6557886,18.9497455 16.6557886,19.2383591 C16.6557886,19.5258136 16.889925,19.7587909 17.1773795,19.7587909 L22.3816977,19.7587909 C22.5683114,19.7587909 22.7398568,19.6683818 22.8325841,19.5061091 C22.9264705,19.3449955 22.9253114,19.1502682 22.831425,18.9891545 L22.831425,18.9891545 Z M1.42649318,18.7179273 L4.31610682,13.7616545 L7.20572045,18.7179273 L1.42649318,18.7179273 Z M11.4514705,23.9407909 L9.01737955,19.7587909 L12.4923341,19.7587909 C12.7797886,19.7587909 13.0127659,19.5258136 13.0127659,19.2383591 C13.0127659,18.9497455 12.7797886,18.7179273 12.4923341,18.7179273 L8.41001591,18.7179273 L4.91883409,12.7370182 L11.4514705,1.52976818 L13.8855614,5.69901818 L10.4106068,5.69901818 C10.1231523,5.69901818 9.88901591,5.93199545 9.88901591,6.21945 C9.88901591,6.50690455 10.1231523,6.74104091 10.4106068,6.74104091 L14.492925,6.74104091 L17.9841068,12.7335409 L11.4514705,23.9407909 Z M15.6972205,6.73988182 L21.4764477,6.73988182 L18.5868341,11.6949955 L15.6972205,6.73988182 Z" id="Fill-1" fill="#D31046"></path>
            <g id="Group-5">
                <mask id="mask-2" fill="white">
                    <use xlink:href="#path-1"></use>
                </mask>
                <g id="Clip-4"></g>
                <polygon id="Fill-3" fill="#D31046" mask="url(#mask-2)" points="-5.79545455 31.2954545 28.6979318 31.2954545 28.6979318 -5.79545455 -5.79545455 -5.79545455"></polygon>
            </g>
        </g>
    </g>
</svg>