<?xml version="1.0" encoding="UTF-8"?>
<svg width="50px" height="50px" viewBox="0 0 50 50" version="1.1" xmlns="http://www.w3.org/2000/svg" xmlns:xlink="http://www.w3.org/1999/xlink">
    <!-- Generator: Sketch 62 (91390) - https://sketch.com -->
    <title>instagram</title>
    <desc>Created with Sketch.</desc>
    <g id="instagram" stroke="none" stroke-width="1" fill="none" fill-rule="evenodd">
        <g id="instagram-copy" transform="translate(12.000000, 12.000000)" fill="#D31145" fill-rule="nonzero">
            <path d="M22.6903846,0 L3.89423077,0 C1.74713043,0 0,1.74713043 0,3.89423077 L0,22.6903846 C0,24.837485 1.74713043,26.5846154 3.89423077,26.5846154 L22.6903846,26.5846154 C24.837485,26.5846154 26.5846154,24.837485 26.5846154,22.6903846 L26.5846154,3.89423077 C26.5846154,1.74713043 24.837485,0 22.6903846,0 Z M13.3442308,20.25 C9.47900392,20.25 6.33461538,17.1056115 6.33461538,13.2403846 C6.33461538,9.37515777 9.47900392,6.23076923 13.3442308,6.23076923 C17.2094576,6.23076923 20.3538462,9.37515777 20.3538462,13.2403846 C20.3538462,17.1056115 17.2094576,20.25 13.3442308,20.25 Z M21.1326923,7.78846154 C19.844351,7.78846154 18.7961538,6.74026442 18.7961538,5.45192308 C18.7961538,4.16358173 19.844351,3.11538462 21.1326923,3.11538462 C22.4210337,3.11538462 23.4692308,4.16358173 23.4692308,5.45192308 C23.4692308,6.74026442 22.4210337,7.78846154 21.1326923,7.78846154 Z" id="Shape"></path>
            <path d="M21.1326923,4.67307692 C20.7029071,4.67307692 20.3538462,5.02213791 20.3538462,5.45192308 C20.3538462,5.88170825 20.7029071,6.23076923 21.1326923,6.23076923 C21.5624775,6.23076923 21.9115385,5.88170825 21.9115385,5.45192308 C21.9115385,5.02213791 21.5624775,4.67307692 21.1326923,4.67307692 Z" id="Path"></path>
            <path d="M13.3442308,7.78846154 C10.3383714,7.78846154 7.89230769,10.2345252 7.89230769,13.2403846 C7.89230769,16.246244 10.3383714,18.6923077 13.3442308,18.6923077 C16.3500901,18.6923077 18.7961538,16.246244 18.7961538,13.2403846 C18.7961538,10.2345252 16.3500901,7.78846154 13.3442308,7.78846154 Z" id="Path"></path>
        </g>
    </g>
</svg>