<?xml version="1.0" encoding="UTF-8"?>
<svg width="50px" height="50px" viewBox="0 0 50 50" version="1.1" xmlns="http://www.w3.org/2000/svg" xmlns:xlink="http://www.w3.org/1999/xlink">
    <!-- Generator: Sketch 62 (91390) - https://sketch.com -->
    <title>handshake</title>
    <desc>Created with Sketch.</desc>
    <g id="handshake" stroke="none" stroke-width="1" fill="none" fill-rule="evenodd">
        <g id="Group-8-Copy-2" transform="translate(11.000000, 10.000000)" fill="#D31145" fill-rule="nonzero">
            <path d="M10.2417054,29.4196674 C9.78143895,29.4196674 9.33411992,29.240816 8.98219256,28.9159892 C8.97438606,28.9088174 8.96689689,28.9013282 8.95972506,28.8935217 C8.71664449,28.6283545 8.5646398,28.3130479 8.50339365,27.9877769 L8.39111962,28.1000509 C8.05950186,28.4317321 7.61427726,28.6143282 7.13744584,28.6143282 C6.66061441,28.6143282 6.21538981,28.4317321 5.88377206,28.1001144 C5.6173989,27.8336777 5.45384312,27.5090414 5.39297778,27.1710769 L5.07754424,27.4759748 C4.74618036,27.8060694 4.30197123,27.9878403 3.82628223,27.9878403 C3.34938733,27.9878403 2.90416273,27.8051808 2.57260844,27.4734996 C1.88138376,26.7822749 1.88132029,25.6575037 2.57260844,24.9661521 L5.6619531,21.9212981 C5.81103829,21.7744978 6.05062815,21.7751959 6.19857092,21.9232656 L9.73358445,25.4582791 L11.1590648,26.9281867 C11.3693961,27.1109732 11.6442739,27.2155042 11.9154071,27.2155042 C12.0304103,27.2155042 12.1405264,27.1966543 12.2427091,27.1595258 C12.411977,27.0978354 12.6008563,27.1633339 12.6960575,27.3160367 C12.7912588,27.4687395 12.7665065,27.6672025 12.6367789,27.7919161 L11.4758946,28.9081193 C11.1445307,29.2380869 10.7064145,29.4196674 10.2417054,29.4196674 Z M9.51068654,28.3671857 C9.71949466,28.5548591 9.97850558,28.6580573 10.2417688,28.6580573 C10.5043339,28.6580573 10.7523015,28.5546687 10.9401019,28.3669318 C10.941879,28.3651547 10.943656,28.3633776 10.9454331,28.361664 L11.4168698,27.908379 C11.1330431,27.8297428 10.8649563,27.6859254 10.6432008,27.4887318 C10.6361559,27.482512 10.6293649,27.4760383 10.6228912,27.4692473 L9.19100068,25.9926121 L5.92737424,22.7290492 L3.10928973,25.5065779 C2.72359766,25.89227 2.72359766,26.5472547 3.11125723,26.9349778 C3.29899413,27.1227147 3.55299112,27.2261667 3.82640916,27.2261667 C4.09982721,27.2261667 4.35376072,27.1227147 4.54156109,26.9349778 C4.54308432,26.9334545 4.54460754,26.9319313 4.54619422,26.9304081 L5.88859559,25.6328783 C6.03888666,25.4876646 6.27828612,25.490711 6.42476914,25.6397328 C6.57137909,25.788818 6.57030014,26.0281539 6.4224843,26.1759063 C6.03406313,26.564391 6.03406313,27.1729809 6.4224843,27.5614656 C6.61022121,27.7492025 6.86421819,27.8525911 7.13763624,27.8525911 C7.41105428,27.8525911 7.6649878,27.7492025 7.85278817,27.5614656 L8.97140309,26.4427872 L8.97140309,26.4427872 C9.12010747,26.2940194 9.36122055,26.2940828 9.50992493,26.4427237 C9.65862932,26.5914916 9.65862932,26.8326047 9.50992493,26.9812456 C9.099544,27.3915631 9.18801771,28.004215 9.51068654,28.3671857 Z" id="Shape"></path>
            <path d="M13.6706012,29.9566661 C13.1937063,29.9566661 12.7484817,29.7740066 12.4169274,29.4423253 C11.8517492,28.8772106 11.7326207,27.9681019 12.133545,27.2808122 C12.1801936,27.2009066 12.2542602,27.140676 12.3420358,27.1114175 C12.3984584,27.0926311 12.5288841,27.0018725 12.5958423,26.9349778 C12.9829307,26.5478894 12.9929586,25.9230517 12.6192619,25.4813179 C12.4873764,25.3255051 12.5019104,25.0934044 12.652138,24.9551722 C12.8023656,24.8169399 13.0349106,24.8216365 13.1792357,24.9661521 L14.6111263,26.3981061 C14.7988632,26.585843 15.0468942,26.6892316 15.3095228,26.6892316 C15.5727226,26.6892316 15.831797,26.5860968 16.0405416,26.3983599 C16.3632104,26.0354527 16.4517476,25.4228008 16.0414936,25.0126103 L16.0414936,25.0125468 C15.8927258,24.8638424 15.8927258,24.6227293 16.0414301,24.4740884 C16.190198,24.3253206 16.4312476,24.325384 16.579952,24.474025 C16.5804597,24.4745327 16.580904,24.474977 16.5813483,24.4754212 L17.6986304,25.5927033 C17.7528316,25.6467777 17.8336258,25.7275083 17.8681521,25.7450254 C17.9765546,25.7999248 18.0531599,25.9038211 18.0727714,26.0238382 C18.0923194,26.1437918 18.0544293,26.2663475 17.9690654,26.3529807 L14.9263694,29.4404213 C14.5926572,29.7740066 14.1474326,29.9566661 13.6706012,29.9566661 Z M12.7404213,27.7648155 C12.575025,28.1430819 12.6576597,28.6061408 12.9553858,28.9038669 C13.1431227,29.0916039 13.3971197,29.1950559 13.6705377,29.1950559 C13.9439558,29.1950559 14.1979528,29.0916039 14.3856897,28.9038669 L15.9252846,27.3416141 C15.7279641,27.4133959 15.5199811,27.4508417 15.3093959,27.4508417 C14.8433539,27.4508417 14.4040952,27.2682457 14.0724775,26.9366279 L13.6334727,26.4975597 C13.5759711,26.8568493 13.4091785,27.1986853 13.1343642,27.4734996 C13.0641691,27.5436947 12.9105777,27.6738666 12.7404213,27.7648155 Z M17.0479424,26.0188877 C17.0320192,26.1034899 17.0098541,26.1873305 16.9815744,26.2698382 L17.1394692,26.1100905 L17.0479424,26.0188877 Z" id="Shape"></path>
            <path d="M11.8808808,27.9877134 C11.4039859,27.9877134 10.9587613,27.8050539 10.627207,27.4733727 L9.19119108,25.9926121 L4.31790158,21.1193226 C4.2721415,21.0735626 4.23875759,21.0169495 4.22105016,20.9546879 L3.684115,19.0753514 C3.64609796,18.9423235 3.68322645,18.7992042 3.78096642,18.7014643 L8.21093535,14.2714953 C8.3597032,14.122791 8.60081628,14.122791 8.74945719,14.2714953 C8.80422966,14.3262678 8.89022814,14.3804056 8.95858265,14.4032539 C8.98054241,14.4105527 9.00180403,14.4198824 9.02211363,14.4310527 C9.34732117,14.6104753 9.7422795,14.6976797 10.2295196,14.6976797 C11.0889967,14.6976797 12.0861982,14.4240078 13.0505871,14.1593482 C13.2570469,14.1026718 13.4617931,14.0465665 13.6633659,13.9935076 C13.7943629,13.9590448 13.933801,13.9967445 14.0295735,14.0925169 L21.8573392,21.9206634 L22.9731615,22.9918681 C22.9750021,22.9936452 22.9769061,22.9954858 22.9786832,22.9973263 C23.3103644,23.3289441 23.4930239,23.7741687 23.4930239,24.2510001 C23.4930239,24.7278315 23.3103644,25.1730561 22.9786832,25.5046739 C22.6470654,25.8363551 22.2018408,26.0190146 21.7250094,26.0190146 C21.2493838,26.0190146 20.8052382,25.8373706 20.4739378,25.5072761 L20.1557117,25.199649 C20.094402,25.5489742 19.9263401,25.8722777 19.6675196,26.1311617 C19.3358383,26.4628429 18.8906772,26.645439 18.4138458,26.645439 C17.9369509,26.645439 17.4917897,26.4628429 17.160172,26.1311617 L17.047771,26.0188242 C16.9865249,26.3441587 16.8344567,26.6594653 16.5914396,26.9245691 C16.5842678,26.9323756 16.5768421,26.9398648 16.5689721,26.9470366 C16.2171082,27.2717999 15.7697892,27.4507148 15.3095228,27.4507148 C14.8434808,27.4507148 14.4042222,27.2681187 14.0726044,26.936501 L13.6335996,26.4974327 C13.5760981,26.8566589 13.4093055,27.1985583 13.1344911,27.4733727 C12.8029368,27.8050539 12.3577122,27.9877134 11.8808808,27.9877134 Z M4.92617422,20.6505516 L9.73383832,25.4582791 L11.1697908,26.9390397 C11.3534658,27.1226512 11.6074628,27.2260398 11.8808808,27.2260398 C12.1542989,27.2260398 12.4082324,27.1225877 12.5960327,26.9348508 C12.9830576,26.5478259 12.993022,25.9229883 12.6193253,25.4812544 C12.4874398,25.3254416 12.5019739,25.0933409 12.6522015,24.9551087 C12.8023656,24.816813 13.0349741,24.8215731 13.1792992,24.9660886 L14.6111897,26.3980426 C14.7989266,26.5857795 15.0469577,26.6891681 15.3095863,26.6891681 C15.572786,26.6891681 15.8318604,26.5860334 16.0406051,26.3982965 C16.3632739,26.0353892 16.4517476,25.4226739 16.0415571,25.0124199 L16.0414936,25.0124199 C15.8927892,24.8637155 15.8927892,24.6226024 16.0415571,24.473898 C16.1902615,24.3251936 16.4315015,24.3252571 16.5800155,24.4739615 L16.5800789,24.4739615 L17.6987573,25.5927033 C17.8864942,25.7804402 18.1404277,25.8838288 18.4139092,25.8838288 C18.6873273,25.8838288 18.9412608,25.7804402 19.1290612,25.5927033 C19.3167981,25.4048395 19.4202501,25.158776 19.4202501,24.8998285 C19.4202501,24.640881 19.3167981,24.394881 19.1290612,24.2071441 C18.9812453,24.0593282 18.9801664,23.8199288 19.1267763,23.6709071 C19.2734498,23.5216949 19.5127223,23.5188389 19.6629499,23.6640526 L21.0053513,24.9616459 C21.0068745,24.9631691 21.0084612,24.9646923 21.0099844,24.9662155 C21.1977213,25.1540159 21.4516548,25.2574045 21.7250729,25.2574045 C21.9984909,25.2574045 22.2524879,25.1539524 22.4402883,24.9662155 C22.8271227,24.5793176 22.8278844,23.9263003 22.4427635,23.5383869 L21.3271315,22.4673726 C21.325291,22.4655955 21.323387,22.463755 21.3215464,22.4619144 L13.6462931,14.7862803 C13.5158674,14.8215048 13.3844262,14.8575543 13.2521599,14.8938578 C12.2391549,15.1718455 11.1915602,15.4592898 10.2295196,15.4592898 C9.62353178,15.4592898 9.11718796,15.3461273 8.68268937,15.1134554 C8.62804384,15.0932092 8.57346178,15.068203 8.52014907,15.0393253 L4.47790318,19.0815077 L4.92617422,20.6505516 Z" id="Shape"></path>
            <path d="M10.8515012,12.594874 C10.719108,12.594874 10.5938231,12.525631 10.5242627,12.4087238 C10.441755,12.2699839 10.4556543,12.0942423 10.5590429,11.9702268 L10.7827659,11.7018227 C10.7901281,11.6930007 10.7978712,11.684496 10.8060585,11.6763722 L10.9402923,11.5421384 C11.0820152,11.4004155 11.3093559,11.3928628 11.4602816,11.5248753 L11.8183018,11.8380874 C11.9291161,11.9350023 11.9741146,12.0871974 11.9338762,12.2287934 C11.8936378,12.3703895 11.7753343,12.4761263 11.6300572,12.5003075 C11.4893497,12.523727 11.3603203,12.5359762 11.246523,12.5467657 C11.1273945,12.5580629 11.0245137,12.5678369 10.9262659,12.5875118 C10.9012597,12.5924623 10.8762535,12.594874 10.8515012,12.594874 Z" id="Path"></path>
            <path d="M3.82621876,19.6201565 C3.72524194,19.6201565 3.62839052,19.580045 3.5569261,19.5085806 L0.1115287,16.0631198 C-0.0368583453,15.9147327 -0.0372391503,15.6741908 0.11076709,15.5253595 L8.03094148,7.56044053 C8.10227897,7.48865877 8.19925733,7.44829343 8.30042454,7.44810303 C8.30055148,7.44810303 8.30074188,7.44810303 8.30093228,7.44810303 C8.40190909,7.44810303 8.49876052,7.4882145 8.57022494,7.55961545 L12.0156858,11.0050763 C12.1618515,11.151242 12.1647075,11.3872777 12.0221595,11.5369341 L11.1272041,12.4766341 C11.0653867,12.5415613 10.9826251,12.5825614 10.8935167,12.5925258 C9.2845518,12.7713137 8.58361658,13.2521436 8.46423419,13.6424688 C8.38280537,13.9085246 8.59364445,14.1377693 8.72654542,14.2507415 C8.8072761,14.3194133 8.85582875,14.4186765 8.86033494,14.5245403 C8.86484113,14.6304676 8.825047,14.7334754 8.75040921,14.8088113 L4.0967173,19.5071843 C4.02544328,19.5791565 3.92840145,19.6197122 3.82704384,19.6199661 C3.82685343,19.6201565 3.8265361,19.6201565 3.82621876,19.6201565 Z M0.918581593,15.793129 L3.82494941,18.6994968 L7.95154362,14.5332988 C7.69799091,14.1922879 7.61922773,13.801328 7.73600795,13.4196978 C7.8800792,12.9489593 8.45382552,12.1286417 10.6705553,11.8520503 L11.2144719,11.2809061 L8.30182083,8.36825503 L0.918581593,15.793129 Z" id="Shape"></path>
            <path d="M3.89336739,16.4013381 C3.74955,16.4013381 3.61404686,16.3449155 3.51167376,16.2425424 C3.40949107,16.1406136 3.35300498,16.005047 3.35300498,15.8611661 C3.35300498,15.7172218 3.4094276,15.5816552 3.51186417,15.4791552 C3.61391993,15.3770359 3.74948653,15.3205499 3.89336739,15.3205499 C4.03724824,15.3205499 4.17281485,15.3770359 4.27518794,15.479536 C4.37737064,15.5815917 4.43379326,15.7172218 4.43379326,15.8611661 C4.43379326,16.005047 4.3772437,16.1405501 4.27474367,16.2429232 C4.17275138,16.3449155 4.03718477,16.4013381 3.89336739,16.4013381 Z M3.89336739,15.639728 C3.834533,15.639728 3.77728531,15.663211 3.73641223,15.704211 C3.69572955,15.7448302 3.6721831,15.8020779 3.6721831,15.8609757 C3.6721831,15.919937 3.69566608,15.9771213 3.73660263,16.0181213 C3.77722184,16.058804 3.83446953,16.0822869 3.89336739,16.0822869 C3.95232871,16.0822869 4.0095764,16.058804 4.05051295,16.0177405 C4.09119562,15.9771213 4.11461514,15.919937 4.11461514,15.8609757 C4.11461514,15.8020779 4.09106869,15.7448302 4.05000521,15.7038302 C4.00944947,15.663211 3.95226524,15.639728 3.89336739,15.639728 Z" id="Shape"></path>
            <path d="M21.5907756,22.5734268 C21.4932895,22.5734268 21.3958669,22.5362349 21.3215464,22.4618509 L13.6461662,14.7865977 C13.515677,14.8218221 13.3841089,14.8579352 13.2518426,14.8941751 C12.2389011,15.1721628 11.1914332,15.4595437 10.2293927,15.4595437 C9.61007667,15.4595437 9.09478393,15.3413672 8.65406552,15.0982232 C7.93961173,14.7187509 7.57765651,14.1027352 7.7146194,13.4935106 C7.94113495,12.4861542 9.37169269,11.848623 11.6395773,11.7443459 C11.6419891,11.744219 11.6444009,11.7441555 11.6467492,11.744092 C12.121867,11.7312716 12.4939135,11.4459851 12.9247945,11.1157002 C13.4692188,10.6982744 14.0863134,10.2251875 15.0340738,10.2251875 C15.5568557,10.2251875 16.1197491,10.3701473 16.749918,10.6675561 L17.1592834,10.4471334 C17.3074801,10.3674182 17.4901396,10.394265 17.6090777,10.5131396 L24.7685305,17.6725924 C24.8642395,17.768238 24.9020027,17.9074222 24.8677302,18.0383557 L24.3755397,19.9176922 C24.3580861,19.9842062 24.3229886,20.0448176 24.2738647,20.0929895 L21.8575296,22.4645166 C21.7833995,22.5371234 21.6870558,22.5734268 21.5907756,22.5734268 Z M13.7601539,13.9812584 C13.8598613,13.9812584 13.9570936,14.0204813 14.0294465,14.0927708 L21.5932508,21.6565751 L23.6653382,19.6228856 L24.0755922,18.0565074 L17.2709228,11.2519015 L16.9387338,11.4308164 C16.8288081,11.4900316 16.6969861,11.4914913 16.5858545,11.4351322 C15.9912908,11.1334076 15.4836776,10.9867342 15.0340738,10.9867342 C14.3446262,10.9867342 13.880044,11.3429774 13.3881708,11.7201013 C12.8979477,12.0959559 12.3910327,12.484504 11.6711207,12.5053214 C9.3152066,12.6142316 8.54268004,13.2826715 8.45769704,13.6606205 C8.39937039,13.9200757 8.61357325,14.2143746 9.01671889,14.428514 C9.34719423,14.6107927 9.74215256,14.697997 10.2294561,14.697997 C11.0888697,14.697997 12.0860078,14.4243886 13.0503332,14.1597925 C13.2568565,14.103116 13.4616027,14.0469473 13.6633024,13.9938884 C13.6952901,13.9853203 13.7278489,13.9812584 13.7601539,13.9812584 Z" id="Shape"></path>
            <path d="M25.1704068,18.9933514 C25.0729207,18.9933514 24.9754981,18.9561594 24.9011776,18.8817755 L16.9811301,10.961728 C16.8323623,10.8130236 16.8323623,10.5719105 16.9810667,10.4232062 L20.4264641,6.97774529 C20.4979285,6.90634434 20.5947165,6.86623287 20.6957567,6.86623287 C20.7967335,6.86623287 20.893585,6.90634434 20.9649859,6.97774529 L28.8850968,14.8979197 C28.9565613,14.9693206 28.9966727,15.0661721 28.9966727,15.1671489 C28.9966727,15.2681892 28.9565613,15.3649771 28.8850968,15.4364415 L25.439636,18.8818389 C25.3653155,18.9561594 25.2678294,18.9933514 25.1704068,18.9933514 Z M17.7888812,10.6924354 L25.1704068,18.073961 L28.0773458,15.1670854 L20.6957567,7.78549633 L17.7888812,10.6924354 Z" id="Shape"></path>
            <path d="M25.1287721,15.6360469 C24.9904129,15.6360469 24.8597968,15.5815917 24.7609144,15.4825824 C24.6622224,15.3840174 24.6077673,15.2530204 24.6077673,15.1140266 C24.6077673,14.9750327 24.6622224,14.8440358 24.7612317,14.7451534 C24.7680228,14.7383624 24.7751311,14.7317617 24.7824933,14.7254785 C24.8783928,14.6432246 25.0013293,14.5979722 25.1287721,14.5979722 C25.2671313,14.5979722 25.395653,14.6503329 25.4906004,14.7454707 C25.5892924,14.8439723 25.6437475,14.9750327 25.6437475,15.1139631 C25.6437475,15.2482604 25.5928466,15.3750684 25.5001205,15.4726815 C25.4053635,15.5767682 25.2709393,15.6360469 25.1287721,15.6360469 Z M24.9428758,14.9537076 C24.9041606,14.9972463 24.8821373,15.0548748 24.8821373,15.1140266 C24.8821373,15.1776845 24.9075878,15.2396288 24.9520785,15.284056 C25.0402984,15.3724028 25.1863371,15.3824941 25.2782381,15.303731 L25.0303975,15.0146364 L25.3014672,15.2820885 C25.344752,15.2379152 25.3694409,15.1767959 25.3694409,15.11409 C25.3694409,15.0504321 25.3439904,14.9884878 25.2994997,14.9440606 C25.2554533,14.8999506 25.1930647,14.8744367 25.1288356,14.8744367 C25.0587674,14.8744367 24.9918727,14.903124 24.9428758,14.9537076 Z" id="Shape"></path>
            <path d="M14.0184666,8.37771169 C11.7086934,8.37771169 9.8296108,6.49862904 9.8296108,4.18885585 C9.8296108,1.87908265 11.7086934,0 14.0184666,0 C14.2287345,0 14.3992717,0.170537207 14.3992717,0.380805077 C14.3992717,0.591072947 14.2287345,0.761610154 14.0184666,0.761610154 C12.128658,0.761610154 10.5912209,2.29904718 10.5912209,4.18885585 C10.5912209,6.07866451 12.128658,7.61610154 14.0184666,7.61610154 C15.9082118,7.61610154 17.4457123,6.07866451 17.4457123,4.18885585 C17.4457123,3.97858798 17.6162495,3.80805077 17.8265174,3.80805077 C18.0367853,3.80805077 18.2073225,3.97858798 18.2073225,4.18885585 C18.2073225,6.49862904 16.3282398,8.37771169 14.0184666,8.37771169 Z" id="Path"></path>
            <path d="M13.383855,5.83901118 C13.2859881,5.83901118 13.188502,5.80150188 13.1144989,5.72749876 L11.8451486,4.4581485 C11.6964442,4.30944412 11.6964442,4.06833104 11.8451486,3.91962666 C11.993853,3.77092227 12.2350295,3.77092227 12.3836704,3.91962666 L13.4070841,4.9430403 L16.9480001,1.9923087 C17.1094615,1.8576941 17.3496225,1.87946346 17.4843006,2.04105174 C17.6189152,2.20264003 17.5970824,2.44273763 17.4354941,2.5774157 L13.6274433,5.75079134 C13.556677,5.80981612 13.4701073,5.83901118 13.383855,5.83901118 Z" id="Path"></path>
        </g>
    </g>
</svg>