<?xml version="1.0" encoding="UTF-8"?>
<svg width="50px" height="50px" viewBox="0 0 50 50" version="1.1" xmlns="http://www.w3.org/2000/svg" xmlns:xlink="http://www.w3.org/1999/xlink">
    <!-- Generator: Sketch 62 (91390) - https://sketch.com -->
    <title>phone</title>
    <desc>Created with Sketch.</desc>
    <defs>
        <polygon id="path-1" points="0 0 24.15 0 24.15 24.15 0 24.15"></polygon>
    </defs>
    <g id="phone" stroke="none" stroke-width="1" fill="none" fill-rule="evenodd">
        <g id="Group-3-Copy" transform="translate(13.000000, 13.000000)">
            <mask id="mask-2" fill="white">
                <use xlink:href="#path-1"></use>
            </mask>
            <g id="Clip-2"></g>
            <path d="M2.37104011,13.1170154 C4.47223579,16.6929175 7.45706426,19.6777465 11.0329656,21.7789594 C17.6145064,25.6462643 22.9556777,24.6391579 24.1110763,19.8032324 C24.2453493,19.3091707 24.0235733,18.7883784 23.5792331,18.5340696 C21.3417017,17.2534869 19.0806093,16.4581116 16.7974148,16.1180438 C16.2662423,16.0389255 15.7539188,16.3487915 15.5739322,16.8547595 C15.3725982,17.4207622 15.2040652,18.0351951 15.0697922,18.7126979 C14.9808973,19.1612305 14.5130967,19.4289046 14.0852744,19.2675153 C13.2533754,18.953675 12.3682165,18.4761982 11.4420564,17.8533471 C9.41134276,16.4877264 7.66227205,14.7386554 6.29663489,12.7079245 C5.67380063,11.781781 5.196324,10.8966052 4.88250046,10.0647228 C4.72109448,9.63690045 4.98876848,9.1690997 5.43730104,9.08020481 C6.11480371,8.94593177 6.72923646,8.77739874 7.29523904,8.57606465 C7.80120697,8.39607807 8.11107292,7.88375441 8.03195464,7.35258189 C7.69188691,5.06938688 6.89651176,2.80831078 5.61592925,0.57076223 C5.3616205,0.126405178 4.84082837,-0.095337342 4.34676675,0.0389189249 C-0.489157777,1.19431769 -1.49626404,6.53547336 2.37104011,13.1170154" id="Fill-1" fill="#D31145" mask="url(#mask-2)"></path>
        </g>
    </g>
</svg>