<?xml version="1.0" encoding="UTF-8"?>
<svg width="50px" height="50px" viewBox="0 0 50 50" version="1.1" xmlns="http://www.w3.org/2000/svg" xmlns:xlink="http://www.w3.org/1999/xlink">
    <!-- Generator: Sketch 62 (91390) - https://sketch.com -->
    <title>discussion</title>
    <desc>Created with Sketch.</desc>
    <g id="discussion" stroke="none" stroke-width="1" fill="none" fill-rule="evenodd">
        <g id="Group-2-Copy-2" transform="translate(11.000000, 10.000000)" fill="#D31145" fill-rule="nonzero">
            <path d="M23.0054469,10.5314224 C23.0034137,11.6680332 23.686806,12.693859 24.7367468,13.1302332 C25.7866876,13.5666075 26.9962344,13.3275212 27.8009935,12.5245359 C28.6057527,11.7215505 28.8471069,10.5129339 28.4124364,9.46264544 C27.977766,8.41235702 26.952744,7.72740604 25.8156621,7.72740604 C24.2655902,7.72740604 23.0082294,8.98199297 23.0054469,10.5314224 Z M27.6186358,10.5314224 C27.6206669,11.260808 27.1826829,11.9195071 26.5091243,12.2000437 C25.8355657,12.4805804 25.0592531,12.327635 24.5425635,11.8126013 C24.0258738,11.2975677 23.8706944,10.5220063 24.1494617,9.8479437 C24.428229,9.1738811 25.0859724,8.73423418 25.8156621,8.73423418 C26.8094496,8.73423418 27.6158528,9.53804901 27.6186358,10.5314224 L27.6186358,10.5314224 Z" id="Shape"></path>
            <path d="M26.7473627,14.5385985 C26.3657503,14.4073995 25.9608514,14.3576655 25.5588148,14.3926084 C24.2536383,14.5341534 23.2139667,15.548454 23.040705,16.8492691 C23.0147943,17.0006169 23.0013194,17.1538306 23.0004153,17.3073759 L23.0004153,20.0157436 L20.9506738,20.0157436 C20.1162456,20.0157436 19.4398079,20.6919021 19.4398079,21.5259858 L19.4398079,27.8539007 C19.4112934,28.8010708 20.1061653,29.6154119 21.046362,29.7366765 L21.2024848,29.7366765 C21.6761905,29.738007 22.1309531,29.5508427 22.4663871,29.2164917 C22.8018211,28.8821407 22.9903447,28.4280956 22.9903428,27.9545835 L22.9903428,24.6068799 L27.0948618,24.6068799 C27.92929,24.6068799 28.6057278,23.9307215 28.6057278,23.0966377 L28.6057278,17.1915906 C28.6054708,16.0047941 27.8629496,14.9447748 26.7473627,14.5385985 L26.7473627,14.5385985 Z M27.6186287,23.0966377 C27.6186287,23.3746656 27.3931495,23.6000518 27.1150067,23.6000518 L22.5068657,23.6000518 C22.2361669,23.6172438 22.0204429,23.8328787 22.0032438,24.1034659 L22.0032438,27.9243787 C22.0014093,28.1420604 21.9103991,28.349478 21.7514328,28.4982707 C21.5890142,28.6468767 21.3713633,28.7200064 21.1521226,28.6996364 C20.7328289,28.6291024 20.4310322,28.2584766 20.4470519,27.8337641 L20.4470519,21.5410882 C20.4470519,21.2630603 20.6725311,21.0376742 20.9506738,21.0376742 L23.4687837,21.0376742 C23.7394826,21.0204821 23.9552065,20.8048472 23.9724056,20.5342601 L23.9724056,17.3073759 C23.9732962,17.2078781 23.9817139,17.1085902 23.9975867,17.0103616 C24.0980192,16.1676157 24.7613654,15.5024647 25.6041408,15.3994365 C25.8728102,15.3727443 26.1440851,15.4036363 26.3998635,15.4900511 C27.1217221,15.7443596 27.6042825,16.4265272 27.60352,17.1915906 L27.6186287,23.0966377 Z" id="Shape"></path>
            <path d="M2.81021058,13.340473 C4.36224702,13.340473 5.62042116,12.0828182 5.62042116,10.5314224 C5.62042116,8.98002666 4.36224702,7.72237189 2.81021058,7.72237189 C1.25817413,7.72237189 -6.19895731e-13,8.98002666 -6.19895731e-13,10.5314224 C-6.19895731e-13,12.0828182 1.25817413,13.340473 2.81021058,13.340473 L2.81021058,13.340473 Z M2.81021058,8.73423418 C3.5399002,8.73423418 4.19764364,9.1738811 4.47641095,9.8479437 C4.75517827,10.5220063 4.59999879,11.2975677 4.08330918,11.8126013 C3.56661957,12.327635 2.79030688,12.4805804 2.11674832,12.2000437 C1.44318977,11.9195071 1.0052057,11.260808 1.00723685,10.5314224 C1.01001988,9.53804901 1.81642305,8.73423418 2.81021058,8.73423418 Z" id="Shape"></path>
            <path d="M7.67519878,20.0157436 L5.62042116,20.0157436 L5.62042116,17.3073759 C5.64318598,15.8231487 4.53720696,14.5631143 3.06202156,14.3926084 C2.27175987,14.3234848 1.48951065,14.5945038 0.911555761,15.1376612 C0.331974054,15.6719336 0.00159795112,16.4236395 -1.46346518e-13,17.2117272 L-1.46346518e-13,23.1016719 C-1.46346518e-13,23.9357556 0.676437705,24.6119141 1.5108659,24.6119141 L5.61538494,24.6119141 L5.61538494,27.9495494 C5.61398664,28.4274537 5.8046768,28.8858936 6.14463583,29.221926 C6.48459485,29.5579584 6.94533177,29.7434215 7.4233878,29.7366693 L7.57951061,29.7366693 C8.52066074,29.6232184 9.22336057,28.8164258 9.20620956,27.8690031 L9.20620956,21.5410882 C9.21031456,21.1344217 9.0501662,20.7432873 8.76200261,20.4561901 C8.47383901,20.169093 8.08201748,20.0103004 7.67519878,20.0157436 Z M8.17882075,27.8539007 C8.20154442,28.2759351 7.9090916,28.6499482 7.49389488,28.7298412 C7.27545676,28.751213 7.05818737,28.6790704 6.89595771,28.5313008 C6.73372805,28.3835313 6.64172988,28.1739724 6.64277375,27.9545835 L6.64277375,24.1236024 C6.6255746,23.8530153 6.40985065,23.6373804 6.13915178,23.6201883 L1.53101078,23.6201883 C1.25286805,23.6201883 1.02738881,23.3948022 1.02738881,23.1167743 L1.02738881,17.1915906 C1.02897768,16.6867016 1.24062078,16.2052299 1.6115903,15.8625775 C1.94403816,15.5575422 2.3790857,15.3886266 2.83035546,15.3893658 L2.99655071,15.3893658 C3.95225479,15.5129763 4.65937403,16.3394206 4.6333221,17.3023417 L4.6333221,20.493987 C4.65052125,20.7645741 4.8662452,20.980209 5.13694407,20.997401 L7.6550539,20.997401 C7.93319664,20.997401 8.15867587,21.2227872 8.15867587,21.5008151 L8.17882075,27.8539007 Z" id="Shape"></path>
            <path d="M7.1161784,19.1649738 L20.9506738,19.1649738 L20.9506738,18.1581456 L18.0498113,18.1581456 L18.0498113,15.3893682 C18.0498113,13.5821868 16.5841963,12.1171768 14.7762685,12.1171768 C12.9683408,12.1171768 11.5027257,13.5821868 11.5027257,15.3893682 L11.5027257,18.1581456 L7.1161784,18.1581456 L7.1161784,19.1649738 Z M12.5099697,15.3893682 C12.5099697,14.1382426 13.5246262,13.1240049 14.7762685,13.1240049 C16.0279108,13.1240049 17.0425674,14.1382426 17.0425674,15.3893682 L17.0425674,18.1581456 L12.5099697,18.1581456 L12.5099697,15.3893682 Z" id="Shape"></path>
            <path d="M14.7762685,11.1103486 C16.3060536,11.1103486 17.5461893,9.87072474 17.5461893,8.34157121 C17.5461893,6.81241767 16.3060536,5.5727938 14.7762685,5.5727938 C13.2464835,5.5727938 12.0063477,6.81241767 12.0063477,8.34157121 C12.0091195,9.86957563 13.2476331,11.107578 14.7762685,11.1103486 Z M14.7762685,6.57962195 C15.7497681,6.57962195 16.5389454,7.3684735 16.5389454,8.34157121 C16.5389454,9.31466891 15.7497681,10.1035205 14.7762685,10.1035205 C13.802769,10.1035205 13.0135916,9.31466891 13.0135916,8.34157121 C13.0135916,7.3684735 13.802769,6.57962195 14.7762685,6.57962195 Z" id="Shape"></path>
            <path d="M13.0135916,19.6683879 C12.1791634,19.6683879 11.5027257,20.3445463 11.5027257,21.1786301 L11.5027257,28.2264271 C11.5027257,29.0605109 12.1791634,29.7366693 13.0135916,29.7366693 C13.8480198,29.7366693 14.5244575,29.0605109 14.5244575,28.2264271 L14.5244575,21.1786301 C14.5244575,20.3445463 13.8480198,19.6683879 13.0135916,19.6683879 Z M13.5172136,28.2264271 C13.5172136,28.504455 13.2917344,28.7298412 13.0135916,28.7298412 C12.7354489,28.7298412 12.5099697,28.504455 12.5099697,28.2264271 L12.5099697,21.1786301 C12.5099697,20.9006022 12.7354489,20.675216 13.0135916,20.675216 C13.2917344,20.675216 13.5172136,20.9006022 13.5172136,21.1786301 L13.5172136,28.2264271 Z" id="Shape"></path>
            <path d="M16.5389454,19.6683879 C15.7045172,19.6683879 15.0280795,20.3445463 15.0280795,21.1786301 L15.0280795,28.2264271 C15.0280795,29.0605109 15.7045172,29.7366693 16.5389454,29.7366693 C17.3733736,29.7366693 18.0498113,29.0605109 18.0498113,28.2264271 L18.0498113,21.1786301 C18.0498113,20.3445463 17.3733736,19.6683879 16.5389454,19.6683879 Z M17.0425674,28.2264271 C17.0425674,28.504455 16.8170881,28.7298412 16.5389454,28.7298412 C16.2608027,28.7298412 16.0353234,28.504455 16.0353234,28.2264271 L16.0353234,21.1786301 C16.0353234,20.9006022 16.2608027,20.675216 16.5389454,20.675216 C16.8170881,20.675216 17.0425674,20.9006022 17.0425674,21.1786301 L17.0425674,28.2264271 Z" id="Shape"></path>
            <path d="M21.1067967,5.10461871 L24.9947582,5.10461871 L26.9034855,7.00248977 C26.9964695,7.09734016 27.1231809,7.15162264 27.2560209,7.15351399 C27.32341,7.15225642 27.3899912,7.13860437 27.4524334,7.11324086 C27.6385243,7.03445697 27.7594781,6.85211002 27.7596428,6.65009992 L27.7596428,2.55230935 C27.7568719,1.14385672 26.6153138,0.00276982639 25.2062795,-3.83440658e-14 L21.1067967,-3.83440658e-14 C19.696613,-3.83440658e-14 18.5534333,1.14270782 18.5534333,2.55230935 C18.5534333,3.96191089 19.696613,5.10461871 21.1067967,5.10461871 Z M21.1067967,1.00682815 L25.2012433,1.00682815 C26.0551414,1.00682815 26.7473627,1.69876365 26.7473627,2.55230935 L26.7473627,5.43183786 L25.5588148,4.24378064 C25.4637719,4.14954832 25.3351075,4.09701694 25.2012433,4.09779056 L21.1067967,4.09779056 C20.2528985,4.09779056 19.5606772,3.40585506 19.5606772,2.55230935 C19.5606772,1.69876365 20.2528985,1.00682815 21.1067967,1.00682815 Z" id="Shape"></path>
            <rect id="Rectangle" x="20.5931022" y="2.04889528" width="5.12183541" height="1.00682815"></rect>
            <path d="M0.715143194,7.14847985 C0.775689791,7.17427528 0.840707604,7.18795759 0.906519541,7.18875298 C1.03935954,7.18686163 1.16607096,7.13257915 1.25905492,7.03772875 L3.18289083,5.1398577 L7.07085242,5.1398577 C8.48103608,5.1398577 9.6242158,3.99714987 9.6242158,2.58754834 C9.6242158,1.17794681 8.48103608,0.0352389852 7.07085242,0.0352389852 L2.97640583,0.0352389852 C1.56622217,0.0352389852 0.423003244,1.17794681 0.423003244,2.58754834 L0.423003244,6.6853389 C0.420572677,6.88377519 0.534962062,7.06514552 0.715143194,7.14847985 Z M1.43028639,2.58754834 C1.43028639,1.73400264 2.12250764,1.04206713 2.97640583,1.04206713 L7.07085242,1.04206713 C7.92475061,1.04206713 8.61697186,1.73400264 8.61697186,2.58754834 C8.61697186,3.44109404 7.92475061,4.13302955 7.07085242,4.13302955 L2.97640583,4.13302955 C2.84254161,4.13225592 2.71387718,4.1847873 2.61883423,4.27901963 L1.43028639,5.46707684 L1.43028639,2.58754834 Z" id="Shape"></path>
            <rect id="Rectangle" x="2.46271142" y="2.08413427" width="5.12183541" height="1.00682815"></rect>
        </g>
    </g>
</svg>