<?xml version="1.0" encoding="UTF-8"?>
<svg width="50px" height="50px" viewBox="0 0 50 50" version="1.1" xmlns="http://www.w3.org/2000/svg" xmlns:xlink="http://www.w3.org/1999/xlink">
    <!-- Generator: Sketch 62 (91390) - https://sketch.com -->
    <title>application</title>
    <desc>Created with Sketch.</desc>
    <g id="application" stroke="none" stroke-width="1" fill="none" fill-rule="evenodd">
        <path d="M32.5492188,10 C32.8808594,10 33.1492188,10.2683594 33.1492188,10.6 L33.149,12 L38.2035156,12.0003906 C39.194336,12.0003906 40,12.8060547 40,13.796875 L40,33.0039063 C40,33.9947265 39.194336,34.8003906 38.2035156,34.8003906 L28.4803248,34.7997134 C28.4875922,36.1906905 29.0923277,37.5060705 30.3173574,38.7998392 L31.5197265,38.8 C31.8513672,38.8 32.1197265,39.0683594 32.1197265,39.4 C32.1197265,39.7316406 31.8513672,40 31.5197265,40 L18.4796875,40 C18.1480469,40 17.8796875,39.7316406 17.8796875,39.4 C17.8796875,39.0683594 18.1480469,38.8 18.4796875,38.8 L19.681,38.7993906 L19.7416584,38.7381113 C20.9313793,37.4689612 21.5188964,36.1735045 21.5256495,34.8002168 L11.7964844,34.8003906 C10.805664,34.8003906 10,33.9947265 10,33.0039063 L10,13.796875 C10,12.8060547 10.805664,12.0003906 11.7964844,12.0003906 L16.85,12 L16.8507813,10.6 C16.8507813,10.2683594 17.1191406,10 17.4507813,10 L32.5492188,10 Z M27.2804688,34.8003906 L22.7253906,34.8003906 C22.7177735,36.193164 22.2267578,37.5320313 21.259961,38.8 L28.7441406,38.8 C27.7791016,37.5291015 27.2886719,36.1896485 27.2804688,34.8003906 Z M38.8,30.3003906 L11.2,30.3003906 L11.2,33.0039063 C11.2,33.3326172 11.4677735,33.6003906 11.7964844,33.6003906 L38.2035156,33.6003906 C38.5322265,33.6003906 38.8,33.3326172 38.8,33.0039063 L38.8,30.3003906 Z M16.8507813,13.2003906 L11.7964844,13.2003906 C11.4677735,13.2003906 11.2,13.468164 11.2,13.796875 L11.2,29.1003906 L16.8507813,29.1003906 L16.8507813,13.2003906 Z M38.2035156,13.2003906 L33.1492188,13.2003906 L33.1492188,29.1003906 L38.8,29.1003906 L38.8,13.796875 C38.8,13.468164 38.5322265,13.2003906 38.2035156,13.2003906 Z M31.9492188,11.2 L18.0507813,11.2 L18.05,29.099 L31.949,29.1003906 L31.9492188,12.6003906 L31.9492188,11.2 Z M22.8578125,22.7007813 C23.0921875,22.9351563 23.0921875,23.3148438 22.8578125,23.5492188 L20.9335937,25.4734376 C20.8164063,25.590625 20.6628906,25.6492188 20.509375,25.6492188 C20.3558594,25.6492188 20.2023437,25.590625 20.0851562,25.4734375 L19.0451172,24.4333985 C18.8107422,24.1990235 18.8107422,23.819336 19.0451172,23.584961 C19.2794922,23.350586 19.6591797,23.350586 19.8935547,23.584961 L20.509375,24.2007813 L22.009375,22.7007813 C22.24375,22.4664063 22.6234375,22.4664063 22.8578125,22.7007813 Z M30.530664,23.4871094 C30.8623047,23.4871094 31.130664,23.7554687 31.130664,24.0871094 C31.130664,24.41875 30.8623047,24.6871094 30.530664,24.6871094 L24.7498047,24.6871094 C24.418164,24.6871094 24.1498047,24.41875 24.1498047,24.0871094 C24.1498047,23.7554687 24.418164,23.4871094 24.7498047,23.4871094 L30.530664,23.4871094 Z M22.8578125,17.6951172 C23.0921875,17.9294922 23.0921875,18.3091797 22.8578125,18.5435547 L20.9335937,20.4677735 C20.8164063,20.584961 20.6628906,20.6435547 20.509375,20.6435547 C20.3558594,20.6435547 20.2023437,20.5849609 20.0851562,20.4677734 L19.0451172,19.4277344 C18.8107422,19.1933594 18.8107422,18.8136719 19.0451172,18.5792969 C19.2794922,18.3449219 19.6591797,18.3449219 19.8935547,18.5792969 L20.509375,19.1951172 L22.009375,17.6951172 C22.24375,17.4607422 22.6234375,17.4607422 22.8578125,17.6951172 Z M30.530664,18.4814453 C30.8623047,18.4814453 31.130664,18.7498047 31.130664,19.0814453 C31.130664,19.413086 30.8623047,19.6814453 30.530664,19.6814453 L24.7498047,19.6814453 C24.418164,19.6814453 24.1498047,19.413086 24.1498047,19.0814453 C24.1498047,18.7498047 24.418164,18.4814453 24.7498047,18.4814453 L30.530664,18.4814453 Z M22.8578125,12.6888672 C23.0921875,12.9232422 23.0921875,13.3029297 22.8578125,13.5373047 L20.9335937,15.4615235 C20.8164063,15.578711 20.6628906,15.6373047 20.509375,15.6373047 C20.3558594,15.6373047 20.2023437,15.5787109 20.0851562,15.4615234 L19.0451172,14.4214844 C18.8107422,14.1871094 18.8107422,13.8074219 19.0451172,13.5730469 C19.2794922,13.3386719 19.6591797,13.3386719 19.8935547,13.5730469 L20.509375,14.1888672 L22.009375,12.6888672 C22.24375,12.4544922 22.6234375,12.4544922 22.8578125,12.6888672 Z M30.530664,13.4751953 C30.8623047,13.4751953 31.130664,13.7435547 31.130664,14.0751953 C31.130664,14.406836 30.8623047,14.6751953 30.530664,14.6751953 L24.7498047,14.6751953 C24.418164,14.6751953 24.1498047,14.406836 24.1498047,14.0751953 C24.1498047,13.7435547 24.418164,13.4751953 24.7498047,13.4751953 L30.530664,13.4751953 Z" id="Combined-Shape-Copy" fill="#D31145" fill-rule="nonzero"></path>
    </g>
</svg>