<?xml version="1.0" encoding="UTF-8"?>
<svg width="50px" height="50px" viewBox="0 0 50 50" version="1.1" xmlns="http://www.w3.org/2000/svg" xmlns:xlink="http://www.w3.org/1999/xlink">
    <!-- Generator: Sketch 62 (91390) - https://sketch.com -->
    <title>timer</title>
    <desc>Created with Sketch.</desc>
    <g id="timer" stroke="none" stroke-width="1" fill="none" fill-rule="evenodd">
        <g id="Group-11-Copy" transform="translate(13.000000, 10.000000)" fill="#D0113C">
            <path d="M12.5682727,25.7228182 C7.86645455,25.7228182 4.041,21.8946364 4.041,17.1891818 C4.041,15.3200909 4.63463636,13.5446364 5.75918182,12.0555455 C5.98554545,11.7555455 6.41281818,11.6928182 6.71463636,11.9219091 C7.01463636,12.1491818 7.07463636,12.5764545 6.84736364,12.8773636 C5.90372727,14.1273636 5.40463636,15.6191818 5.40463636,17.1891818 C5.40463636,21.1428182 8.61827273,24.3591818 12.5682727,24.3591818 C16.5219091,24.3591818 19.7373636,21.1428182 19.7373636,17.1891818 C19.7373636,13.2400909 16.5219091,10.0255455 12.5682727,10.0255455 C12.1919091,10.0255455 11.8864545,9.72009091 11.8864545,9.34372727 C11.8864545,8.96736364 12.1919091,8.66190909 12.5682727,8.66190909 C17.2737273,8.66190909 21.101,12.4873636 21.101,17.1891818 C21.101,21.8946364 17.2737273,25.7228182 12.5682727,25.7228182" id="Fill-1"></path>
            <path d="M2.88881818,8.19090909 C3.15245455,8.45454545 3.15245455,8.89181818 2.88881818,9.15545455 C2.75245455,9.29090909 2.57972727,9.35454545 2.407,9.35454545 C2.23427273,9.35454545 2.06154545,9.29090909 1.92427273,9.15545455 L1.54336364,8.77272727 L1.16154545,9.15545455 C1.03427273,9.29090909 0.852454545,9.35454545 0.679727273,9.35454545 C0.507,9.35454545 0.333363636,9.29090909 0.197909091,9.15545455 C-0.0657272727,8.89181818 -0.0657272727,8.45454545 0.197909091,8.19090909 L1.05154545,7.34545455 C1.05154545,7.33727273 1.05154545,7.33727273 1.06154545,7.32727273 C1.07063636,7.31818182 1.07063636,7.31818182 1.07972727,7.31818182 L2.06154545,6.33636364 C2.32518182,6.06363636 2.75245455,6.06363636 3.02427273,6.33636364 C3.28790909,6.6 3.28790909,7.03636364 3.02427273,7.30090909 L2.507,7.80909091 L2.88881818,8.19090909 Z" id="Fill-3"></path>
            <path d="M24.7610909,9.155 C24.6338182,9.29045455 24.452,9.355 24.2801818,9.355 C24.1065455,9.355 23.9338182,9.29045455 23.7974545,9.155 L23.4165455,8.77227273 L23.0347273,9.155 C22.9065455,9.29045455 22.7347273,9.355 22.552,9.355 C22.3792727,9.355 22.2065455,9.29045455 22.0701818,9.155 C21.8065455,8.89136364 21.8065455,8.45409091 22.0701818,8.19045455 L22.452,7.80954545 L21.9429091,7.30045455 C21.6792727,7.03681818 21.6792727,6.59954545 21.9429091,6.33590909 C22.2065455,6.06409091 22.6429091,6.06409091 22.9065455,6.33590909 L23.8974545,7.32681818 L24.7610909,8.19045455 C25.0338182,8.45409091 25.0338182,8.89136364 24.7610909,9.155" id="Fill-5"></path>
            <path d="M13.0069091,18.0728182 C12.8796364,18.1364545 12.716,18.1728182 12.5705455,18.1728182 C12.0341818,18.1728182 11.5978182,17.7273636 11.5978182,17.191 C11.5978182,16.8273636 11.7887273,16.5182727 12.0978182,16.3364545 L12.1069091,16.3364545 C12.2523636,16.2546364 12.4069091,16.2182727 12.5705455,16.2182727 C13.1069091,16.2182727 13.5523636,16.6546364 13.5523636,17.191 C13.5523636,17.5455455 13.3614545,17.8819091 13.0432727,18.0537273 C13.0341818,18.0537273 13.0250909,18.0537273 13.016,18.0637273 C13.016,18.0637273 13.0069091,18.0637273 13.0069091,18.0728182 L13.0069091,18.0728182 Z M14.216,18.8546364 C14.6614545,18.4273636 14.916,17.8264545 14.916,17.191 C14.916,15.9000909 13.8614545,14.8546364 12.5705455,14.8546364 C12.4069091,14.8546364 12.2523636,14.8719091 12.1069091,14.9091818 L9.10690909,9.27281818 C8.92509091,8.94554545 8.516,8.81827273 8.17963636,8.991 C7.85236364,9.17281818 7.72509091,9.58190909 7.89781818,9.91827273 L10.9069091,15.5455455 C10.4796364,15.9728182 10.2341818,16.5637273 10.2341818,17.191 C10.2341818,18.4819091 11.2796364,19.5364545 12.5705455,19.5364545 C12.716,19.5364545 12.8705455,19.5182727 13.016,19.491 L13.2432727,19.9273636 C13.3614545,20.1546364 13.5978182,20.291 13.8432727,20.291 C13.9523636,20.291 14.0614545,20.2637273 14.1614545,20.2091818 C14.4978182,20.0273636 14.6250909,19.6182727 14.4432727,19.2819091 L14.216,18.8546364 Z" id="Fill-7"></path>
            <path d="M12.5700909,27.7727273 C6.73372727,27.7727273 1.98827273,23.0272727 1.98827273,17.1909091 C1.98827273,11.9454545 5.89736364,7.44545455 11.0791818,6.71818182 L11.671,6.63636364 L11.671,4.26363636 L13.4791818,4.26363636 L13.4791818,6.63636364 L14.0619091,6.71818182 C19.2437273,7.44545455 23.1528182,11.9454545 23.1528182,17.1909091 C23.1528182,23.0272727 18.4073636,27.7727273 12.5700909,27.7727273 L12.5700909,27.7727273 Z M8.80645455,2.89909091 L16.3428182,2.89909091 L16.3428182,1.36363636 L8.80645455,1.36363636 L8.80645455,2.89909091 Z M14.8428182,5.46363636 L14.8428182,4.26363636 L17.7064545,4.26363636 L17.7064545,0 L7.44281818,0 L7.44281818,4.26363636 L10.3073636,4.26363636 L10.3073636,5.46363636 C4.74372727,6.52727273 0.624636364,11.4727273 0.624636364,17.1909091 C0.624636364,23.7727273 5.98918182,29.1363636 12.5700909,29.1363636 C19.1519091,29.1363636 24.5164545,23.7727273 24.5164545,17.1909091 C24.5164545,11.4727273 20.3973636,6.52727273 14.8428182,5.46363636 L14.8428182,5.46363636 Z" id="Fill-9"></path>
        </g>
    </g>
</svg>