<?xml version="1.0" encoding="UTF-8"?>
<svg width="50px" height="50px" viewBox="0 0 50 50" version="1.1" xmlns="http://www.w3.org/2000/svg" xmlns:xlink="http://www.w3.org/1999/xlink">
    <!-- Generator: Sketch 62 (91390) - https://sketch.com -->
    <title>fax</title>
    <desc>Created with Sketch.</desc>
    <defs>
        <polygon id="path-1" points="0 0 25.875 0 25.875 24.15 0 24.15"></polygon>
    </defs>
    <g id="fax" stroke="none" stroke-width="1" fill="none" fill-rule="evenodd">
        <g id="Group-3-Copy" transform="translate(12.000000, 13.000000)">
            <mask id="mask-2" fill="white">
                <use xlink:href="#path-1"></use>
            </mask>
            <g id="Clip-2"></g>
            <path d="M21.0190655,14.8193988 L4.85587845,14.8193988 L4.85587845,1.99909299 L15.6509572,1.99909299 L15.6509572,6.3933273 C15.6509572,6.94508259 16.09598,7.39284566 16.6457338,7.39284566 L21.0190655,7.39284566 L21.0190655,14.8193988 Z M16.4721716,19.8699996 L9.40221237,19.8699996 C9.08533106,19.8699996 8.8289361,19.6123825 8.8289361,19.294047 C8.8289361,18.9755989 9.08533106,18.7180381 9.40221237,18.7180381 L16.4721716,18.7180381 C16.7890529,18.7180381 17.0454478,18.9755989 17.0454478,19.294047 C17.0454478,19.6123825 16.7890529,19.8699996 16.4721716,19.8699996 L16.4721716,19.8699996 Z M17.6405664,3.41266698 L19.6122537,5.39375267 L17.6405664,5.39375267 L17.6405664,3.41266698 Z M24.8801114,14.8193988 L23.0086747,14.8193988 L23.0086747,6.3933273 C23.0086747,6.12839472 22.9034396,5.87409771 22.716996,5.68682167 L17.3488877,0.293069002 C17.1625001,0.105230229 16.9094095,0 16.6457338,0 L3.86110188,0 C3.31134809,0 2.8662693,0.447763067 2.8662693,0.999574633 L2.8662693,14.8193988 L0.994776572,14.8193988 C0.445078787,14.8193988 0,15.2671618 0,15.8189734 L0,23.1504816 C0,23.7022932 0.445078787,24.15 0.994776572,24.15 L24.8801114,24.15 C25.4293612,24.15 25.875,23.7022932 25.875,23.1504816 L25.875,15.8189734 C25.875,15.2671618 25.4293612,14.8193988 24.8801114,14.8193988 L24.8801114,14.8193988 Z" id="Fill-1" fill="#D31145" mask="url(#mask-2)"></path>
        </g>
    </g>
</svg>