<?xml version="1.0" encoding="UTF-8"?>
<svg width="50px" height="50px" viewBox="0 0 50 50" version="1.1" xmlns="http://www.w3.org/2000/svg" xmlns:xlink="http://www.w3.org/1999/xlink">
    <!-- Generator: Sketch 62 (91390) - https://sketch.com -->
    <title>conversation</title>
    <desc>Created with Sketch.</desc>
    <g id="conversation" stroke="none" stroke-width="1" fill="none" fill-rule="evenodd">
        <g id="Shape-2-Copy-2" transform="translate(12.000000, 12.000000)" fill="#D31145" fill-rule="nonzero">
            <path d="M13.5256946,0 C6.4433653,0 0.69168272,5.69251985 0.691635625,12.7005424 C0.691629446,12.7020833 0.691629446,12.7036242 0.691635625,12.705165 C0.696932394,14.8037874 1.30958623,16.8374726 2.31600748,18.6806236 L0.026020859,26.0370423 C-0.0382567707,26.2438604 0.0186232112,26.4688918 0.173729561,26.6214148 C0.328835911,26.7739379 0.556604302,26.828814 0.765209592,26.7639198 L8.62957721,24.3683147 C10.1859136,25.0097349 11.8377725,25.4018296 13.5256946,25.4046076 C20.6080238,25.4045614 26.3654979,19.708675 26.3654979,12.7006525 C26.3654979,5.69262992 20.6080238,0 13.5256946,0 L13.5256946,0 Z M13.5256946,1.16483321 C19.9718329,1.16483321 25.1883138,6.32203568 25.1883138,12.7005424 C25.1883138,19.0775809 19.9743756,24.2372474 13.5302913,24.2396644 C11.9047897,24.2368027 10.2976459,23.8955549 8.81235845,23.2420497 C8.68194688,23.1857399 8.53533688,23.1780765 8.39965562,23.2204774 L1.47795875,25.327152 L3.48054785,18.8955456 C3.52812233,18.7418567 3.50939913,18.5755461 3.42881059,18.4359845 C2.4123128,16.6920685 1.87415751,14.7137339 1.86881314,12.7005468 C1.86885429,6.32204228 7.07955041,1.16483321 13.5256886,1.16483321 L13.5256946,1.16483321 Z M21.5647966,7.67826334 C21.4111231,7.6759272 21.2625914,7.73308551 21.1509408,7.83759756 L10.302231,17.6704199 L5.98781292,12.2443977 C5.85767059,12.0800409 5.64865612,11.9970749 5.43980379,12.0268714 C5.23095145,12.0566679 5.0541355,12.1946796 4.97621504,12.3887202 C4.89829458,12.5827609 4.93116153,12.8032168 5.06238797,12.9667273 L9.767672,18.8864412 C9.86893139,19.0137087 10.0191741,19.0935067 10.1823264,19.1066753 C10.3454787,19.119844 10.5068045,19.065194 10.6275692,18.9558469 L21.9464643,8.69758073 C22.1289827,8.53826086 22.1935913,8.28422185 22.1090261,8.05839362 C22.0244608,7.83256539 21.8081619,7.68152133 21.5647966,7.67826334 L21.5647966,7.67826334 Z" id="Shape"></path>
        </g>
    </g>
</svg>