<?xml version="1.0" encoding="UTF-8"?>
<svg width="50px" height="50px" viewBox="0 0 50 50" version="1.1" xmlns="http://www.w3.org/2000/svg" xmlns:xlink="http://www.w3.org/1999/xlink">
    <!-- Generator: Sketch 62 (91390) - https://sketch.com -->
    <title>refrigeration shelf life</title>
    <desc>Created with Sketch.</desc>
    <g id="refrigeration-shelf-life" stroke="none" stroke-width="1" fill="none" fill-rule="evenodd">
        <g id="Group-13-Copy" transform="translate(16.000000, 10.000000)" stroke="#D31046" stroke-width="1.03448276">
            <path d="M15.7054138,29.6500345 L2.11748276,29.6500345 C1.23713793,29.6500345 0.517137931,28.9300345 0.517137931,28.0496897 L0.517137931,2.11727586 C0.517137931,1.23796552 1.23713793,0.516931034 2.11748276,0.516931034 L15.7054138,0.516931034 C16.5857586,0.516931034 17.3057586,1.23796552 17.3057586,2.11727586 L17.3057586,28.0496897 C17.3057586,28.9300345 16.5857586,29.6500345 15.7054138,29.6500345 Z" id="Stroke-1"></path>
            <line x1="3.48010345" y1="15.3304138" x2="14.3432069" y2="15.3304138" id="Stroke-3" stroke-linecap="round"></line>
            <line x1="3.48010345" y1="19.4683448" x2="14.3432069" y2="19.4683448" id="Stroke-5" stroke-linecap="round"></line>
            <line x1="3.48010345" y1="23.6062759" x2="14.3432069" y2="23.6062759" id="Stroke-7" stroke-linecap="round"></line>
            <path d="M6.16272414,5.61548276 C6.16272414,6.15237931 5.72824138,6.58686207 5.19237931,6.58686207 C4.65548276,6.58686207 4.221,6.15237931 4.221,5.61548276 C4.221,5.07858621 4.65548276,4.64513793 5.19237931,4.64513793 C5.72824138,4.64513793 6.16272414,5.07858621 6.16272414,5.61548276 Z" id="Stroke-9"></path>
            <path d="M13.9314828,5.61548276 C13.9314828,6.15237931 13.497,6.58686207 12.9611379,6.58686207 C12.4242414,6.58686207 11.9897586,6.15237931 11.9897586,5.61548276 C11.9897586,5.07858621 12.4242414,4.64513793 12.9611379,4.64513793 C13.497,4.64513793 13.9314828,5.07858621 13.9314828,5.61548276 Z" id="Stroke-11"></path>
        </g>
    </g>
</svg>