<?xml version="1.0" encoding="UTF-8"?>
<svg width="50px" height="50px" viewBox="0 0 50 50" version="1.1" xmlns="http://www.w3.org/2000/svg" xmlns:xlink="http://www.w3.org/1999/xlink">
    <!-- Generator: Sketch 62 (91390) - https://sketch.com -->
    <title>idea</title>
    <desc>Created with Sketch.</desc>
    <defs>
        <polygon id="path-1" points="0 0.0420168067 22.9411765 0.0420168067 22.9411765 29.4537815 0 29.4537815"></polygon>
    </defs>
    <g id="idea" stroke="none" stroke-width="1" fill="none" fill-rule="evenodd">
        <g id="Group-3-Copy" transform="translate(14.000000, 10.000000)">
            <mask id="mask-2" fill="white">
                <use xlink:href="#path-1"></use>
            </mask>
            <g id="Clip-2"></g>
            <path d="M13.9965512,15.3705272 L13.9965512,13.2453559 C13.9965512,12.4744831 14.1840006,11.9312483 14.4635304,11.5948974 C14.6148054,11.410415 14.792389,11.2918191 14.9798384,11.2358156 C15.1570932,11.1831063 15.3448715,11.1864006 15.5254149,11.2456985 C15.7852132,11.3280568 16.0351457,11.5326346 16.2196354,11.851855 C16.9990303,13.2028591 16.5188967,14.1812747 15.4731263,14.790396 C15.0521873,15.0341763 14.5490337,15.2255768 13.9965512,15.3705272 L13.9965512,15.3705272 Z M20.9190249,15.6999601 C20.3366163,17.0242801 19.4819128,18.2036497 18.4292364,19.1655937 C18.416082,19.1817359 18.399968,19.1949132 18.3868136,19.2117143 C18.3572163,19.2413632 18.3276191,19.2710122 18.2980218,19.2973668 C18.2585588,19.3303101 18.2158071,19.3662183 18.1664783,19.4024559 L18.1431294,19.4222218 L18.1270153,19.4357286 C18.0645322,19.4884378 18.002049,19.5375233 17.9461431,19.5836439 C17.8803714,19.6363532 17.8178882,19.6860976 17.7583648,19.7318887 C17.7488279,19.7421011 17.7356736,19.7483604 17.7258078,19.7582434 C16.1140718,21.1553681 15.2758112,22.9702136 14.9663552,23.7674411 L13.9965512,23.7674411 L13.9965512,16.5498968 C14.7595032,16.374968 15.4632606,16.1213047 16.0450115,15.7823183 C17.6629958,14.846729 18.4065451,13.3412209 17.2094998,11.2753475 C16.8773526,10.69884 16.4005076,10.3203217 15.8805822,10.1523109 C15.4764149,10.0205378 15.0521873,10.0136197 14.6509798,10.1355098 C14.2563495,10.2544351 13.8847393,10.4945917 13.5821894,10.8605915 C13.14119,11.3909784 12.8455461,12.1849116 12.8455461,13.2453559 L12.8455461,15.5843292 C12.3982984,15.6403327 11.9342789,15.6666874 11.4709171,15.6666874 C11.0072265,15.6666874 10.5468244,15.6403327 10.0992478,15.5843292 L10.0992478,13.2453559 C10.0992478,12.1849116 9.80031537,11.3909784 9.35931597,10.8605915 C9.05676606,10.4945917 8.68548469,10.2544351 8.2905255,10.1355098 C7.88964686,10.0136197 7.46541925,10.0205378 7.06421175,10.1523109 C6.54461515,10.3203217 6.06448158,10.69884 5.73233439,11.2753475 C4.53857764,13.3412209 5.27850951,14.846729 6.89649386,15.7823183 C7.4785736,16.1213047 8.18233102,16.3785918 8.94824271,16.5498968 L8.94824271,23.7674411 L7.97810982,23.7674411 C7.666023,22.9702136 6.8271047,21.14845 5.20912035,19.7516547 C5.19958345,19.745066 5.19267742,19.7388068 5.18281166,19.7318887 C5.12690569,19.6860976 5.06475142,19.6363532 4.9989797,19.5836439 C4.93978515,19.5375233 4.88026174,19.4884378 4.81810746,19.4357286 C4.80166453,19.4189275 4.78160416,19.4060796 4.76549008,19.3961967 C4.72273846,19.3629239 4.67998685,19.3270158 4.6438124,19.2973668 C4.61092654,19.2677178 4.57771182,19.2344451 4.54515482,19.1982075 C4.5349602,19.188654 4.52180586,19.1751472 4.51226896,19.1685586 L4.51226896,19.1655937 C3.45992141,18.2036497 2.60817762,17.0242801 2.0228093,15.6999601 C1.46374966,14.4247255 1.15100513,13.0150824 1.15100513,11.5326346 C1.15100513,8.67645176 2.30529884,6.0904039 4.17354459,4.21889589 C6.04146148,2.35101164 8.62300155,1.19140801 11.4709171,1.19140801 C14.3221212,1.19140801 16.9003727,2.35101164 18.7682896,4.21889589 C20.6358776,6.0904039 21.7937888,8.67645176 21.7937888,11.5326346 C21.7937888,13.0150824 21.4813731,14.4247255 20.9190249,15.6999601 L20.9190249,15.6999601 Z M12.8455461,23.7674411 L10.0992478,23.7674411 L10.0992478,16.7442622 C10.550113,16.7933477 11.010515,16.8197023 11.4709171,16.8197023 C11.9313191,16.8197023 12.3950098,16.7933477 12.8455461,16.7442622 L12.8455461,23.7674411 Z M8.94824271,15.3705272 C8.39608911,15.2255768 7.89260658,15.0341763 7.47199642,14.790396 C6.42293747,14.1812747 5.9428039,13.2028591 6.72548739,11.851855 C6.90931935,11.5326346 7.1559633,11.3280568 7.41937905,11.2456985 C7.5969627,11.1864006 7.78408324,11.1831063 7.96528434,11.2358156 C8.14944516,11.2918191 8.33031739,11.410415 8.48126349,11.5948974 C8.76112217,11.9312483 8.94824271,12.4744831 8.94824271,13.2453559 L8.94824271,15.3705272 Z M19.5802415,3.40552619 C17.5054725,1.32647548 14.6374966,0.0420168067 11.4709171,0.0420168067 C8.30367984,0.0420168067 5.43636164,1.32647548 3.36126383,3.40552619 C1.28616601,5.48391803 0,8.35657247 0,11.5326346 C0,13.1765045 0.348918983,14.7446048 0.973421479,16.1644604 C1.61798435,17.6301072 2.56180855,18.938285 3.72925661,20.005318 C3.77233709,20.0514386 3.82495447,20.1008535 3.8874376,20.1568571 C3.94334356,20.2066015 4.0058267,20.2593107 4.07488701,20.3083962 L4.07488701,20.31202 C4.13737014,20.3647292 4.20610159,20.4207328 4.27845049,20.4800307 C4.33797389,20.5258219 4.40045703,20.5752368 4.46918848,20.6315698 C5.91945494,21.8863796 6.65938681,23.5272846 6.91622538,24.1989981 C6.28810544,24.6602041 5.99542128,25.1447999 6.03126686,25.6685981 C6.08717283,26.5511487 7.09380903,27.0028011 7.20562095,27.0518866 L7.21219812,27.0390387 C7.31085571,27.1213969 7.43582198,27.1704824 7.57394259,27.1704824 L15.0357444,27.1704824 C15.0094357,27.3388226 14.8384292,27.7371069 13.9307795,28.3136144 C13.9011822,28.3073552 13.8715849,28.3040609 13.8386991,28.3040609 L9.10313512,28.3040609 C8.78381341,28.3040609 8.52763256,28.5606891 8.52763256,28.8805684 C8.52763256,29.1968239 8.78381341,29.4537815 9.10313512,29.4537815 L13.8386991,29.4537815 C14.0060881,29.4537815 14.1576919,29.3809769 14.2629267,29.2660048 C15.3478312,28.6203164 15.9401056,27.9449791 16.0187028,27.2630531 C16.0450115,27.0126841 16.0025887,26.804812 15.9364881,26.6437193 C15.9433942,26.630542 15.9433942,26.6137409 15.9433942,26.5975987 C15.9433942,26.2777194 15.6868844,26.0210912 15.3678916,26.0210912 L7.57394259,26.0210912 C7.51803663,26.0210912 7.46541925,26.0276799 7.41609046,26.0474459 C7.22864106,25.9321444 7.02474872,25.7605098 7.01488296,25.6056764 C7.0050172,25.4673146 7.16582906,25.2238637 7.61340563,24.9204561 L15.3678916,24.9204561 L15.3678916,24.9171618 C15.6145356,24.9171618 15.8411191,24.7593634 15.9170855,24.5155831 C15.9203741,24.508665 16.6044,22.2487557 18.471988,20.6315698 C18.5413772,20.5752368 18.6071489,20.5258219 18.6660146,20.4800307 C18.7386923,20.4207328 18.804464,20.3647292 18.8669472,20.31202 C18.9360075,20.2593107 18.9984906,20.2066015 19.0576852,20.1568571 C19.1168797,20.1008535 19.1691682,20.0514386 19.2155373,20.005318 C20.3796968,18.938285 21.3231921,17.6301072 21.9713724,16.1644604 C22.5958749,14.7446048 22.9411765,13.1765045 22.9411765,11.5326346 C22.9411765,8.35657247 21.6589568,5.48391803 19.5802415,3.40552619 L19.5802415,3.40552619 Z" id="Fill-1" fill="#CF1F43" mask="url(#mask-2)"></path>
        </g>
    </g>
</svg>