<?xml version="1.0" encoding="UTF-8"?>
<svg width="50px" height="50px" viewBox="0 0 50 50" version="1.1" xmlns="http://www.w3.org/2000/svg" xmlns:xlink="http://www.w3.org/1999/xlink">
    <!-- Generator: Sketch 62 (91390) - https://sketch.com -->
    <title>download</title>
    <desc>Created with Sketch.</desc>
    <g id="download" stroke="none" stroke-width="1" fill="none" fill-rule="evenodd">
        <g id="download-arrow-copy" transform="translate(15.000000, 12.000000)" fill="#D31145" fill-rule="nonzero">
            <path d="M17.1100409,16.396701 C17.6659764,15.8474227 18.5411991,15.8474227 19.0971346,16.396701 C19.6342885,16.9459794 19.6342885,17.8107216 19.0971346,18.36 L10.7706236,26.5880412 C10.5126896,26.8428866 10.154587,27 9.75766915,27 C9.36075126,27 9.00264869,26.8428866 8.74346256,26.5880412 L0.416951601,18.36 C-0.138983867,17.8107216 -0.138983867,16.9459794 0.416951601,16.396701 C0.97288707,15.8474227 1.8481098,15.8474227 2.40404527,16.396701 L8.34654467,22.2878351 L8.34654467,1.37443299 C8.34529256,0.608659794 8.98136287,0 9.75641705,0 C10.5314712,0 11.1475078,0.608659794 11.1475078,1.37443299 L11.1475078,22.2865979 L17.1100409,16.396701 Z" id="Path"></path>
        </g>
    </g>
</svg>