<?xml version="1.0" encoding="UTF-8"?>
<svg width="50px" height="50px" viewBox="0 0 50 50" version="1.1" xmlns="http://www.w3.org/2000/svg" xmlns:xlink="http://www.w3.org/1999/xlink">
    <!-- Generator: Sketch 62 (91390) - https://sketch.com -->
    <title>user</title>
    <desc>Created with Sketch.</desc>
    <g id="user" stroke="none" stroke-width="1" fill="none" fill-rule="evenodd">
        <path d="M21.0445025,19.7261047 C21.0445025,17.296237 23.0445868,15.315338 25.4951325,15.315338 C27.9562982,15.315338 29.9554975,17.296237 29.9554975,19.7261047 C29.9554975,22.1629875 27.9562982,24.1456403 25.4951325,24.1456403 C23.0445868,24.1456403 21.0445025,22.1629875 21.0445025,19.7261047 M28.4510093,24.6445919 C30.150196,23.6537039 31.2829871,21.8218765 31.2829871,19.7261047 C31.2829871,16.5684166 28.6908424,14 25.4951325,14 C22.3100426,14 19.7170129,16.5684166 19.7170129,19.7261047 C19.7170129,21.8218765 20.848919,23.6458119 22.5392558,24.6445919 C18.185975,26.1274162 15,30.8100194 15,36.342331 C15,36.7018567 15.3008976,37 15.6637448,37 C16.0354419,37 16.3274896,36.7018567 16.3274896,36.342331 C16.3274896,30.3443898 20.4418222,25.4609783 25.4951325,25.4609783 C30.5581778,25.4609783 34.6725104,30.3443898 34.6725104,36.342331 C34.6725104,36.7018567 34.9645581,37 35.3362552,37 C35.6999874,37 36,36.7018567 36,36.342331 C36,30.8100194 32.81491,26.1274162 28.4510093,24.6445919" id="Fill-1-Copy" fill="#D0113C"></path>
    </g>
</svg>