<?xml version="1.0" encoding="UTF-8"?>
<svg width="50px" height="50px" viewBox="0 0 50 50" version="1.1" xmlns="http://www.w3.org/2000/svg" xmlns:xlink="http://www.w3.org/1999/xlink">
    <!-- Generator: Sketch 62 (91390) - https://sketch.com -->
    <title>share</title>
    <desc>Created with Sketch.</desc>
    <defs>
        <polygon id="path-1" points="0.0004 -2.84217094e-15 23.296 -2.84217094e-15 23.296 23.71992 0.0004 23.71992"></polygon>
    </defs>
    <g id="share" stroke="none" stroke-width="1" fill="none" fill-rule="evenodd">
        <g id="Group-3-Copy" transform="translate(13.000000, 13.000000)">
            <mask id="mask-2" fill="white">
                <use xlink:href="#path-1"></use>
            </mask>
            <g id="Clip-2"></g>
            <path d="M18.9596,19.44792 C19.8476,19.44792 20.5764,20.17592 20.5764,21.06472 C20.5764,21.95192 19.8476,22.67992 18.9596,22.67992 C18.0644,22.67992 17.3436,21.95192 17.3436,21.06472 C17.3436,20.17592 18.0644,19.44792 18.9596,19.44792 M11.6556,15.60792 C10.7684,15.60792 10.0404,14.88792 10.0404,13.99192 C10.0404,13.10392 10.7684,12.37592 11.6556,12.37592 C12.5516,12.37592 13.2724,13.10392 13.2724,13.99192 C13.2724,14.88792 12.5516,15.60792 11.6556,15.60792 M10.0404,2.65592 C10.0404,1.76792 10.7684,1.03992 11.6556,1.03992 C12.5516,1.03992 13.2724,1.76792 13.2724,2.65592 C13.2724,3.55192 12.5516,4.27192 11.6556,4.27192 C10.7684,4.27192 10.0404,3.55192 10.0404,2.65592 M4.7916,22.67992 C3.9044,22.67992 3.1764,21.95192 3.1764,21.06472 C3.1764,20.17592 3.9044,19.44792 4.7916,19.44792 C5.6796,19.44792 6.4084,20.17592 6.4084,21.06472 C6.4084,21.95192 5.6796,22.67992 4.7916,22.67992 M2.6556,11.33592 C1.7684,11.33592 1.0404,10.61592 1.0404,9.71992 C1.0404,8.83192 1.7684,8.10392 2.6556,8.10392 C3.5436,8.10392 4.2724,8.83192 4.2724,9.71992 C4.2724,10.61592 3.5436,11.33592 2.6556,11.33592 M20.6404,8.10392 C21.5364,8.10392 22.2556,8.83192 22.2556,9.71992 C22.2556,10.61592 21.5364,11.33592 20.6404,11.33592 C19.7516,11.33592 19.0236,10.61592 19.0236,9.71992 C19.0236,8.83192 19.7516,8.10392 20.6404,8.10392 M20.6404,12.37592 C22.1044,12.37592 23.2964,11.18392 23.2964,9.71992 C23.2964,8.25592 22.1044,7.06472 20.6404,7.06472 C19.1764,7.06472 17.9836,8.25592 17.9836,9.71992 C17.9836,10.07992 18.0556,10.43192 18.1916,10.75192 L13.8724,12.53592 C13.4964,11.95192 12.8876,11.52792 12.1764,11.39192 L12.1764,5.25592 C13.3916,5.01592 14.3116,3.94392 14.3116,2.65592 C14.3116,1.19192 13.1196,-8e-05 11.6556,-8e-05 C10.1916,-8e-05 9.0004,1.19192 9.0004,2.65592 C9.0004,3.94392 9.9196,5.01592 11.1364,5.25592 L11.1364,11.39192 C10.4236,11.52792 9.8156,11.95192 9.4404,12.53592 L5.1044,10.75192 L5.1044,10.74392 C5.2404,10.43192 5.3116,10.07992 5.3116,9.71992 C5.3116,8.25592 4.1196,7.06472 2.6556,7.06472 C1.1916,7.06472 0.0004,8.25592 0.0004,9.71992 C0.0004,11.18392 1.1916,12.37592 2.6556,12.37592 C3.3764,12.37592 4.0324,12.08792 4.5116,11.62392 L9.0476,13.49672 C9.0156,13.65592 9.0004,13.82392 9.0004,13.99192 C9.0004,14.59992 9.2004,15.15992 9.5516,15.60792 L6.1436,18.78392 C5.7516,18.54392 5.2876,18.40792 4.7916,18.40792 C3.3284,18.40792 2.1364,19.59992 2.1364,21.06472 C2.1364,22.52792 3.3284,23.71992 4.7916,23.71992 C6.2556,23.71992 7.4476,22.52792 7.4476,21.06472 C7.4476,20.47192 7.2476,19.91192 6.9116,19.47192 L10.3364,16.29672 C10.7196,16.51992 11.1764,16.64792 11.6556,16.64792 C12.1596,16.64792 12.6236,16.51192 13.0156,16.26472 L16.6964,19.67992 C16.4476,20.07992 16.3044,20.55992 16.3044,21.06472 C16.3044,22.52792 17.4964,23.71992 18.9596,23.71992 C20.4236,23.71992 21.6156,22.52792 21.6156,21.06472 C21.6156,19.59992 20.4236,18.40792 18.9596,18.40792 C18.3836,18.40792 17.8404,18.59192 17.4004,18.91992 L13.7916,15.56792 C14.1196,15.12792 14.3116,14.57592 14.3116,13.99192 C14.3116,13.82392 14.2964,13.65592 14.2644,13.49672 L18.7916,11.63192 C19.2724,12.09672 19.9284,12.37592 20.6404,12.37592" id="Fill-1" fill="#D0113C" mask="url(#mask-2)"></path>
        </g>
    </g>
</svg>