<?xml version="1.0" encoding="UTF-8"?>
<svg width="50px" height="50px" viewBox="0 0 50 50" version="1.1" xmlns="http://www.w3.org/2000/svg" xmlns:xlink="http://www.w3.org/1999/xlink">
    <!-- Generator: Sketch 62 (91390) - https://sketch.com -->
    <title>weight</title>
    <desc>Created with Sketch.</desc>
    <defs>
        <polygon id="path-1" points="0.000122727273 0 23.3035773 0 23.3035773 6.30045 0.000122727273 6.30045"></polygon>
        <polygon id="path-3" points="0 0.0631863636 23.3034545 0.0631863636 23.3034545 19.8636364 0 19.8636364"></polygon>
    </defs>
    <g id="weight" stroke="none" stroke-width="1" fill="none" fill-rule="evenodd">
        <g id="Group-17-Copy" transform="translate(13.000000, 11.000000)">
            <path d="M11.6520955,20.25 C11.4041864,20.25 11.2041409,20.4512727 11.2041409,20.7004091 L11.2041409,21.1495909 C11.2041409,21.3987273 11.4041864,21.6 11.6520955,21.6 C11.9000045,21.6 12.10005,21.3987273 12.10005,21.1495909 L12.10005,20.7004091 C12.10005,20.4512727 11.9000045,20.25 11.6520955,20.25" id="Fill-1" fill="#D31145"></path>
            <path d="M7.17034091,15.7502045 L6.72238636,15.7502045 C6.47447727,15.7502045 6.27443182,15.9514773 6.27443182,16.2006136 C6.27443182,16.4485227 6.47447727,16.6497955 6.72238636,16.6497955 L7.17034091,16.6497955 C7.41825,16.6497955 7.61829545,16.4485227 7.61829545,16.2006136 C7.61829545,15.9514773 7.41825,15.7502045 7.17034091,15.7502045" id="Fill-3" fill="#D31145"></path>
            <g id="Group-7">
                <mask id="mask-2" fill="white">
                    <use xlink:href="#path-1"></use>
                </mask>
                <g id="Clip-6"></g>
                <path d="M1.96989545,3.05922273 C2.04598636,3.11690455 3.84394091,4.45095 8.06698636,5.12226818 L8.06698636,5.85004091 C8.06698636,6.09917727 8.26703182,6.30045 8.51494091,6.30045 C8.76285,6.30045 8.96289545,6.09917727 8.96289545,5.85004091 L8.96289545,4.73445 C8.96289545,4.51108636 8.79966818,4.32085909 8.57875909,4.28895 C4.33853182,3.67776818 2.52830455,2.35354091 2.50989545,2.34004091 C1.69866818,1.72885909 1.29489545,1.23058636 1.09239545,0.90045 L22.20885,0.90045 C22.0051227,1.23549545 21.5964409,1.73622273 20.7766227,2.35476818 C20.75085,2.37563182 18.1367591,4.50004091 11.65185,4.50004091 C11.1989864,4.50004091 10.7485773,4.48776818 10.31535,4.46199545 C10.0711227,4.44726818 9.85512273,4.63749545 9.84162273,4.88540455 C9.82689545,5.13331364 10.0158955,5.34685909 10.2625773,5.36035909 C10.7142136,5.38613182 11.1818045,5.39963182 11.65185,5.39963182 C12.6336682,5.39963182 13.5234409,5.34931364 14.3408045,5.26831364 L14.3408045,5.85004091 C14.3408045,6.09917727 14.5420773,6.30045 14.7887591,6.30045 C15.0366682,6.30045 15.2379409,6.09917727 15.2379409,5.85004091 L15.2379409,5.16522273 C19.4499409,4.58595 21.2540318,3.12549545 21.3325773,3.05922273 C23.2090773,1.64663182 23.3035773,0.637813636 23.3035773,0.450040909 C23.3035773,0.200904545 23.1035318,-0.000368181818 22.85685,-0.000368181818 L0.448077273,-0.000368181818 C0.200168182,-0.000368181818 0.000122727273,0.200904545 0.000122727273,0.450040909 C0.000122727273,0.637813636 0.0946227273,1.64663182 1.96989545,3.05922273" id="Fill-5" fill="#D31145" mask="url(#mask-2)"></path>
            </g>
            <path d="M12.1002955,14.9328409 L12.1002955,11.2497955 C12.1002955,11.0018864 11.90025,10.7993864 11.6523409,10.7993864 C11.4044318,10.7993864 11.2043864,11.0018864 11.2043864,11.2497955 L11.2043864,14.9328409 C10.6840227,15.1193864 10.30725,15.6139773 10.30725,16.2006136 C10.30725,16.9443409 10.9110682,17.5493864 11.6523409,17.5493864 C12.3936136,17.5493864 12.9962045,16.9443409 12.9962045,16.2006136 C12.9962045,15.6139773 12.6206591,15.1193864 12.1002955,14.9328409 M11.6523409,16.6497955 C11.4044318,16.6497955 11.2043864,16.4472955 11.2043864,16.2006136 C11.2043864,15.9527045 11.4044318,15.7502045 11.6523409,15.7502045 C11.8990227,15.7502045 12.1002955,15.9527045 12.1002955,16.2006136 C12.1002955,16.4472955 11.8990227,16.6497955 11.6523409,16.6497955" id="Fill-8" fill="#D31145"></path>
            <path d="M15.68565,16.2002455 C15.68565,16.4481545 15.8856955,16.6494273 16.1336045,16.6494273 L16.5815591,16.6494273 C16.8294682,16.6494273 17.0295136,16.4481545 17.0295136,16.2002455 C17.0295136,15.9511091 16.8294682,15.7498364 16.5815591,15.7498364 L16.1336045,15.7498364 C15.8856955,15.7498364 15.68565,15.9511091 15.68565,16.2002455" id="Fill-10" fill="#D31145"></path>
            <g id="Group-14" transform="translate(0.000000, 7.136364)">
                <mask id="mask-4" fill="white">
                    <use xlink:href="#path-3"></use>
                </mask>
                <g id="Clip-13"></g>
                <path d="M21.5116364,2.28209545 C21.4944545,1.05605 20.4954545,0.0631863636 19.2706364,0.0631863636 L4.03281818,0.0631863636 C2.808,0.0631863636 1.81022727,1.05605 1.79304545,2.28209545 L0.00368181818,15.7538682 C0.00122727273,15.7735045 0,15.7943682 0,15.8140045 C0,17.0547773 1.00513636,18.0635955 2.241,18.0635955 L2.68895455,18.0635955 L2.68895455,19.4135955 C2.68895455,19.6627318 2.889,19.8640045 3.13690909,19.8640045 L20.1665455,19.8640045 C20.4144545,19.8640045 20.6157273,19.6627318 20.6157273,19.4135955 L20.6157273,18.0635955 L21.0636818,18.0635955 C22.2995455,18.0635955 23.3034545,17.0547773 23.3034545,15.8140045 C23.3034545,15.7943682 23.3022273,15.7735045 23.301,15.7538682 L21.5116364,2.28209545 Z M21.0636818,17.1627773 L20.1665455,17.1627773 C19.9198636,17.1627773 19.7185909,17.3652773 19.7185909,17.6131864 L19.7185909,18.9631864 L3.58609091,18.9631864 L3.58609091,18.0635955 L18.3747273,18.0635955 C18.6226364,18.0635955 18.8226818,17.8623227 18.8226818,17.6131864 C18.8226818,17.3652773 18.6226364,17.1627773 18.3747273,17.1627773 L2.241,17.1627773 C1.50831818,17.1627773 0.910636364,16.5724591 0.897136364,15.8410045 L2.68527273,2.37291364 C2.68772727,2.35327727 2.68895455,2.33364091 2.68895455,2.31400455 C2.68895455,1.56905 3.29277273,0.964004545 4.03281818,0.964004545 L19.2706364,0.964004545 C20.0119091,0.964004545 20.6157273,1.56905 20.6157273,2.31400455 C20.6157273,2.33364091 20.6169545,2.35327727 20.6194091,2.37291364 L22.4075455,15.8410045 C22.3928182,16.5724591 21.7951364,17.1627773 21.0636818,17.1627773 L21.0636818,17.1627773 Z" id="Fill-12" fill="#D31145" mask="url(#mask-4)"></path>
            </g>
            <path d="M11.6520955,9.00020455 C7.69782273,9.00020455 4.48114091,12.2303864 4.48114091,16.2006136 C4.48114091,20.1696136 7.69782273,23.3997955 11.6520955,23.3997955 C15.6063682,23.3997955 18.82305,20.1696136 18.82305,16.2006136 C18.82305,12.2303864 15.6063682,9.00020455 11.6520955,9.00020455 M11.6520955,22.5002045 C8.19241364,22.5002045 5.37827727,19.6737955 5.37827727,16.2006136 C5.37827727,12.7262045 8.19241364,9.89979545 11.6520955,9.89979545 C15.1117773,9.89979545 17.9259136,12.7262045 17.9259136,16.2006136 C17.9259136,19.6737955 15.1117773,22.5002045 11.6520955,22.5002045" id="Fill-15" fill="#D31145"></path>
        </g>
    </g>
</svg>