{
    "modular-ipet-vizier_predasite": {
        "name": "Vizier Predasite",
        "parts": {
            "blueprint": [
                "Acquired through Revivification with Son."
            ]
        },
        "mastery": 6000,
        "partStates": {
            "blueprint": 0
        },
        "state": {
            "item": 0,
            "parts": {
                "blueprint": 0
            }
        },
        "hash": "",
        "links": {
            "wiki": "https://warframe.fandom.com/wiki/Vizier_Predasite",
            "market": ""
        },
        "search": "vizier predasite",
        "type": "modular-ipet",
        "masteryLimit": -1,
        "variant": "normal"
    },
    "modular-ipet-pharaoh_predasite": {
        "name": "Pharaoh Predasite",
        "parts": {
            "blueprint": [
                "Acquired through Revivification with Son."
            ]
        },
        "mastery": 6000,
        "partStates": {
            "blueprint": 0
        },
        "state": {
            "item": 0,
            "parts": {
                "blueprint": 0
            }
        },
        "hash": "",
        "links": {
            "wiki": "https://warframe.fandom.com/wiki/Pharaoh_Predasite",
            "market": ""
        },
        "search": "pharaoh predasite",
        "type": "modular-ipet",
        "masteryLimit": -1,
        "variant": "normal"
    },
    "modular-ipet-medjay_predasite": {
        "name": "Medjay Predasite",
        "parts": {
            "blueprint": [
                "Acquired through Revivification with Son."
            ]
        },
        "mastery": 6000,
        "partStates": {
            "blueprint": 0
        },
        "state": {
            "item": 0,
            "parts": {
                "blueprint": 0
            }
        },
        "hash": "",
        "links": {
            "wiki": "https://warframe.fandom.com/wiki/Medjay_Predasite",
            "market": ""
        },
        "search": "medjay predasite",
        "type": "modular-ipet",
        "masteryLimit": -1,
        "variant": "normal"
    },
    "modular-ipet-sly_vulpaphyla": {
        "name": "Sly Vulpaphyla",
        "parts": {
            "blueprint": [
                "Acquired through Revivification with Son."
            ]
        },
        "mastery": 6000,
        "partStates": {
            "blueprint": 0
        },
        "state": {
            "item": 0,
            "parts": {
                "blueprint": 0
            }
        },
        "hash": "",
        "links": {
            "wiki": "https://warframe.fandom.com/wiki/Sly_Vulpaphyla",
            "market": ""
        },
        "search": "sly vulpaphyla",
        "type": "modular-ipet",
        "masteryLimit": -1,
        "variant": "normal"
    },
    "modular-ipet-crescent_vulpaphyla": {
        "name": "Crescent Vulpaphyla",
        "parts": {
            "blueprint": [
                "Acquired through Revivification with Son."
            ]
        },
        "mastery": 6000,
        "partStates": {
            "blueprint": 0
        },
        "state": {
            "item": 0,
            "parts": {
                "blueprint": 0
            }
        },
        "hash": "",
        "links": {
            "wiki": "https://warframe.fandom.com/wiki/Crescent_Vulpaphyla",
            "market": ""
        },
        "search": "crescent vulpaphyla",
        "type": "modular-ipet",
        "masteryLimit": -1,
        "variant": "normal"
    },
    "modular-ipet-panzer_vulpaphyla": {
        "name": "Panzer Vulpaphyla",
        "parts": {
            "blueprint": [
                "Acquired through Revivification with Son."
            ]
        },
        "mastery": 6000,
        "partStates": {
            "blueprint": 0
        },
        "state": {
            "item": 0,
            "parts": {
                "blueprint": 0
            }
        },
        "hash": "",
        "links": {
            "wiki": "https://warframe.fandom.com/wiki/Panzer_Vulpaphyla",
            "market": ""
        },
        "search": "panzer vulpaphyla",
        "type": "modular-ipet",
        "masteryLimit": -1,
        "variant": "normal"
    }
}