{
    "frame-ash": {
        "name": "Ash",
        "image": "frame-ash.png",
        "search": "ash",
        "helminth": {
            "name": "Shuriken",
            "description": "Ash throws 2 shurikens to strike enemies standing within a 6 meter radius around him, or home in on enemies within 60 meters and a 90° angle of the aiming reticle. Each Shuriken inflicts 500 Slash damage with a 100% status chance on hit.",
            "key": 1,
            "wiki": "https://warframe.fandom.com/wiki/Shuriken",
            "augment": {
                "name": "Seeking Shuriken",
                "description": "Hits expose weaknesses on enemies, reducing their Armor by 70% for 8s.",
                "syndicates": [
                    "hexis",
                    "veil"
                ],
                "wiki": "https://warframe.fandom.com/wiki/Seeking_Shuriken",
                "market": "",
                "usable": true
            }
        }
    },
    "frame-atlas": {
        "name": "Atlas",
        "image": "frame-atlas.png",
        "search": "atlas",
        "helminth": {
            "name": "Petrify",
            "description": "Atlas unleashes his hardened gaze in a conical burst of energy 14 meters long within a 60° field of view. All enemies caught within the cone are instantly turned into stone. Petrified enemies have their damage type modifiers increased by +50% and are completely disabled from attacking or moving for 20 seconds.",
            "key": 3,
            "wiki": "https://warframe.fandom.com/wiki/Petrify",
            "augment": {
                "name": "Ore Gaze",
                "description": "Petrified enemies are scanned into the Codex and have a 25% chance to drop additional loot when killed.",
                "syndicates": [
                    "meridian",
                    "veil"
                ],
                "wiki": "https://warframe.fandom.com/wiki/Ore_Gaze",
                "market": "",
                "usable": true
            }
        }
    },
    "frame-banshee": {
        "name": "Banshee",
        "image": "frame-banshee.png",
        "search": "banshee",
        "helminth": {
            "name": "Silence",
            "description": "Banshee emits a sound dampening aura within 20 meters around her for 30 seconds. Enemies entering the aura will initially experience a sonic disturbance becoming momentarily stunned for 2 seconds; affected enemies remain deafened to sounds which alert them to the direction of nearby combat, as well as become unable to perform special abilities while within Silence's influence.",
            "key": 3,
            "wiki": "https://warframe.fandom.com/wiki/Silence",
            "augment": {
                "name": "Savage Silence",
                "description": "Finisher Damage is increased by 300% while Silence is active.",
                "syndicates": [
                    "suda",
                    "perrin"
                ],
                "wiki": "https://warframe.fandom.com/wiki/Savage_Silence",
                "market": "",
                "usable": true
            }
        }
    },
    "frame-baruuk": {
        "name": "Baruuk",
        "image": "frame-baruuk.png",
        "search": "baruuk",
        "helminth": {
            "name": "Lull",
            "description": "Baruuk casts a calming wave over an area of 25 meters that lingers for 5 seconds. Enemies in sight or aware of Baruuk's presence that enter the area will gradually slow and then fall sleep for 20 seconds. Sleeping enemies awaken early when damaged, suffering disorientation for a brief moment, along with amnesia causing their alertness level to reset.",
            "key": 2,
            "wiki": "https://warframe.fandom.com/wiki/Lull",
            "augment": {
                "name": "Endless Lullaby",
                "description": "Performing a finisher on a sleeping enemy will retrigger Lull for 100% of the remaining duration. Passive: +50% Lull Duration.",
                "syndicates": [
                    "loka",
                    "hexis"
                ],
                "wiki": "https://warframe.fandom.com/wiki/Endless_Lullaby",
                "market": "",
                "usable": true
            }
        }
    },
    "frame-chroma": {
        "name": "Chroma",
        "image": "frame-chroma.png",
        "search": "chroma",
        "helminth": {
            "name": "Elemental Ward",
            "description": "Chroma emits an aura of elemental energy, by expending 50 energy to empower himself and nearby allies as long as they remain within 12 meters, providing both offensive and defensive buffs. Elemental Ward lasts for 25 seconds. The Ward's effects are determined by the Warframe's primary emission color.",
            "key": 2,
            "wiki": "https://warframe.fandom.com/wiki/Elemental_Ward",
            "augment": {
                "name": "Everlasting Ward",
                "description": "Allies that leave the radius will retain the effect for 100% of the remaining duration.",
                "syndicates": [
                    "suda",
                    "perrin"
                ],
                "wiki": "https://warframe.fandom.com/wiki/Everlasting_Ward",
                "market": "",
                "usable": true
            }
        }
    },
    "frame-ember": {
        "name": "Ember",
        "image": "frame-ember.png",
        "search": "ember",
        "helminth": {
            "name": "Fire Blast",
            "description": "Ember slams the ground, creating a wave of fire that expands outwards to a radius of 25 meters. Enemies in direct line of sight of Ember and within range are dealt 200 Heat damage with a 100% status chance, have their Armor permanently reduced by 50% - 100%, and suffer knockdown and are violently pushed back.",
            "key": 3,
            "wiki": "https://warframe.fandom.com/wiki/Fire_Blast",
            "augment": {
                "name": "Healing Flame",
                "description": "Each enemy hit heals Ember by 25 to 50 depending on current Immolation level.",
                "syndicates": [
                    "meridian",
                    "veil"
                ],
                "wiki": "https://warframe.fandom.com/wiki/Healing_Flame",
                "market": "",
                "usable": true
            }
        }
    },
    "frame-equinox": {
        "name": "Equinox",
        "image": "frame-equinox.png",
        "search": "equinox",
        "helminth": {
            "name": "Rest & Rage",
            "description": "Equinox hypnotizes a target up to 50 meters away. Night Equinox lulls enemies into sleep. They automatically wake up when the duration expires or their health reaches 50% of their current values. Day Equinox spurs them into hyperactivity. They receive 50% increased damage from all sources, and 20% movement speed and attack speed bonuses. This effect lasts 22 seconds. The Rest or Rage versions are determined by the Warframe's primary emission color.",
            "key": 2,
            "wiki": "https://warframe.fandom.com/wiki/Rest_%26_Rage",
            "augment": {
                "name": "Calm & Frenzy",
                "description": "Killing an affected enemy causes the effect to spread to enemies within 5m for 100% of the remaining duration.",
                "syndicates": [
                    "hexis",
                    "loka"
                ],
                "wiki": "https://warframe.fandom.com/wiki/Calm_%26_Frenzy",
                "market": "",
                "usable": true
            }
        }
    },
    "frame-excalibur": {
        "name": "Excalibur",
        "image": "frame-excalibur.png",
        "search": "excalibur",
        "helminth": {
            "name": "Radial Blind",
            "description": "Excalibur summons and raises his Exalted Blade, releasing an intense flash of light that affects enemies within 25 meters and blinds them for 15 seconds.",
            "key": 2,
            "wiki": "https://warframe.fandom.com/wiki/Radial_Blind",
            "augment": {
                "name": "Radiant Finish",
                "description": "Blinded enemies take 300% more Finisher Damage.",
                "syndicates": [
                    "meridian",
                    "hexis"
                ],
                "wiki": "https://warframe.fandom.com/wiki/Radiant_Finish",
                "market": "",
                "usable": true
            }
        }
    },
    "frame-frost": {
        "name": "Frost",
        "image": "frame-frost.png",
        "search": "frost",
        "helminth": {
            "name": "Ice Wave",
            "description": "Frost sends forth a wave of ice shards that deals 700 Cold damage with a 600% status chance to all targets in its area of effect. The wave has an initial width of 3 meters, disperses at a 45° angle, and travels over a distance of 20 meters.",
            "key": 2,
            "wiki": "https://warframe.fandom.com/wiki/Ice_Wave",
            "augment": {
                "name": "Ice Wave Impedance",
                "description": "Leaves a frozen trail for 12s that slows down enemies that come into contact with it.",
                "syndicates": [
                    "meridian",
                    "suda"
                ],
                "wiki": "https://warframe.fandom.com/wiki/Ice_Wave_Impedance",
                "market": "",
                "usable": true
            }
        }
    },
    "frame-gara": {
        "name": "Gara",
        "image": "frame-gara.png",
        "search": "gara",
        "helminth": {
            "name": "Spectrorage",
            "description": "Gara summons a perpetually spinning carousel of 12 spectral mirrors at the targeted location within 100 meters. Enemies within 4 meters from the mirrors are enticed to move inside the carousel and attack a chosen mirror upon seeing their own reflections. Each mirror will break upon receiving 800 damage and release it as spectral energy back to the attacker. When 6 mirrors are broken, the carousel collapses in an explosion inflicting 1,500 damage to all enemies inside the ring. Spectrorage lasts for 22 seconds or until all mirrors break from collapse.",
            "key": 3,
            "wiki": "https://warframe.fandom.com/wiki/Spectrorage",
            "augment": {
                "name": "Spectrosiphon",
                "description": "Enemies that die within Spectrorage have a 50% chance to drop an Energy Orb.",
                "syndicates": [
                    "hexis",
                    "loka"
                ],
                "wiki": "https://warframe.fandom.com/wiki/Spectrosiphon",
                "market": "",
                "usable": true
            }
        }
    },
    "frame-garuda": {
        "name": "Garuda",
        "image": "frame-garuda.png",
        "search": "garuda",
        "helminth": {
            "name": "Blood Altar",
            "description": "Garuda charges to an enemy target within 30 meters, staggering all enemies within a 8 meter radius on reaching her target, then slashing it with a spiraling uppercut that impales the victim upon an altar of talons for 20 seconds. While impaled, the enemy is completely disabled as it stays suspended above the altar helplessly, becomes invulnerable to incoming damage, and bleeds profusely emitting an aura with a 8 meter radius; when Garuda or her allies stand within the aura, blood flows from the victim to them, restoring 25% of their missing Health per second, while draining 1% of maximum health per second from the victim. Up to a maximum of 3 altars can be created.",
            "key": 2,
            "wiki": "https://warframe.fandom.com/wiki/Blood_Altar",
            "augment": null
        }
    },
    "frame-gauss": {
        "name": "Gauss",
        "image": "frame-gauss.png",
        "search": "gauss",
        "helminth": {
            "name": "Thermal Sunder",
            "description": "Gauss manipulates the kinetic energy around him to create an area of extreme temperatures with an initial radius of 12 meters, which quickly shrinks to a final radius of 6 meters and lasts for 15 seconds. Tap the ability key for Cold damage, hold down the ability key for Heat damage. The damage dealt by Subsumed Thermal Sunder is equivalent to 50% of Gauss's battery: 450 Cold damage and 900 Heat damage.",
            "key": 3,
            "wiki": "https://warframe.fandom.com/wiki/Thermal_Sunder",
            "augment": null
        }
    },
    "frame-grendel": {
        "name": "Grendel",
        "image": "frame-grendel.png",
        "search": "grendel",
        "helminth": {
            "name": "Nourish",
            "description": "Holding the ability key causes Grendel to stomp the ground recovering Grendel's health with 20 / 30 / 40 / 50 scaling Health points. Grendel and allies within 25 meters receive the Nourished Strike buff, which provides additional Toxin damage for the buffed player's weapons by 1.5x. lasting for 25 seconds. Only the self heal and Nourished Strike effects are available from Subsumed Nourish.",
            "key": 2,
            "wiki": "https://warframe.fandom.com/wiki/Nourish",
            "augment": {
                "name": "Hearty Nourishment",
                "description": "Clear Status Effects and gain 2s of Status Immunity for each victim in Grendel's stomach.",
                "syndicates": [
                    "meridian",
                    "veil"
                ],
                "wiki": "https://warframe.fandom.com/wiki/Hearty_Nourishment",
                "market": "",
                "usable": true
            }
        }
    },
    "frame-harrow": {
        "name": "Harrow",
        "image": "frame-harrow.png",
        "search": "harrow",
        "helminth": {
            "name": "Condemn",
            "description": "Harrow swings his thurible to cast a spectral afterimage forward that travels along the ground for 20 meters. As the afterimage travels, it emits a growing wave of ghastly energy that completely immobilizes enemies in chains for 6 seconds. Each enemy enchained restores 150 Shield points to Harrow which can accumulate Overshields.",
            "key": 1,
            "wiki": "https://warframe.fandom.com/wiki/Condemn",
            "augment": {
                "name": "Tribunal",
                "description": "Other players will trigger 50% of the effects of Penance and Thurible when attacking chained enemies.",
                "syndicates": [
                    "hexis",
                    "veil"
                ],
                "wiki": "https://warframe.fandom.com/wiki/Tribunal",
                "market": "",
                "usable": false
            }
        }
    },
    "frame-hildryn": {
        "name": "Hildryn",
        "image": "frame-hildryn.png",
        "search": "hildryn",
        "helminth": {
            "name": "Pillage",
            "description": "Hildryn emits a radial pulse with an initial radius of 8 meters, which follows her as an aura and rapidly expands outward by 20 meters per second over a duration of 2 seconds. Hildryn and allies touched by the expanding pulse are instantly cleansed of all negative Status Effects. Enemies in direct line of sight of Hildryn and within range of her aura are marked for pillage, reducing their current Shields and Armor by 25%. When Pillage expires or when the ability key is pressed again while the ability is active, the pulse instantly retracts to Hildryn to restore her missing shields and produce Overshields based on the amount of shields and/or armor stolen from all pillaged enemies.",
            "key": 2,
            "wiki": "https://warframe.fandom.com/wiki/Pillage",
            "augment": {
                "name": "Blazing Pillage",
                "description": "Enemies affected by Haven will be set ablaze for 200 Heat damage and restore 50 additional Shields to Hildryn.",
                "syndicates": [
                    "perrin",
                    "suda"
                ],
                "wiki": "https://warframe.fandom.com/wiki/Blazing_Pillage",
                "market": "",
                "usable": false
            }
        }
    },
    "frame-hydroid": {
        "name": "Hydroid",
        "image": "frame-hydroid.png",
        "search": "hydroid",
        "helminth": {
            "name": "Tempest Barrage",
            "description": "Hydroid marks a targeted location for orbital bombardment over unrestricted range, calling forth an artillery barrage-like salvo of water missiles from above to strike the marked area 10 meters in radius for 5 seconds. Water missiles launch from above in a salvo of 4 per second, with each missile exploding on impact dealing 150 Impact damage and Knockdown enemies within a 5 meters explosion radius.",
            "key": 1,
            "wiki": "https://warframe.fandom.com/wiki/Tempest_Barrage",
            "augment": {
                "name": "Corroding Barrage",
                "description": "Each projectile has a 100% chance of inflicting a Corrosive Status Effect.",
                "syndicates": [
                    "suda",
                    "loka"
                ],
                "wiki": "https://warframe.fandom.com/wiki/Corroding_Barrage",
                "market": "",
                "usable": true
            }
        }
    },
    "frame-inaros": {
        "name": "Inaros",
        "image": "frame-inaros.png",
        "search": "inaros",
        "helminth": {
            "name": "Desiccation",
            "description": "Inaros scatters a wave of cursed sand that staggers all enemies up to 15 meters away in a cone in front of him, dealing 150 True damage on hit, 8 True damage per second for 8 seconds; 25% of any damage dealt by the damage-over-time effect is conferred back to Inaros as Health. If enemies are facing toward Inaros as the sand wave strikes, they are also blinded and open to Melee Finisher attack prompts for the duration.",
            "key": 1,
            "wiki": "https://warframe.fandom.com/wiki/Desiccation",
            "augment": {
                "name": "Desiccation's Curse",
                "description": "Killing a blinded enemy with a finisher has a 75% chance of summoning a Sand Shadow.",
                "syndicates": [
                    "hexis",
                    "perrin"
                ],
                "wiki": "https://warframe.fandom.com/wiki/Desiccation%27s_Curse",
                "market": "",
                "usable": true
            }
        }
    },
    "frame-ivara": {
        "name": "Ivara",
        "image": "frame-ivara.png",
        "search": "ivara",
        "helminth": {
            "name": "Quiver",
            "description": "Cloak Arrow anchors onto any surface or entity upon impact, generating an energy bubble that turns Ivara and her allies transparent and invisible within 2.5 meters of its point of impact for 12 seconds. Noise Arrow emits a high-pitched sound upon impact, attracting unalerted enemies within 20 meters of its point of impact to investigate. Subsumed Quiver only features Cloak on tap-cast and Noise on hold-cast. Dashwire and Sleep arrows are unavailable.",
            "key": 1,
            "wiki": "https://warframe.fandom.com/wiki/Quiver",
            "augment": {
                "name": "Empowered Quiver",
                "description": "Dashwire grants allies 100% Critical Damage. Cloak arrow has a 100% chance to prevent Status Effects.",
                "syndicates": [
                    "suda",
                    "perrin"
                ],
                "wiki": "https://warframe.fandom.com/wiki/Empowered_Quiver",
                "market": "",
                "usable": false
            }
        }
    },
    "frame-khora": {
        "name": "Khora",
        "image": "frame-khora.png",
        "search": "khora",
        "helminth": {
            "name": "Ensnare",
            "description": "Khora thrashes her whip at an enemy target within 30 meters, binding it in living metal for 15 seconds. While ensnared, the target is completely disabled, as the living metal propagates and pulls in all nearby enemies within a 10 meters radius after a 0.5 second delay.",
            "key": 2,
            "wiki": "https://warframe.fandom.com/wiki/Ensnare",
            "augment": null
        }
    },
    "frame-lavos": {
        "name": "Lavos",
        "image": "frame-lavos.png",
        "search": "lavos",
        "helminth": {
            "name": "Vial Rush",
            "description": "Lavos charges forward in a sustained slide steerable with the left and right movement keys for a distance of 30 meters, while his serpents rapidly throw out up to 24 vials from his waist belt. Thrown vials fall toward Lavos' left and right sides in an arcing trajectory, shattering on impact with solid surfaces leaving a trail behind him.",
            "key": 2,
            "wiki": "https://warframe.fandom.com/wiki/Vial_Rush",
            "augment": null
        }
    },
    "frame-limbo": {
        "name": "Limbo",
        "image": "frame-limbo.png",
        "search": "limbo",
        "helminth": {
            "name": "Banish",
            "description": "Limbo unleashes a wave of Rift energy toward the aiming reticle. All enemies and allies caught in the wave's extent are banished out of Limbo's current plane of existence. If Limbo is in the material plane, only material-bound targets will be banished into the Rift plane for 25 seconds. Holding down the ability key dispels the Banish status on all banished targets at no additional energy cost.",
            "key": 1,
            "wiki": "https://warframe.fandom.com/wiki/Banish",
            "augment": {
                "name": "Rift Haven",
                "description": "Allies banished to the rift will have 25% of their Maximum Health restored.",
                "syndicates": [
                    "hexis",
                    "suda"
                ],
                "wiki": "https://warframe.fandom.com/wiki/Rift_Haven",
                "market": "",
                "usable": true
            }
        }
    },
    "frame-loki": {
        "name": "Loki",
        "image": "frame-loki.png",
        "search": "loki",
        "helminth": {
            "name": "Decoy",
            "description": "Loki creates a holographic decoy within a range of 100 meters at the location on the aiming reticle. With heightened Threat Level, 400 Shield and 200 Health points, the decoy will draw enemy fire and last for a maximum of 25 seconds or until destroyed by enemy attacks.",
            "key": 1,
            "wiki": "https://warframe.fandom.com/wiki/Decoy",
            "augment": {
                "name": "Savior Decoy",
                "description": "If Loki takes fatal damage, Decoy absorbs the damage and swaps locations. Also increases Casting Speed of Decoy by 50%",
                "syndicates": [
                    "hexis",
                    "veil"
                ],
                "wiki": "https://warframe.fandom.com/wiki/Savior_Decoy",
                "market": "",
                "usable": true
            }
        }
    },
    "frame-mag": {
        "name": "Mag",
        "image": "frame-mag.png",
        "search": "mag",
        "helminth": {
            "name": "Pull",
            "description": "Mag generates a strong magnetic current, pulling every enemy within a 6 meter radius around herself, as well as enemies within 25 meters and a 90° angle of the aiming reticle. Affected enemies are ragdolled and pulled toward Mag with a velocity of ? meters per second, while dealt 300 Magnetic damage. Enemies killed by Pull have a 25% increased chance to drop an Energy orb.",
            "key": 1,
            "wiki": "https://warframe.fandom.com/wiki/Pull",
            "augment": {
                "name": "Greedy Pull",
                "description": "Adds 100% chance to pull pickups towards Mag.",
                "syndicates": [
                    "perrin",
                    "loka"
                ],
                "wiki": "https://warframe.fandom.com/wiki/Greedy_Pull",
                "market": "",
                "usable": false
            }
        }
    },
    "frame-mesa": {
        "name": "Mesa",
        "image": "frame-mesa.png",
        "search": "mesa",
        "helminth": {
            "name": "Shooting Gallery",
            "description": "Mesa releases an energy lasso that swirls around her, causing her to gain 25% weapon damage. The lasso will remain active for 30 seconds. The lasso will lash out at 3 enemies within 16 meters with beams of energy every 1.5 seconds. Affected enemies will have their ranged weapons jammed and will stand in place and attempt to unjam the weapon over a short duration; melee fighters will suffer a temporary stun instead.",
            "key": 2,
            "wiki": "https://warframe.fandom.com/wiki/Shooting_Gallery",
            "augment": {
                "name": "Muzzle Flash",
                "description": "After 6 kill assists by a player with Shooting Gallery, Mesa's next shot will blind enemies within 12m for 6s.",
                "syndicates": [
                    "meridian",
                    "veil"
                ],
                "wiki": "https://warframe.fandom.com/wiki/Muzzle_Flash",
                "market": "",
                "usable": true
            }
        }
    },
    "frame-mirage": {
        "name": "Mirage",
        "image": "frame-mirage.png",
        "search": "mirage",
        "helminth": {
            "name": "Eclipse",
            "description": "Mirage adapts to the lighting conditions of her surroundings, gaining weapon damage while bathed in light, or reducing incoming damage and reducing enemy accuracy while in the shadows. Subsumed Eclipse's damage bonus is 150% and the damage reduction caps at 75%. The effect lasts for 25 seconds.",
            "key": 3,
            "wiki": "https://warframe.fandom.com/wiki/Eclipse",
            "augment": {
                "name": "Total Eclipse",
                "description": "While active, allies within 15m benefit from Eclipse.",
                "syndicates": [
                    "hexis",
                    "suda"
                ],
                "wiki": "https://warframe.fandom.com/wiki/Total_Eclipse",
                "market": "",
                "usable": true
            }
        }
    },
    "frame-nekros": {
        "name": "Nekros",
        "image": "frame-nekros.png",
        "search": "nekros",
        "helminth": {
            "name": "Terrify",
            "description": "Nekros releases a psychic blast that causes up to 20 enemies within 15 meters to enter a state of panic for 25 seconds. While panicked, enemies will not attack and will haphazardly flee, exposing themselves and temporarily reducing their Armor by 20%.",
            "key": 2,
            "wiki": "https://warframe.fandom.com/wiki/Terrify",
            "augment": {
                "name": "Creeping Terrify",
                "description": "Affected enemies have 60% reduced Movement Speed.",
                "syndicates": [
                    "perrin",
                    "veil"
                ],
                "wiki": "https://warframe.fandom.com/wiki/Creeping_Terrify",
                "market": "",
                "usable": true
            }
        }
    },
    "frame-nezha": {
        "name": "Nezha",
        "image": "frame-nezha.png",
        "search": "nezha",
        "helminth": {
            "name": "Fire Walker",
            "description": "Nezha ignites his Wind Fire Wheels to gain 25% bonus movement speed for 30 seconds, while leaving behind a trail of fire beneath his feet that lasts for 10 seconds. Enemies that walk over the flames are dealt 200 Heat damage per 0.5 seconds. Nezha will be cleansed of all status effects, and so will his allies that walk over the flames.",
            "key": 1,
            "wiki": "https://warframe.fandom.com/wiki/Fire_Walker",
            "augment": {
                "name": "Pyroclastic Flow",
                "description": "Accumulate 150% of the damage Fire Walker deals, unleashing it in a trail of fire that lasts 10s.",
                "syndicates": [
                    "meridian",
                    "suda"
                ],
                "wiki": "https://warframe.fandom.com/wiki/Pyroclastic_Flow",
                "market": "",
                "usable": true
            }
        }
    },
    "frame-nidus": {
        "name": "Nidus",
        "image": "frame-nidus.png",
        "search": "nidus",
        "helminth": {
            "name": "Larva",
            "description": "Nidus ejects an infested larva at high speed toward the targeted location over unrestricted range. Upon impact or reactivation by pressing the ability key again, the larva rapidly matures into a floating mass of infested tentacles that sprouts tendrils to grab all enemies within line-of-sight. Subsumed Larva's range is reduced to 8 meters.",
            "key": 2,
            "wiki": "https://warframe.fandom.com/wiki/Larva",
            "augment": {
                "name": "Larva Burst",
                "description": "Reactivate Larva to detonate and deal 300 Toxin Damage in a 5m radius. This damage stacks for every enemy grabbed by the Larva.",
                "syndicates": [
                    "meridian",
                    "perrin"
                ],
                "wiki": "https://warframe.fandom.com/wiki/Larva_Burst",
                "market": "",
                "usable": true
            }
        }
    },
    "frame-nova": {
        "name": "Nova",
        "image": "frame-nova.png",
        "search": "nova",
        "helminth": {
            "name": "Null Star",
            "description": "Nova creates 6 antimatter particles that orbit her and automatically launch themselves one by one every 1 second at enemies within 12 meters. Each particle persists on Nova indefinitely until launched, passively grants +5% Damage Reduction to Nova's Health while orbiting around her, and inflicts 150 Slash damage on hit.",
            "key": 1,
            "wiki": "https://warframe.fandom.com/wiki/Null_Star",
            "augment": {
                "name": "Neutron Star",
                "description": "On recast, all remaining particles will seek out enemies and deal 120 Blast Damage with guaranteed Status effect in 8m.",
                "syndicates": [
                    "meridian",
                    "suda"
                ],
                "wiki": "https://warframe.fandom.com/wiki/Neutron_Star",
                "market": "",
                "usable": true
            }
        }
    },
    "frame-nyx": {
        "name": "Nyx",
        "image": "frame-nyx.png",
        "search": "nyx",
        "helminth": {
            "name": "Mind Control",
            "description": "Nyx fully inhabits the mind of a single enemy within a range of 60 meters, stunning it for 3 seconds then forcing it to fight for the Tenno faction for 30 seconds. While controlled, the affected target is enveloped within a psychic barrier that renders it completely invulnerable to damage from allied and enemy factions.",
            "key": 1,
            "wiki": "https://warframe.fandom.com/wiki/Mind_Control",
            "augment": {
                "name": "Mind Freak",
                "description": "Controlled target inflicts +500% Damage.",
                "syndicates": [
                    "hexis",
                    "loka"
                ],
                "wiki": "https://warframe.fandom.com/wiki/Mind_Freak",
                "market": "",
                "usable": true
            }
        }
    },
    "frame-oberon": {
        "name": "Oberon",
        "image": "frame-oberon.png",
        "search": "oberon",
        "helminth": {
            "name": "Smite",
            "description": "Oberon smites an enemy target with hallowed light up to 50 meters away, dealing 500 damage while knocking-down with a 100% Radiation status chance. Additionally, the target emits 6 orb projectiles that seek out enemies within 12.5 meters from the main target, over a duration of 12 seconds. Each orb deals 150 Radiation damage, plus 35% of the main target's maximum health and shields divided among the number of orbs.",
            "key": 1,
            "wiki": "https://warframe.fandom.com/wiki/Smite",
            "augment": {
                "name": "Smite Infusion",
                "description": "Hold to cast will grant all allies within 15m an additional 100% Radiation Damage to their attacks for 40s.",
                "syndicates": [
                    "meridian",
                    "loka"
                ],
                "wiki": "https://warframe.fandom.com/wiki/Smite_Infusion",
                "market": "",
                "usable": true
            }
        }
    },
    "frame-octavia": {
        "name": "Octavia",
        "image": "frame-octavia.png",
        "search": "octavia",
        "helminth": {
            "name": "Resonator",
            "description": "Octavia throws a compact rollerball in an arc toward the direction she aims. Upon impact, the rollerball falls to the ground and deploys into the Resonator that lasts for 20 seconds. The Resonator emits a charming aura with a minimum radius of 6 meters, causing enemies to cease all aggression and follow the Resonator's travel path until the ability expires. Charmed enemies rhythmically receive up to 125 Blast damage per beat while they remain in the charm radius.",
            "key": 2,
            "wiki": "https://warframe.fandom.com/wiki/Resonator",
            "augment": {
                "name": "Conductor",
                "description": "Reactivate the ability to command Resonator to move to your aim point at 150% Speed.",
                "syndicates": [
                    "suda",
                    "loka"
                ],
                "wiki": "https://warframe.fandom.com/wiki/Conductor",
                "market": "",
                "usable": true
            }
        }
    },
    "frame-protea": {
        "name": "Protea",
        "image": "frame-protea.png",
        "search": "protea",
        "helminth": {
            "name": "Dispensary",
            "description": "Protea unfurls the supply cache from her utility belt, expending 75 energy to deploy it in the air in front of her. When first deployed, the supply cache warps in Pickups one by one every 3 seconds in the following sequence: an Empowered Health Orb that restores 100 Health points, a Universal Ammo Pack that restores 10% of maximum Ammo for the currently equipped Weapon, and an Energy Orb. Subsumed Dispensary's duration is reduced to 12 seconds.",
            "key": 3,
            "wiki": "https://warframe.fandom.com/wiki/Dispensary",
            "augment": {
                "name": "Repair Dispensary",
                "description": "Hold to create a dispensary that will revive the sentinel or companion Moa of a player within 14m every 60s.",
                "syndicates": [
                    "hexis",
                    "perrin"
                ],
                "wiki": "https://warframe.fandom.com/wiki/Repair_Dispensary",
                "market": "",
                "usable": true
            }
        }
    },
    "frame-revenant": {
        "name": "Revenant",
        "image": "frame-revenant.png",
        "search": "revenant",
        "helminth": {
            "name": "Reave",
            "description": "Revenant transforms into a torrent of Sentient energy that surges forward toward the aiming reticle, at a speed of 27 meters per second for 1 second. Enemies passing through the energy current are drained 8% of their maximum Shields and Health, while Revenant restores 8% of his maximum shields and health from each enemy leeched.",
            "key": 3,
            "wiki": "https://warframe.fandom.com/wiki/Reave",
            "augment": {
                "name": "Blinding Reave",
                "description": "Enemies hit are blinded by fog for 10s.",
                "syndicates": [
                    "suda",
                    "perrin"
                ],
                "wiki": "https://warframe.fandom.com/wiki/Blinding_Reave",
                "market": "",
                "usable": true
            }
        }
    },
    "frame-rhino": {
        "name": "Rhino",
        "image": "frame-rhino.png",
        "search": "rhino",
        "helminth": {
            "name": "Roar",
            "description": "Rhino lets out a forceful roar, increasing the damage output of himself and his allies within 25 meters. Rhino and affected allies gain bonus damage to all sources over a duration of 30 seconds. Subsumed Roar's damage bonus is reduced to 30%.",
            "key": 3,
            "wiki": "https://warframe.fandom.com/wiki/Roar",
            "augment": {
                "name": "Piercing Roar",
                "description": "Enemies within 25m will be knocked down and suffer from a Puncture Status effect. Roar can be recast.",
                "syndicates": [
                    "meridian",
                    "perrin"
                ],
                "wiki": "https://warframe.fandom.com/wiki/Piercing_Roar",
                "market": "",
                "usable": true
            }
        }
    },
    "frame-saryn": {
        "name": "Saryn",
        "image": "frame-saryn.png",
        "search": "saryn",
        "helminth": {
            "name": "Molt",
            "description": "Saryn sheds her skin, removing all existing status effects and increasing her movement speed by 50% for 5 seconds, while leaving behind a decoy with 400 shields and 500 health that draws enemy fire for 40 seconds. The decoy will explode if it loses all of its hitpoints, if its duration expires or if the ability is cast again, inflicting 400 Toxin damage to all enemies within 10 meters from it.",
            "key": 2,
            "wiki": "https://warframe.fandom.com/wiki/Molt",
            "augment": {
                "name": "Regenerative Molt",
                "description": "After casting Molt, Saryn regenerates 50 Health/s for 10s.",
                "syndicates": [
                    "meridian",
                    "veil"
                ],
                "wiki": "https://warframe.fandom.com/wiki/Regenerative_Molt",
                "market": "",
                "usable": true
            }
        }
    },
    "frame-sevagoth": {
        "name": "Sevagoth",
        "image": "frame-sevagoth.png",
        "search": "sevagoth",
        "helminth": {
            "name": "Gloom",
            "description": "Sevagoth unleashes flowing darkness around him, as a radial wave pulses out at a speed of2 meters per second, beginning from 4 meters then expands up to 16 meters. Enemies within his aura suffer from 35% reduced action speed, whilst Sevagoth and allies standing within gain 5% lifesteal for damage dealt with weapons and abilities against any enemies.",
            "key": 3,
            "wiki": "https://warframe.fandom.com/wiki/Gloom",
            "augment": null
        }
    },
    "frame-titania": {
        "name": "Titania",
        "image": "frame-titania.png",
        "search": "titania",
        "helminth": {
            "name": "Spellbind",
            "description": "Titania scatters enchanted dust in a 5 meter radius around the location she aims at, up to 50 meters away. Enemies within this area are disarmed, become unable to perform any action while in a ragdoll state, and weightlessly float in mid-air for 16 seconds. Titania and her allies caught within the dust cloud are cleansed from status effects and gain immunity to them for the duration of the ability.",
            "key": 1,
            "wiki": "https://warframe.fandom.com/wiki/Spellbind",
            "augment": {
                "name": "Spellbound Harvest",
                "description": " Hitting at least 4 enemies with Spellbind will grant Titania 50 Energy.",
                "syndicates": [
                    "loka",
                    "veil"
                ],
                "wiki": "https://warframe.fandom.com/wiki/Spellbound_Harvest",
                "market": "",
                "usable": true
            }
        }
    },
    "frame-trinity": {
        "name": "Trinity",
        "image": "frame-trinity.png",
        "search": "trinity",
        "helminth": {
            "name": "Well Of Life",
            "description": "Trinity imbues a single enemy target with life energy and suspends it in midair, from within a cast range of 100 meters. The enemy is invulnerable and incapacitated, lifted airborne, and emits an 8 meter aura for 12 seconds. When Trinity or her allies stand within the aura, they are healed 100 Health points per second.",
            "key": 1,
            "wiki": "https://warframe.fandom.com/wiki/Well_Of_Life",
            "augment": {
                "name": "Pool of Life",
                "description": "On death, marked enemies will drop 4 Health Orbs with a 25% chance of dropping an Energy Orb.",
                "syndicates": [
                    "perrin",
                    "loka"
                ],
                "wiki": "https://warframe.fandom.com/wiki/Pool_of_Life",
                "market": "",
                "usable": true
            }
        }
    },
    "frame-valkyr": {
        "name": "Valkyr",
        "image": "frame-valkyr.png",
        "search": "valkyr",
        "helminth": {
            "name": "Warcry",
            "description": "Valkyr lets out a rallying cry, bolstering the attack speed and defenses of herself and her allies while diminishing the attack speed and mobility of her enemies within 25 meters. Affected allies will gain 30% attack speed and 50% armor, while affected enemies will have their actions slowed by 30%. The effects last for 15 seconds.",
            "key": 2,
            "wiki": "https://warframe.fandom.com/wiki/Warcry",
            "augment": {
                "name": "Eternal War",
                "description": "While active, Warcry's duration is increased by 2s for each Melee Kill.",
                "syndicates": [
                    "perrin",
                    "loka"
                ],
                "wiki": "https://warframe.fandom.com/wiki/Eternal_War",
                "market": "",
                "usable": true
            }
        }
    },
    "frame-vauban": {
        "name": "Vauban",
        "image": "frame-vauban.png",
        "search": "vauban",
        "helminth": {
            "name": "Tesla Nervos",
            "description": "The Tesla Nervos is an invulnerable Latcher Specter that follows Vauban and seeks to latch onto a nearby enemy, shocking the target and stunning it in place as long as the Tesla Nervos remains attached. The stunned target receives 25 Electricity damage per second, while discharging an electric burst every 1 second to inflict 150 Electricity damage with 50% Status Chance to all enemies within a 6 meter radius.",
            "key": 1,
            "wiki": "https://warframe.fandom.com/wiki/Tesla_Nervos",
            "augment": {
                "name": "Tesla Bank",
                "description": "While a target has a Nervos attached, any damage dealt to it will be absorbed by the Nervos and channeled into a 8m burst of Electricity on death.",
                "syndicates": [
                    "perrin",
                    "suda"
                ],
                "wiki": "https://warframe.fandom.com/wiki/Tesla_Bank",
                "market": "",
                "usable": true
            }
        }
    },
    "frame-volt": {
        "name": "Volt",
        "image": "frame-volt.png",
        "search": "volt",
        "helminth": {
            "name": "Shock",
            "description": "Volt releases an arc discharge toward the targeted enemy or location on the aiming reticle over unrestricted range, chaining electricity to enemies within 15 meters of each point of contact. The arc can chain a maximum of 5 times and inflicts 200 Electricity damage with a 100% status chance to each enemy.",
            "key": 1,
            "wiki": "https://warframe.fandom.com/wiki/Shock",
            "augment": {
                "name": "Shock Trooper",
                "description": "Hold to cast will grant all allies within 15m an additional 100% Electricity Damage to their attacks for 40s.",
                "syndicates": [
                    "hexis",
                    "veil"
                ],
                "wiki": "https://warframe.fandom.com/wiki/Shock_Trooper",
                "market": "",
                "usable": true
            }
        }
    },
    "frame-wisp": {
        "name": "Wisp",
        "image": "frame-wisp.png",
        "search": "wisp",
        "helminth": {
            "name": "Breach Surge",
            "description": "Wisp fractures the dimensional divide into an energy explosion that rapidly expands over a 18 meter radius area. Enemies in within range are blinded with unstable energy for 16 seconds. When struck by damage from weapons and abilities, blinded enemies have a 10% chance to release a surge spark in the form of a homing projectile that seeks the heads of nearby enemies, dealing Radiation damage with a 20% status chance and inherits a damage multiplier of 2 received by the source enemy to inflict on the new target.",
            "key": 3,
            "wiki": "https://warframe.fandom.com/wiki/Breach_Surge",
            "augment": {
                "name": "Critical Surge",
                "description": "Teleporting to a Reservoir costs 50% Energy and grants 10% Critical Chance to Sniper Rifles per meter traveled for 9s. Maximum of 350% Critical Chance.",
                "syndicates": [
                    "suda",
                    "loka"
                ],
                "wiki": "https://warframe.fandom.com/wiki/Critical_Surge",
                "market": "",
                "usable": false
            }
        }
    },
    "frame-wukong": {
        "name": "Wukong",
        "image": "frame-wukong.png",
        "search": "wukong",
        "helminth": {
            "name": "Defy",
            "description": "Wukong engages a defiant stance becoming invulnerable to damage and taunts enemies into attacking him for 2 seconds. Any damage Wukong takes while in this stance is stored. After the invulnerability period expires, Wukong spins in place and deals 250 damage plus the stored damage as Impact damage to all enemies within a radius of 12 meters.",
            "key": 3,
            "wiki": "https://warframe.fandom.com/wiki/Defy",
            "augment": null
        }
    },
    "frame-xaku": {
        "name": "Xaku",
        "image": "frame-xaku.png",
        "search": "xaku",
        "helminth": {
            "name": "Xata's Whisper",
            "description": "Whispers from the Void infuse Xaku with untold power, by expending 25 energy to empower all equipped Weapons to inflict 1 extra hit per damage instance for 26% of total weapon damage as Void damage, which resets Sentient and Acolytes damage resistance upon Void status proc. Xata's Whisper lasts for 35 seconds.",
            "key": 1,
            "wiki": "https://warframe.fandom.com/wiki/Xata%27s_Whisper",
            "augment": null
        }
    },
    "frame-yareli": {
        "name": "Yareli",
        "image": "frame-yareli.png",
        "search": "yareli",
        "helminth": {
            "name": "Aquablades",
            "description": "Yareli twirls out a swirling whirlwind of 3 razor-sharp Aquablades that form a protective ring around her for 45 seconds. Aquablades rapidly revolve clockwise around Yareli, striking all enemies within a radius of 5 meters in an interval of 3 consecutive hits within 0.5 seconds. Each hit inflicts 750 Slash damage with a 100% Status Chance and guarantees a Stagger effect.",
            "key": 3,
            "wiki": "https://warframe.fandom.com/wiki/Aquablades",
            "augment": null
        }
    },
    "frame-zephyr": {
        "name": "Zephyr",
        "image": "frame-zephyr.png",
        "search": "zephyr",
        "helminth": {
            "name": "Airburst",
            "description": "Zephyr launches a rapidly traveling slice of dense air towards her aiming reticle. Once it collides into an enemy, the slice passes through and deals 500 Impact, Puncture, and Slash damage with a 50% Status Chance. Upon colliding with a surface or after traveling 100 meters, the slice explodes in a 8 meters radius, dealing damage.",
            "key": 2,
            "wiki": "https://warframe.fandom.com/wiki/Airburst",
            "augment": {
                "name": "Airburst Rounds",
                "description": "Each enemy hit by Airburst increases secondary damage by 25% for 14s.",
                "syndicates": [
                    "loka",
                    "veil"
                ],
                "wiki": "https://warframe.fandom.com/wiki/Airburst_Rounds",
                "market": "",
                "usable": true
            }
        }
    }
}