{
    "arch-gun-cortege": {
        "name": "Cortege",
        "parts": {
            "blueprint": [
                "Purchased from the Necraloid; Rank 3 required."
            ],
            "barrel": [
                "Purchased from the Necraloid; Rank 2 required. Damaged components are acquired from Normal and Arcana Isolation Vault Bounty rewards.",
                "3% or 6%"
            ],
            "receiver": [
                "Purchased from the Necraloid; Rank 2 required. Damaged components are acquired from Normal and Arcana Isolation Vault Bounty rewards.",
                "3% or 6%"
            ],
            "stock": [
                "Purchased from the Necraloid; Rank 2 required. Damaged components are acquired from Normal and Arcana Isolation Vault Bounty rewards.",
                "3% or 6%"
            ]
        },
        "mastery": 3000,
        "partStates": {
            "blueprint": 0,
            "barrel": 0,
            "receiver": 0,
            "stock": 0
        },
        "state": {
            "item": 0,
            "parts": {
                "blueprint": 0,
                "barrel": 0,
                "receiver": 0,
                "stock": 0
            }
        },
        "hash": "",
        "links": {
            "wiki": "https://warframe.fandom.com/wiki/Cortege",
            "market": ""
        },
        "search": "cortege",
        "type": "arch-gun",
        "masteryLimit": 14,
        "variant": "normal"
    },
    "arch-gun-corvas": {
        "name": "Corvas",
        "parts": {
            "blueprint": [
                "Purchased from the Market."
            ],
            "barrel": [
                "Purchased from Arbiters of Hexis; Rank 2 required."
            ],
            "receiver": [
                "Purchased from Cephalon Suda; Rank 2 required."
            ],
            "stock": [
                "Purchased from Steel Meridian; Rank 2 required."
            ]
        },
        "mastery": 3000,
        "partStates": {
            "blueprint": 0,
            "barrel": 0,
            "receiver": 0,
            "stock": 0
        },
        "state": {
            "item": 0,
            "parts": {
                "blueprint": 0,
                "barrel": 0,
                "receiver": 0,
                "stock": 0
            }
        },
        "hash": "",
        "links": {
            "wiki": "https://warframe.fandom.com/wiki/Corvas",
            "market": ""
        },
        "search": "corvas",
        "type": "arch-gun",
        "masteryLimit": 1,
        "variant": "normal"
    },
    "arch-gun-cyngas": {
        "name": "Cyngas",
        "parts": {
            "blueprint": [
                "Purchased from the Market."
            ],
            "barrel": [
                "Purchased from Arbiters of Hexis; Rank 3 required."
            ],
            "receiver": [
                "Purchased from Cephalon Suda; Rank 3 required."
            ],
            "stock": [
                "Purchased from The Perrin Sequence; Rank 3 required."
            ]
        },
        "mastery": 3000,
        "partStates": {
            "blueprint": 0,
            "barrel": 0,
            "receiver": 0,
            "stock": 0
        },
        "state": {
            "item": 0,
            "parts": {
                "blueprint": 0,
                "barrel": 0,
                "receiver": 0,
                "stock": 0
            }
        },
        "hash": "",
        "links": {
            "wiki": "https://warframe.fandom.com/wiki/Cyngas",
            "market": ""
        },
        "search": "cyngas",
        "type": "arch-gun",
        "masteryLimit": 4,
        "variant": "normal"
    },
    "arch-gun-dual_decurion": {
        "name": "Dual Decurion",
        "parts": {
            "blueprint": [
                "Purchased from the Market."
            ],
            "barrel": [
                "Purchased from Arbiters of Hexis; Rank 2 required."
            ],
            "receiver": [
                "Purchased from Cephalon Suda; Rank 2 required."
            ]
        },
        "mastery": 3000,
        "partStates": {
            "blueprint": 0,
            "barrel": 0,
            "receiver": 0
        },
        "state": {
            "item": 0,
            "parts": {
                "blueprint": 0,
                "barrel": 0,
                "receiver": 0
            }
        },
        "hash": "",
        "links": {
            "wiki": "https://warframe.fandom.com/wiki/Dual_Decurion",
            "market": ""
        },
        "search": "dual decurion",
        "type": "arch-gun",
        "masteryLimit": 1,
        "variant": "normal"
    },
    "arch-gun-fluctus": {
        "name": "Fluctus",
        "parts": {
            "blueprint": [
                "Researched from the Tenno Lab in the dojo."
            ],
            "barrel": [
                "Puchased from Cephalon Suda; Rank 3 required."
            ],
            "limbs": [
                "Purchased from Red Veil; Rank 3 required."
            ],
            "stock": [
                "Purchased from Steel Meridian; Rank 3 required."
            ]
        },
        "mastery": 3000,
        "partStates": {
            "blueprint": 0,
            "barrel": 0,
            "limbs": 0,
            "stock": 0
        },
        "state": {
            "item": 0,
            "parts": {
                "blueprint": 0,
                "barrel": 0,
                "limbs": 0,
                "stock": 0
            }
        },
        "hash": "",
        "links": {
            "wiki": "https://warframe.fandom.com/wiki/Fluctus",
            "market": ""
        },
        "search": "fluctus",
        "type": "arch-gun",
        "masteryLimit": 2,
        "variant": "normal"
    },
    "arch-gun-grattler": {
        "name": "Grattler",
        "parts": {
            "blueprint": [
                "Researched from the Chem Lab in the dojo."
            ]
        },
        "mastery": 3000,
        "partStates": {
            "blueprint": 0
        },
        "state": {
            "item": 0,
            "parts": {
                "blueprint": 0
            }
        },
        "hash": "",
        "links": {
            "wiki": "https://warframe.fandom.com/wiki/Grattler",
            "market": ""
        },
        "search": "grattler",
        "type": "arch-gun",
        "masteryLimit": 4,
        "variant": "normal"
    },
    "arch-gun-imperator": {
        "name": "Imperator",
        "parts": {
            "blueprint": [
                "A built Imperator is acquired upon claiming the Odonata Archwing."
            ]
        },
        "mastery": 3000,
        "partStates": {
            "blueprint": 0
        },
        "state": {
            "item": 0,
            "parts": {
                "blueprint": 0
            }
        },
        "hash": "",
        "links": {
            "wiki": "https://warframe.fandom.com/wiki/Imperator",
            "market": ""
        },
        "search": "imperator",
        "type": "arch-gun",
        "masteryLimit": 0,
        "variant": "normal"
    },
    "arch-gun-imperator_vandal": {
        "name": "Imperator Vandal",
        "parts": {
            "blueprint": [
                "Obtainable from the Balor Fomorian Invasion via Fomorian Sabotage.",
                "10%"
            ],
            "barrel": [
                "Obtainable from the Balor Fomorian Invasion via Fomorian Sabotage.",
                "10%"
            ],
            "receiver": [
                "Obtainable from the Balor Fomorian Invasion via Fomorian Sabotage.",
                "10%"
            ]
        },
        "mastery": 3000,
        "partStates": {
            "blueprint": 0,
            "barrel": 0,
            "receiver": 0
        },
        "state": {
            "item": 0,
            "parts": {
                "blueprint": 0,
                "barrel": 0,
                "receiver": 0
            }
        },
        "hash": "",
        "links": {
            "wiki": "https://warframe.fandom.com/wiki/Imperator_Vandal",
            "market": ""
        },
        "search": "imperator vandal",
        "type": "arch-gun",
        "masteryLimit": 5,
        "variant": "vandal"
    },
    "arch-gun-kuva_ayanga": {
        "name": "Kuva Ayanga",
        "parts": {
            "blueprint": [
                "Obtained by vanquishing a Kuva Lich who generated with one equipped."
            ]
        },
        "mastery": 4000,
        "partStates": {
            "blueprint": 0
        },
        "state": {
            "item": 0,
            "parts": {
                "blueprint": 0
            }
        },
        "hash": "",
        "links": {
            "wiki": "https://warframe.fandom.com/wiki/Kuva_Ayanga",
            "market": ""
        },
        "search": "kuva ayanga",
        "type": "arch-gun",
        "masteryLimit": 13,
        "variant": "kuva"
    },
    "arch-gun-kuva_grattler": {
        "name": "Kuva Grattler",
        "parts": {
            "blueprint": [
                "Obtained by vanquishing a Kuva Lich who generated with one equipped."
            ]
        },
        "mastery": 4000,
        "partStates": {
            "blueprint": 0
        },
        "state": {
            "item": 0,
            "parts": {
                "blueprint": 0
            }
        },
        "hash": "",
        "links": {
            "wiki": "https://warframe.fandom.com/wiki/Kuva_Grattler",
            "market": ""
        },
        "search": "kuva grattler",
        "type": "arch-gun",
        "masteryLimit": 15,
        "variant": "kuva"
    },
    "arch-gun-larkspur": {
        "name": "Larkspur",
        "parts": {
            "blueprint": [
                "Researched from the Tenno Lab in the dojo."
            ]
        },
        "mastery": 3000,
        "partStates": {
            "blueprint": 0
        },
        "state": {
            "item": 0,
            "parts": {
                "blueprint": 0
            }
        },
        "hash": "",
        "links": {
            "wiki": "https://warframe.fandom.com/wiki/Larkspur",
            "market": ""
        },
        "search": "larkspur",
        "type": "arch-gun",
        "masteryLimit": 8,
        "variant": "normal"
    },
    "arch-gun-mausolon": {
        "name": "Mausolon",
        "parts": {
            "blueprint": [
                "A built Mausolon is acquired upon claiming any Necramech."
            ]
        },
        "mastery": 3000,
        "partStates": {
            "blueprint": 0
        },
        "state": {
            "item": 0,
            "parts": {
                "blueprint": 0
            }
        },
        "hash": "",
        "links": {
            "wiki": "https://warframe.fandom.com/wiki/Mausolon",
            "market": ""
        },
        "search": "mausolon",
        "type": "arch-gun",
        "masteryLimit": 14,
        "variant": "normal"
    },
    "arch-gun-morgha": {
        "name": "Morgha",
        "parts": {
            "blueprint": [
                "Purchased from the Necraloid; Rank 3 required."
            ],
            "barrel": [
                "Purchased from the Necraloid; Rank 2 required. Damaged components are acquired from Normal and Arcana Isolation Vault Bounty rewards.",
                "3% or 6%"
            ],
            "receiver": [
                "Purchased from the Necraloid; Rank 2 required. Damaged components are acquired from Normal and Arcana Isolation Vault Bounty rewards.",
                "3% or 6%"
            ],
            "stock": [
                "Purchased from the Necraloid; Rank 2 required. Damaged components are acquired from Normal and Arcana Isolation Vault Bounty rewards.",
                "3% or 6%"
            ]
        },
        "mastery": 3000,
        "partStates": {
            "blueprint": 0,
            "barrel": 0,
            "receiver": 0,
            "stock": 0
        },
        "state": {
            "item": 0,
            "parts": {
                "blueprint": 0,
                "barrel": 0,
                "receiver": 0,
                "stock": 0
            }
        },
        "hash": "",
        "links": {
            "wiki": "https://warframe.fandom.com/wiki/Morgha",
            "market": ""
        },
        "search": "morgha",
        "type": "arch-gun",
        "masteryLimit": 15,
        "variant": "normal"
    },
    "arch-gun-phaedra": {
        "name": "Phaedra",
        "parts": {
            "blueprint": [
                "Purchased from the Market."
            ],
            "barrel": [
                "Purchased from Arbiters of Hexis; Rank 2 required."
            ],
            "receiver": [
                "Purchased from The Perrin Sequence; Rank 2 required."
            ],
            "stock": [
                "Purchased from New Loka; Rank 2 required."
            ]
        },
        "mastery": 3000,
        "partStates": {
            "blueprint": 0,
            "barrel": 0,
            "receiver": 0,
            "stock": 0
        },
        "state": {
            "item": 0,
            "parts": {
                "blueprint": 0,
                "barrel": 0,
                "receiver": 0,
                "stock": 0
            }
        },
        "hash": "",
        "links": {
            "wiki": "https://warframe.fandom.com/wiki/Phaedra",
            "market": ""
        },
        "search": "phaedra",
        "type": "arch-gun",
        "masteryLimit": 3,
        "variant": "normal"
    },
    "arch-gun-prisma_dual_decurions": {
        "name": "Prisma Dual Decurions",
        "parts": {
            "blueprint": [
                "Potentially sold by Baro Ki'Teer."
            ]
        },
        "mastery": 3000,
        "partStates": {
            "blueprint": 0
        },
        "state": {
            "item": 0,
            "parts": {
                "blueprint": 0
            }
        },
        "hash": "",
        "links": {
            "wiki": "https://warframe.fandom.com/wiki/Prisma_Dual_Decurions",
            "market": ""
        },
        "search": "prisma dual decurions",
        "type": "arch-gun",
        "masteryLimit": 1,
        "variant": "prisma"
    },
    "arch-gun-velocitus": {
        "name": "Velocitus",
        "parts": {
            "blueprint": [
                "Researched from the Tenno Lab in the dojo."
            ],
            "barrel": [
                "Purchased from Cephalon Suda; Rank 2 required."
            ],
            "receiver": [
                "Purchased from Steel Meridian; Rank 2 required."
            ],
            "stock": [
                "Purchased from Red Veil; Rank 2 required."
            ]
        },
        "mastery": 3000,
        "partStates": {
            "blueprint": 0,
            "barrel": 0,
            "receiver": 0,
            "stock": 0
        },
        "state": {
            "item": 0,
            "parts": {
                "blueprint": 0,
                "barrel": 0,
                "receiver": 0,
                "stock": 0
            }
        },
        "hash": "",
        "links": {
            "wiki": "https://warframe.fandom.com/wiki/Velocitus",
            "market": ""
        },
        "search": "velocitus",
        "type": "arch-gun",
        "masteryLimit": 4,
        "variant": "normal"
    }
}