{
    "arch-melee-agkuza": {
        "name": "Agkuza",
        "parts": {
            "blueprint": [
                "Purchased from the Market."
            ],
            "blade": [
                "Purchased from New Loka; Rank 3 required."
            ],
            "handle": [
                "Purchased from Red Veil; Rank 3 required."
            ],
            "guard": [
                "Purchased from Steel Meridian; Rank 3 required."
            ]
        },
        "mastery": 3000,
        "partStates": {
            "blueprint": 0,
            "blade": 0,
            "handle": 0,
            "guard": 0
        },
        "state": {
            "item": 0,
            "parts": {
                "blueprint": 0,
                "blade": 0,
                "handle": 0,
                "guard": 0
            }
        },
        "hash": "",
        "links": {
            "wiki": "https://warframe.fandom.com/wiki/Agkuza",
            "market": ""
        },
        "search": "agkuza",
        "type": "arch-melee",
        "masteryLimit": 3,
        "variant": "normal"
    },
    "arch-melee-centaur": {
        "name": "Centaur",
        "parts": {
            "blueprint": [
                "Purchased from the Market."
            ],
            "blade": [
                "Purchased from The Perrin Sequence; Rank 3 required."
            ],
            "handle": [
                "Purchased from New Loka; Rank 3 required."
            ],
            "aegis": [
                "Purchased from Arbiters of Hexis; Rank 3 required."
            ]
        },
        "mastery": 3000,
        "partStates": {
            "blueprint": 0,
            "blade": 0,
            "handle": 0,
            "aegis": 0
        },
        "state": {
            "item": 0,
            "parts": {
                "blueprint": 0,
                "blade": 0,
                "handle": 0,
                "aegis": 0
            }
        },
        "hash": "",
        "links": {
            "wiki": "https://warframe.fandom.com/wiki/Centaur",
            "market": ""
        },
        "search": "centaur",
        "type": "arch-melee",
        "masteryLimit": 8,
        "variant": "normal"
    },
    "arch-melee-kaszas": {
        "name": "Kaszas",
        "parts": {
            "blueprint": [
                "Purchased from the Market."
            ],
            "blade": [
                "Purchased from Red Veil; Rank 2 required."
            ],
            "handle": [
                "Purchased from Steel Meridian; Rank 2 required."
            ]
        },
        "mastery": 3000,
        "partStates": {
            "blueprint": 0,
            "blade": 0,
            "handle": 0
        },
        "state": {
            "item": 0,
            "parts": {
                "blueprint": 0,
                "blade": 0,
                "handle": 0
            }
        },
        "hash": "",
        "links": {
            "wiki": "https://warframe.fandom.com/wiki/Kaszas",
            "market": ""
        },
        "search": "kaszas",
        "type": "arch-melee",
        "masteryLimit": 4,
        "variant": "normal"
    },
    "arch-melee-knux": {
        "name": "Knux",
        "parts": {
            "blueprint": [
                "Researched from the Chem Lab in the dojo."
            ]
        },
        "mastery": 3000,
        "partStates": {
            "blueprint": 0
        },
        "state": {
            "item": 0,
            "parts": {
                "blueprint": 0
            }
        },
        "hash": "",
        "links": {
            "wiki": "https://warframe.fandom.com/wiki/Knux",
            "market": ""
        },
        "search": "knux",
        "type": "arch-melee",
        "masteryLimit": 7,
        "variant": "normal"
    },
    "arch-melee-onorix": {
        "name": "Onorix",
        "parts": {
            "blueprint": [
                "Purchased from the Market."
            ],
            "blade": [
                "Purchased from New Loka; Rank 2 required."
            ],
            "handle": [
                "Purchased from The Perrin Sequence; Rank 2 required."
            ]
        },
        "mastery": 3000,
        "partStates": {
            "blueprint": 0,
            "blade": 0,
            "handle": 0
        },
        "state": {
            "item": 0,
            "parts": {
                "blueprint": 0,
                "blade": 0,
                "handle": 0
            }
        },
        "hash": "",
        "links": {
            "wiki": "https://warframe.fandom.com/wiki/Onorix",
            "market": ""
        },
        "search": "onorix",
        "type": "arch-melee",
        "masteryLimit": 1,
        "variant": "normal"
    },
    "arch-melee-rathbone": {
        "name": "Rathbone",
        "parts": {
            "blueprint": [
                "Purchased from the Market."
            ],
            "head": [
                "Purchased from New Loka; Rank 2 required."
            ],
            "handle": [
                "Purchased from Red Veil; Rank 2 required."
            ]
        },
        "mastery": 3000,
        "partStates": {
            "blueprint": 0,
            "head": 0,
            "handle": 0
        },
        "state": {
            "item": 0,
            "parts": {
                "blueprint": 0,
                "head": 0,
                "handle": 0
            }
        },
        "hash": "",
        "links": {
            "wiki": "https://warframe.fandom.com/wiki/Rathbone",
            "market": ""
        },
        "search": "rathbone",
        "type": "arch-melee",
        "masteryLimit": 6,
        "variant": "normal"
    },
    "arch-melee-veritux": {
        "name": "Veritux",
        "parts": {
            "blueprint": [
                "A built Veritux is acquired upon claiming the Odonata Archwing."
            ]
        },
        "mastery": 3000,
        "partStates": {
            "blueprint": 0
        },
        "state": {
            "item": 0,
            "parts": {
                "blueprint": 0
            }
        },
        "hash": "",
        "links": {
            "wiki": "https://warframe.fandom.com/wiki/Veritux",
            "market": ""
        },
        "search": "veritux",
        "type": "arch-melee",
        "masteryLimit": 0,
        "variant": "normal"
    },
    "arch-melee-prisma_veritux": {
        "name": "Prisma Veritux",
        "parts": {
            "blueprint": [
                "Potentially sold by Baro Ki'Teer."
            ]
        },
        "mastery": 3000,
        "partStates": {
            "blueprint": 0
        },
        "state": {
            "item": 0,
            "parts": {
                "blueprint": 0
            }
        },
        "hash": "",
        "links": {
            "wiki": "https://warframe.fandom.com/wiki/Prisma_Veritux",
            "market": ""
        },
        "search": "prisma veritux",
        "type": "arch-melee",
        "masteryLimit": 8,
        "variant": "prisma"
    }
}