{
    "blueprint": "Bp",
    "neuroptics": "Neu",
    "chassis": "Cha",
    "systems": "Sys",
    "equinoxnight": "Night",
    "equinoxday": "Day",
    "barrel": "Barrel",
    "receiver": "Receiver",
    "stock": "Stock",
    "upperlimb": "Upper Limb",
    "lowerlimb": "Lower Limb",
    "grip": "Grip",
    "string": "String",
    "blade": "Blade",
    "handle": "Handle",
    "link": "Link",
    "pouch": "Pouch",
    "stars": "Stars",
    "blades": "Blades",
    "gauntlet": "Gauntlet",
    "leftgaunt": "Left Gauntlet",
    "rightgaunt": "Right Gauntlet",
    "boot": "Boot",
    "heatsink": "Heatsink",
    "hilt": "Hilt",
    "head": "Head",
    "motor": "Motor",
    "disc": "Disc",
    "subcortex": "Subcortex",
    "core": "Core",
    "chain": "Chain",
    "ornament": "Ornament",
    "guard": "Guard",
    "engine": "Engine",
    "rivet": "Rivet",
    "limbs": "Limbs",
    "cerebrum": "Cerebrum",
    "carapace": "Carapace",
    "harness": "Harness",
    "wings": "Wings",
    "casing": "Casing",
    "capsule": "Capsule",
    "weaponpod": "Weapon Pod",
    "built": "Built",
    "lich": "Lich",
    "sister": "Sister",
    "breed": "Breed",
    "model": "Model",
    "chamber": "Chamber",
    "predasite": "Predasite",
    "prism": "Prism",
    "board": "Board"
}