{
    "frame-prime-ash": {
        "name": "Ash",
        "hash": "e8e9be92f3d765bf21a0cc0f06438392",
        "image": "frame-prime-ash.png",
        "type": "frame-prime",
        "masteryLimit": 0,
        "variant": "prime",
        "variants": [
            "normal"
        ],
        "parts": {
            "blueprint": [
                "first",
                "second"
            ],
            "neuroptics": [
                "first",
                "second"
            ],
            "chassis": [
                "first",
                "second"
            ],
            "systems": [
                "first",
                "second"
            ]
        },
        "links": {
            "wiki": "",
            "market": ""
        },
        "search": "ash",
        "mastery": 6000,
        "state": {
            "item": 0,
            "parts": {
                "blueprint": 0,
                "neuroptics": 0,
                "chassis": 0,
                "systems": 0
            }
        }
    },
    "frame-prime-atlas": {
        "name": "Atlas",
        "hash": "ba905b20ecd37e1162511b37435f02b9",
        "image": "frame-prime-atlas.png",
        "type": "frame-prime",
        "masteryLimit": 0,
        "variant": "prime",
        "variants": [
            "normal"
        ],
        "parts": {
            "blueprint": [
                "first",
                "second"
            ],
            "neuroptics": [
                "first",
                "second"
            ],
            "chassis": [
                "first",
                "second"
            ],
            "systems": [
                "first",
                "second"
            ]
        },
        "links": {
            "wiki": "",
            "market": ""
        },
        "search": "atlas",
        "mastery": 6000,
        "state": {
            "item": 0,
            "parts": {
                "blueprint": 0,
                "neuroptics": 0,
                "chassis": 0,
                "systems": 0
            }
        }
    },
    "frame-prime-banshee": {
        "name": "Banshee",
        "hash": "7ffa9791fa27234faecaaeb91cd87da9",
        "image": "frame-prime-banshee.png",
        "type": "frame-prime",
        "masteryLimit": 0,
        "variant": "prime",
        "variants": [
            "normal"
        ],
        "parts": {
            "blueprint": [
                "first",
                "second"
            ],
            "neuroptics": [
                "first",
                "second"
            ],
            "chassis": [
                "first",
                "second"
            ],
            "systems": [
                "first",
                "second"
            ]
        },
        "links": {
            "wiki": "",
            "market": ""
        },
        "search": "banshee",
        "mastery": 6000,
        "state": {
            "item": 0,
            "parts": {
                "blueprint": 0,
                "neuroptics": 0,
                "chassis": 0,
                "systems": 0
            }
        }
    },
    "frame-prime-chroma": {
        "name": "Chroma",
        "hash": "fc8d5aabec0dd344dc0315d92a46400c",
        "image": "frame-prime-chroma.png",
        "type": "frame-prime",
        "masteryLimit": 0,
        "variant": "prime",
        "variants": [
            "normal"
        ],
        "parts": {
            "blueprint": [
                "first",
                "second"
            ],
            "neuroptics": [
                "first",
                "second"
            ],
            "chassis": [
                "first",
                "second"
            ],
            "systems": [
                "first",
                "second"
            ]
        },
        "links": {
            "wiki": "",
            "market": ""
        },
        "search": "chroma",
        "mastery": 6000,
        "state": {
            "item": 0,
            "parts": {
                "blueprint": 0,
                "neuroptics": 0,
                "chassis": 0,
                "systems": 0
            }
        }
    },
    "frame-prime-ember": {
        "name": "Ember",
        "hash": "1baaf4e4557e91202cc83caf2cb71187",
        "image": "frame-prime-ember.png",
        "type": "frame-prime",
        "masteryLimit": 0,
        "variant": "prime",
        "variants": [
            "normal"
        ],
        "parts": {
            "blueprint": [
                "first",
                "second"
            ],
            "neuroptics": [
                "first",
                "second"
            ],
            "chassis": [
                "first",
                "second"
            ],
            "systems": [
                "first",
                "second"
            ]
        },
        "links": {
            "wiki": "",
            "market": ""
        },
        "search": "ember",
        "mastery": 6000,
        "state": {
            "item": 0,
            "parts": {
                "blueprint": 0,
                "neuroptics": 0,
                "chassis": 0,
                "systems": 0
            }
        }
    },
    "frame-prime-equinox": {
        "name": "Equinox",
        "hash": "8f825fe62825e7850c206529833400a5",
        "image": "frame-prime-equinox.png",
        "type": "frame-prime",
        "masteryLimit": 0,
        "variant": "prime",
        "variants": [
            "normal"
        ],
        "parts": {
            "blueprint": [
                "first",
                "second"
            ],
            "neuroptics": [
                "first",
                "second"
            ],
            "chassis": [
                "first",
                "second"
            ],
            "systems": [
                "first",
                "second"
            ]
        },
        "links": {
            "wiki": "",
            "market": ""
        },
        "search": "equinox",
        "mastery": 6000,
        "state": {
            "item": 0,
            "parts": {
                "blueprint": 0,
                "neuroptics": 0,
                "chassis": 0,
                "systems": 0
            }
        }
    },
    "frame-prime-excalibur": {
        "name": "Excalibur",
        "hash": "f77fe66e9310c3ff65b9e2d16d5ae98b",
        "image": "frame-prime-excalibur.png",
        "type": "frame-prime",
        "masteryLimit": 0,
        "variant": "prime",
        "variants": [
            "normal"
        ],
        "parts": {
            "blueprint": [
                "first",
                "second"
            ],
            "neuroptics": [
                "first",
                "second"
            ],
            "chassis": [
                "first",
                "second"
            ],
            "systems": [
                "first",
                "second"
            ]
        },
        "links": {
            "wiki": "",
            "market": ""
        },
        "search": "excalibur",
        "mastery": 6000,
        "state": {
            "item": 0,
            "parts": {
                "blueprint": 0,
                "neuroptics": 0,
                "chassis": 0,
                "systems": 0
            }
        }
    },
    "frame-prime-frost": {
        "name": "Frost",
        "hash": "e019675e7cf1f4d9e912ca64220967d3",
        "image": "frame-prime-frost.png",
        "type": "frame-prime",
        "masteryLimit": 0,
        "variant": "prime",
        "variants": [
            "normal"
        ],
        "parts": {
            "blueprint": [
                "first",
                "second"
            ],
            "neuroptics": [
                "first",
                "second"
            ],
            "chassis": [
                "first",
                "second"
            ],
            "systems": [
                "first",
                "second"
            ]
        },
        "links": {
            "wiki": "",
            "market": ""
        },
        "search": "frost",
        "mastery": 6000,
        "state": {
            "item": 0,
            "parts": {
                "blueprint": 0,
                "neuroptics": 0,
                "chassis": 0,
                "systems": 0
            }
        }
    },
    "frame-prime-gara": {
        "name": "Gara",
        "hash": "8a2ca65d3d3b89ee8ed4009a272ae93f",
        "image": "frame-prime-gara.png",
        "type": "frame-prime",
        "masteryLimit": 0,
        "variant": "prime",
        "variants": [
            "normal"
        ],
        "parts": {
            "blueprint": [
                "first",
                "second"
            ],
            "neuroptics": [
                "first",
                "second"
            ],
            "chassis": [
                "first",
                "second"
            ],
            "systems": [
                "first",
                "second"
            ]
        },
        "links": {
            "wiki": "",
            "market": ""
        },
        "search": "gara",
        "mastery": 6000,
        "state": {
            "item": 0,
            "parts": {
                "blueprint": 0,
                "neuroptics": 0,
                "chassis": 0,
                "systems": 0
            }
        }
    },
    "frame-prime-hydroid": {
        "name": "Hydroid",
        "hash": "e8770306d45a359dd8bd46ddcfbe42fd",
        "image": "frame-prime-hydroid.png",
        "type": "frame-prime",
        "masteryLimit": 0,
        "variant": "prime",
        "variants": [
            "normal"
        ],
        "parts": {
            "blueprint": [
                "first",
                "second"
            ],
            "neuroptics": [
                "first",
                "second"
            ],
            "chassis": [
                "first",
                "second"
            ],
            "systems": [
                "first",
                "second"
            ]
        },
        "links": {
            "wiki": "",
            "market": ""
        },
        "search": "hydroid",
        "mastery": 6000,
        "state": {
            "item": 0,
            "parts": {
                "blueprint": 0,
                "neuroptics": 0,
                "chassis": 0,
                "systems": 0
            }
        }
    },
    "frame-prime-inaros": {
        "name": "Inaros",
        "hash": "d622294fd4b35220668fd901a38132f7",
        "image": "frame-prime-inaros.png",
        "type": "frame-prime",
        "masteryLimit": 0,
        "variant": "prime",
        "variants": [
            "normal"
        ],
        "parts": {
            "blueprint": [
                "first",
                "second"
            ],
            "neuroptics": [
                "first",
                "second"
            ],
            "chassis": [
                "first",
                "second"
            ],
            "systems": [
                "first",
                "second"
            ]
        },
        "links": {
            "wiki": "",
            "market": ""
        },
        "search": "inaros",
        "mastery": 6000,
        "state": {
            "item": 0,
            "parts": {
                "blueprint": 0,
                "neuroptics": 0,
                "chassis": 0,
                "systems": 0
            }
        }
    },
    "frame-prime-ivara": {
        "name": "Ivara",
        "hash": "43ed6aa7588fee82f36433177d6860a5",
        "image": "frame-prime-ivara.png",
        "type": "frame-prime",
        "masteryLimit": 0,
        "variant": "prime",
        "variants": [
            "normal"
        ],
        "parts": {
            "blueprint": [
                "first",
                "second"
            ],
            "neuroptics": [
                "first",
                "second"
            ],
            "chassis": [
                "first",
                "second"
            ],
            "systems": [
                "first",
                "second"
            ]
        },
        "links": {
            "wiki": "",
            "market": ""
        },
        "search": "ivara",
        "mastery": 6000,
        "state": {
            "item": 0,
            "parts": {
                "blueprint": 0,
                "neuroptics": 0,
                "chassis": 0,
                "systems": 0
            }
        }
    },
    "frame-prime-limbo": {
        "name": "Limbo",
        "hash": "d500422f5a3b202c031ae76c6beee2c7",
        "image": "frame-prime-limbo.png",
        "type": "frame-prime",
        "masteryLimit": 0,
        "variant": "prime",
        "variants": [
            "normal"
        ],
        "parts": {
            "blueprint": [
                "first",
                "second"
            ],
            "neuroptics": [
                "first",
                "second"
            ],
            "chassis": [
                "first",
                "second"
            ],
            "systems": [
                "first",
                "second"
            ]
        },
        "links": {
            "wiki": "",
            "market": ""
        },
        "search": "limbo",
        "mastery": 6000,
        "state": {
            "item": 0,
            "parts": {
                "blueprint": 0,
                "neuroptics": 0,
                "chassis": 0,
                "systems": 0
            }
        }
    },
    "frame-prime-loki": {
        "name": "Loki",
        "hash": "bc2f8fd952f2420639a7484ad03060e4",
        "image": "frame-prime-loki.png",
        "type": "frame-prime",
        "masteryLimit": 0,
        "variant": "prime",
        "variants": [
            "normal"
        ],
        "parts": {
            "blueprint": [
                "first",
                "second"
            ],
            "neuroptics": [
                "first",
                "second"
            ],
            "chassis": [
                "first",
                "second"
            ],
            "systems": [
                "first",
                "second"
            ]
        },
        "links": {
            "wiki": "",
            "market": ""
        },
        "search": "loki",
        "mastery": 6000,
        "state": {
            "item": 0,
            "parts": {
                "blueprint": 0,
                "neuroptics": 0,
                "chassis": 0,
                "systems": 0
            }
        }
    },
    "frame-prime-mag": {
        "name": "Mag",
        "hash": "dfdcf60d2428d17df9cb7d06848d8847",
        "image": "frame-prime-mag.png",
        "type": "frame-prime",
        "masteryLimit": 0,
        "variant": "prime",
        "variants": [
            "normal"
        ],
        "parts": {
            "blueprint": [
                "first",
                "second"
            ],
            "neuroptics": [
                "first",
                "second"
            ],
            "chassis": [
                "first",
                "second"
            ],
            "systems": [
                "first",
                "second"
            ]
        },
        "links": {
            "wiki": "",
            "market": ""
        },
        "search": "mag",
        "mastery": 6000,
        "state": {
            "item": 0,
            "parts": {
                "blueprint": 0,
                "neuroptics": 0,
                "chassis": 0,
                "systems": 0
            }
        }
    },
    "frame-prime-mesa": {
        "name": "Mesa",
        "hash": "fa248a2409de23e4e1ff0ab9c353b39c",
        "image": "frame-prime-mesa.png",
        "type": "frame-prime",
        "masteryLimit": 0,
        "variant": "prime",
        "variants": [
            "normal"
        ],
        "parts": {
            "blueprint": [
                "first",
                "second"
            ],
            "neuroptics": [
                "first",
                "second"
            ],
            "chassis": [
                "first",
                "second"
            ],
            "systems": [
                "first",
                "second"
            ]
        },
        "links": {
            "wiki": "",
            "market": ""
        },
        "search": "mesa",
        "mastery": 6000,
        "state": {
            "item": 0,
            "parts": {
                "blueprint": 0,
                "neuroptics": 0,
                "chassis": 0,
                "systems": 0
            }
        }
    },
    "frame-prime-mirage": {
        "name": "Mirage",
        "hash": "6a2c03652a0c607e25e512082aa6c896",
        "image": "frame-prime-mirage.png",
        "type": "frame-prime",
        "masteryLimit": 0,
        "variant": "prime",
        "variants": [
            "normal"
        ],
        "parts": {
            "blueprint": [
                "first",
                "second"
            ],
            "neuroptics": [
                "first",
                "second"
            ],
            "chassis": [
                "first",
                "second"
            ],
            "systems": [
                "first",
                "second"
            ]
        },
        "links": {
            "wiki": "",
            "market": ""
        },
        "search": "mirage",
        "mastery": 6000,
        "state": {
            "item": 0,
            "parts": {
                "blueprint": 0,
                "neuroptics": 0,
                "chassis": 0,
                "systems": 0
            }
        }
    },
    "frame-prime-nekros": {
        "name": "Nekros",
        "hash": "0a08a735db8ed8400d66abdd5d6d7d05",
        "image": "frame-prime-nekros.png",
        "type": "frame-prime",
        "masteryLimit": 0,
        "variant": "prime",
        "variants": [
            "normal"
        ],
        "parts": {
            "blueprint": [
                "first",
                "second"
            ],
            "neuroptics": [
                "first",
                "second"
            ],
            "chassis": [
                "first",
                "second"
            ],
            "systems": [
                "first",
                "second"
            ]
        },
        "links": {
            "wiki": "",
            "market": ""
        },
        "search": "nekros",
        "mastery": 6000,
        "state": {
            "item": 0,
            "parts": {
                "blueprint": 0,
                "neuroptics": 0,
                "chassis": 0,
                "systems": 0
            }
        }
    },
    "frame-prime-nezha": {
        "name": "Nezha",
        "hash": "49fb8938fb3a6861cef6939da964fe47",
        "image": "frame-prime-nezha.png",
        "type": "frame-prime",
        "masteryLimit": 0,
        "variant": "prime",
        "variants": [
            "normal"
        ],
        "parts": {
            "blueprint": [
                "first",
                "second"
            ],
            "neuroptics": [
                "first",
                "second"
            ],
            "chassis": [
                "first",
                "second"
            ],
            "systems": [
                "first",
                "second"
            ]
        },
        "links": {
            "wiki": "",
            "market": ""
        },
        "search": "nezha",
        "mastery": 6000,
        "state": {
            "item": 0,
            "parts": {
                "blueprint": 0,
                "neuroptics": 0,
                "chassis": 0,
                "systems": 0
            }
        }
    },
    "frame-prime-nidus": {
        "name": "Nidus",
        "hash": "d7770c5af7734394e290297cf11d9a98",
        "image": "frame-prime-nidus.png",
        "type": "frame-prime",
        "masteryLimit": 0,
        "variant": "prime",
        "variants": [
            "normal"
        ],
        "parts": {
            "blueprint": [
                "first",
                "second"
            ],
            "neuroptics": [
                "first",
                "second"
            ],
            "chassis": [
                "first",
                "second"
            ],
            "systems": [
                "first",
                "second"
            ]
        },
        "links": {
            "wiki": "",
            "market": ""
        },
        "search": "nidus",
        "mastery": 6000,
        "state": {
            "item": 0,
            "parts": {
                "blueprint": 0,
                "neuroptics": 0,
                "chassis": 0,
                "systems": 0
            }
        }
    },
    "frame-prime-nova": {
        "name": "Nova",
        "hash": "12201f2f46990a1e2084fe0880507cf5",
        "image": "frame-prime-nova.png",
        "type": "frame-prime",
        "masteryLimit": 0,
        "variant": "prime",
        "variants": [
            "normal"
        ],
        "parts": {
            "blueprint": [
                "first",
                "second"
            ],
            "neuroptics": [
                "first",
                "second"
            ],
            "chassis": [
                "first",
                "second"
            ],
            "systems": [
                "first",
                "second"
            ]
        },
        "links": {
            "wiki": "",
            "market": ""
        },
        "search": "nova",
        "mastery": 6000,
        "state": {
            "item": 0,
            "parts": {
                "blueprint": 0,
                "neuroptics": 0,
                "chassis": 0,
                "systems": 0
            }
        }
    },
    "frame-prime-nyx": {
        "name": "Nyx",
        "hash": "d6a016c817d97280028c04ff076fd2aa",
        "image": "frame-prime-nyx.png",
        "type": "frame-prime",
        "masteryLimit": 0,
        "variant": "prime",
        "variants": [
            "normal"
        ],
        "parts": {
            "blueprint": [
                "first",
                "second"
            ],
            "neuroptics": [
                "first",
                "second"
            ],
            "chassis": [
                "first",
                "second"
            ],
            "systems": [
                "first",
                "second"
            ]
        },
        "links": {
            "wiki": "",
            "market": ""
        },
        "search": "nyx",
        "mastery": 6000,
        "state": {
            "item": 0,
            "parts": {
                "blueprint": 0,
                "neuroptics": 0,
                "chassis": 0,
                "systems": 0
            }
        }
    },
    "frame-prime-oberon": {
        "name": "Oberon",
        "hash": "331fc0bf321f7d8a19bf9531105ed12b",
        "image": "frame-prime-oberon.png",
        "type": "frame-prime",
        "masteryLimit": 0,
        "variant": "prime",
        "variants": [
            "normal"
        ],
        "parts": {
            "blueprint": [
                "first",
                "second"
            ],
            "neuroptics": [
                "first",
                "second"
            ],
            "chassis": [
                "first",
                "second"
            ],
            "systems": [
                "first",
                "second"
            ]
        },
        "links": {
            "wiki": "",
            "market": ""
        },
        "search": "oberon",
        "mastery": 6000,
        "state": {
            "item": 0,
            "parts": {
                "blueprint": 0,
                "neuroptics": 0,
                "chassis": 0,
                "systems": 0
            }
        }
    },
    "frame-prime-octavia": {
        "name": "Octavia",
        "hash": "1ebb78423d6c8fb06cc382ddd8c676f0",
        "image": "frame-prime-octavia.png",
        "type": "frame-prime",
        "masteryLimit": 0,
        "variant": "prime",
        "variants": [
            "normal"
        ],
        "parts": {
            "blueprint": [
                "first",
                "second"
            ],
            "neuroptics": [
                "first",
                "second"
            ],
            "chassis": [
                "first",
                "second"
            ],
            "systems": [
                "first",
                "second"
            ]
        },
        "links": {
            "wiki": "",
            "market": ""
        },
        "search": "octavia",
        "mastery": 6000,
        "state": {
            "item": 0,
            "parts": {
                "blueprint": 0,
                "neuroptics": 0,
                "chassis": 0,
                "systems": 0
            }
        }
    },
    "frame-prime-rhino": {
        "name": "Rhino",
        "hash": "8892724505575920489db7ecc77f95a9",
        "image": "frame-prime-rhino.png",
        "type": "frame-prime",
        "masteryLimit": 0,
        "variant": "prime",
        "variants": [
            "normal"
        ],
        "parts": {
            "blueprint": [
                "first",
                "second"
            ],
            "neuroptics": [
                "first",
                "second"
            ],
            "chassis": [
                "first",
                "second"
            ],
            "systems": [
                "first",
                "second"
            ]
        },
        "links": {
            "wiki": "",
            "market": ""
        },
        "search": "rhino",
        "mastery": 6000,
        "state": {
            "item": 0,
            "parts": {
                "blueprint": 0,
                "neuroptics": 0,
                "chassis": 0,
                "systems": 0
            }
        }
    },
    "frame-prime-saryn": {
        "name": "Saryn",
        "hash": "8a59b3f5363644d1e7af43e2ce16caed",
        "image": "frame-prime-saryn.png",
        "type": "frame-prime",
        "masteryLimit": 0,
        "variant": "prime",
        "variants": [
            "normal"
        ],
        "parts": {
            "blueprint": [
                "first",
                "second"
            ],
            "neuroptics": [
                "first",
                "second"
            ],
            "chassis": [
                "first",
                "second"
            ],
            "systems": [
                "first",
                "second"
            ]
        },
        "links": {
            "wiki": "",
            "market": ""
        },
        "search": "saryn",
        "mastery": 6000,
        "state": {
            "item": 0,
            "parts": {
                "blueprint": 0,
                "neuroptics": 0,
                "chassis": 0,
                "systems": 0
            }
        }
    },
    "frame-prime-titania": {
        "name": "Titania",
        "hash": "1ccc08d4863524757777d5f9e45db7bb",
        "image": "frame-prime-titania.png",
        "type": "frame-prime",
        "masteryLimit": 0,
        "variant": "prime",
        "variants": [
            "normal"
        ],
        "parts": {
            "blueprint": [
                "first",
                "second"
            ],
            "neuroptics": [
                "first",
                "second"
            ],
            "chassis": [
                "first",
                "second"
            ],
            "systems": [
                "first",
                "second"
            ]
        },
        "links": {
            "wiki": "",
            "market": ""
        },
        "search": "titania",
        "mastery": 6000,
        "state": {
            "item": 0,
            "parts": {
                "blueprint": 0,
                "neuroptics": 0,
                "chassis": 0,
                "systems": 0
            }
        }
    },
    "frame-prime-trinity": {
        "name": "Trinity",
        "hash": "52e948d26e45799946ec5f22e633708e",
        "image": "frame-prime-trinity.png",
        "type": "frame-prime",
        "masteryLimit": 0,
        "variant": "prime",
        "variants": [
            "normal"
        ],
        "parts": {
            "blueprint": [
                "first",
                "second"
            ],
            "neuroptics": [
                "first",
                "second"
            ],
            "chassis": [
                "first",
                "second"
            ],
            "systems": [
                "first",
                "second"
            ]
        },
        "links": {
            "wiki": "",
            "market": ""
        },
        "search": "trinity",
        "mastery": 6000,
        "state": {
            "item": 0,
            "parts": {
                "blueprint": 0,
                "neuroptics": 0,
                "chassis": 0,
                "systems": 0
            }
        }
    },
    "frame-prime-valkyr": {
        "name": "Valkyr",
        "hash": "24c4b15b282207a32bf244d6d5015d7a",
        "image": "frame-prime-valkyr.png",
        "type": "frame-prime",
        "masteryLimit": 0,
        "variant": "prime",
        "variants": [
            "normal"
        ],
        "parts": {
            "blueprint": [
                "first",
                "second"
            ],
            "neuroptics": [
                "first",
                "second"
            ],
            "chassis": [
                "first",
                "second"
            ],
            "systems": [
                "first",
                "second"
            ]
        },
        "links": {
            "wiki": "",
            "market": ""
        },
        "search": "valkyr",
        "mastery": 6000,
        "state": {
            "item": 0,
            "parts": {
                "blueprint": 0,
                "neuroptics": 0,
                "chassis": 0,
                "systems": 0
            }
        }
    },
    "frame-prime-vauban": {
        "name": "Vauban",
        "hash": "6a022234930a247c94eb59f9379ed54c",
        "image": "frame-prime-vauban.png",
        "type": "frame-prime",
        "masteryLimit": 0,
        "variant": "prime",
        "variants": [
            "normal"
        ],
        "parts": {
            "blueprint": [
                "first",
                "second"
            ],
            "neuroptics": [
                "first",
                "second"
            ],
            "chassis": [
                "first",
                "second"
            ],
            "systems": [
                "first",
                "second"
            ]
        },
        "links": {
            "wiki": "",
            "market": ""
        },
        "search": "vauban",
        "mastery": 6000,
        "state": {
            "item": 0,
            "parts": {
                "blueprint": 0,
                "neuroptics": 0,
                "chassis": 0,
                "systems": 0
            }
        }
    },
    "frame-prime-volt": {
        "name": "Volt",
        "hash": "4a91f0afffc11e4bcaf64be89db76c55",
        "image": "frame-prime-volt.png",
        "type": "frame-prime",
        "masteryLimit": 0,
        "variant": "prime",
        "variants": [
            "normal"
        ],
        "parts": {
            "blueprint": [
                "first",
                "second"
            ],
            "neuroptics": [
                "first",
                "second"
            ],
            "chassis": [
                "first",
                "second"
            ],
            "systems": [
                "first",
                "second"
            ]
        },
        "links": {
            "wiki": "",
            "market": ""
        },
        "search": "volt",
        "mastery": 6000,
        "state": {
            "item": 0,
            "parts": {
                "blueprint": 0,
                "neuroptics": 0,
                "chassis": 0,
                "systems": 0
            }
        }
    },
    "frame-prime-wukong": {
        "name": "Wukong",
        "hash": "9459f845fd2ca5e7d65bbf661e3851a9",
        "image": "frame-prime-wukong.png",
        "type": "frame-prime",
        "masteryLimit": 0,
        "variant": "prime",
        "variants": [
            "normal"
        ],
        "parts": {
            "blueprint": [
                "first",
                "second"
            ],
            "neuroptics": [
                "first",
                "second"
            ],
            "chassis": [
                "first",
                "second"
            ],
            "systems": [
                "first",
                "second"
            ]
        },
        "links": {
            "wiki": "",
            "market": ""
        },
        "search": "wukong",
        "mastery": 6000,
        "state": {
            "item": 0,
            "parts": {
                "blueprint": 0,
                "neuroptics": 0,
                "chassis": 0,
                "systems": 0
            }
        }
    },
    "frame-prime-zephyr": {
        "name": "Zephyr",
        "hash": "ca035e87f1daab21f9c1bbe5f3b787b3",
        "image": "frame-prime-zephyr.png",
        "type": "frame-prime",
        "masteryLimit": 0,
        "variant": "prime",
        "variants": [
            "normal"
        ],
        "parts": {
            "blueprint": [
                "first",
                "second"
            ],
            "neuroptics": [
                "first",
                "second"
            ],
            "chassis": [
                "first",
                "second"
            ],
            "systems": [
                "first",
                "second"
            ]
        },
        "links": {
            "wiki": "",
            "market": ""
        },
        "search": "zephyr",
        "mastery": 6000,
        "state": {
            "item": 0,
            "parts": {
                "blueprint": 0,
                "neuroptics": 0,
                "chassis": 0,
                "systems": 0
            }
        }
    }
}