{
    "modular-hound-bhaira": {
        "name": "Bhaira Model",
        "parts": {
            "blueprint": [
                "Earned by vanquishing a Sister of Parvos."
            ]
        },
        "mastery": 6000,
        "partStates": {
            "blueprint": 0
        },
        "state": {
            "item": 0,
            "parts": {
                "blueprint": 0
            }
        },
        "hash": "",
        "links": {
            "wiki": "https://warframe.fandom.com/wiki/Model#Bhaira",
            "market": ""
        },
        "search": "bhaira model",
        "type": "modular-hound",
        "masteryLimit": -1,
        "variant": "normal"
    },
    "modular-hound-dorma": {
        "name": "Dorma Model",
        "parts": {
            "blueprint": [
                "Earned by vanquishing a Sister of Parvos."
            ]
        },
        "mastery": 6000,
        "partStates": {
            "blueprint": 0
        },
        "state": {
            "item": 0,
            "parts": {
                "blueprint": 0
            }
        },
        "hash": "",
        "links": {
            "wiki": "https://warframe.fandom.com/wiki/Model#Dorma",
            "market": ""
        },
        "search": "dorma model",
        "type": "modular-hound",
        "masteryLimit": -1,
        "variant": "normal"
    },
    "modular-hound-hec": {
        "name": "Hec Model",
        "parts": {
            "blueprint": [
                "Earned by vanquishing a Sister of Parvos."
            ]
        },
        "mastery": 6000,
        "partStates": {
            "blueprint": 0
        },
        "state": {
            "item": 0,
            "parts": {
                "blueprint": 0
            }
        },
        "hash": "",
        "links": {
            "wiki": "https://warframe.fandom.com/wiki/Model#Hec",
            "market": ""
        },
        "search": "hec model",
        "type": "modular-hound",
        "masteryLimit": -1,
        "variant": "normal"
    }
}