{
    "rarity":
    {
        "common":
        {
            "symbol": "♦",
            "name": "Common",
            "material": "Bronze",
            "color": "#DCA156"
        },
        "uncommon":
        {
            "symbol": "♦♦",
            "name": "Uncommon",
            "material": "Silver",
            "color": "#CCCCCC"
        },
        "rare":
        {
            "symbol": "♦♦♦",
            "name": "Rare",
            "material": "Gold",
            "color": "#FFD01C"
        },
        "legendary":
        {
            "symbol": "♦♦♦♦",
            "name": "Primed",
            "material": "Platinum",
            "color": "#E6E6E6"
        },
        "riven":
        {
            "symbol": "♦♦♦♦♦",
            "name": "Riven",
            "material": "Crystal",
            "color": "#BE87D4"
        },
        "peculiar":
        {
            "symbol": "",
            "name": "Peculiar",
            "material": "Smoke",
            "color": "#666666"
        },
        "amalgam":
        {
            "symbol": "",
            "name": "Amalgam",
            "material": "Sentient",
            "color": "#cbcbcb"
        },
        "requiem":
        {
            "symbol": "",
            "name": "Requiem",
            "material": "Obsidian",
            "color": "#6b6464"
        },
        "galvanized":
        {
            "symbol": "",
            "name": "Galvanized",
            "material": "Metallic",
            "color": "#636a8e"
        }
    }
}