Gigabit Loopback (200 rounds)

Standard
   min:  3.699999988079071
   max:  11.200000017881393
   avg:  4.232000000178814
   med:  4.199999988079071
Compression: deflate
   min:  4.800000011920929
   max:  10.599999994039536
   avg:  5.3525
   med:  4.9000000059604645
Compression: gzip
   min:  4.699999988079071
   max:  9.699999988079071
   avg:  5.417500000149012
   med:  5.600000023841858
Compression: brotli
   min:  3.5999999940395355
   max:  9.5
   avg:  4.170000000149011
   med:  4.4000000059604645