\relax 
\providecommand\hyper@newdestlabel[2]{}
\providecommand\HyperFirstAtBeginDocument{\AtBeginDocument}
\HyperFirstAtBeginDocument{\ifx\hyper@anchor\@undefined
\global\let\oldcontentsline\contentsline
\gdef\contentsline#1#2#3#4{\oldcontentsline{#1}{#2}{#3}}
\global\let\oldnewlabel\newlabel
\gdef\newlabel#1#2{\newlabelxx{#1}#2}
\gdef\newlabelxx#1#2#3#4#5#6{\oldnewlabel{#1}{{#2}{#3}}}
\AtEndDocument{\ifx\hyper@anchor\@undefined
\let\contentsline\oldcontentsline
\let\newlabel\oldnewlabel
\fi}
\fi}
\global\let\hyper@last\relax 
\gdef\HyperFirstAtBeginDocument#1{#1}
\providecommand\HyField@AuxAddToFields[1]{}
\providecommand\HyField@AuxAddToCoFields[2]{}
\@writefile{toc}{\contentsline {section}{\numberline {I}Introducci\IeC {\'o}n}{1}{section.1}}
\@writefile{toc}{\contentsline {section}{\numberline {II}Marco Te\IeC {\'o}rico}{1}{section.2}}
\@writefile{toc}{\contentsline {subsection}{\numberline {\unhbox \voidb@x \hbox {II-A}}\IeC {\'A}ngulos de Euler}{1}{subsection.2.1}}
\@writefile{lof}{\contentsline {figure}{\numberline {1}{\ignorespaces \IeC {\'A}ngulos de euler.}}{1}{figure.1}}
\newlabel{fig:ejemplo}{{1}{1}{Ángulos de euler}{figure.1}{}}
\@writefile{toc}{\contentsline {subsection}{\numberline {\unhbox \voidb@x \hbox {II-B}}Aceler\IeC {\'o}metro}{1}{subsection.2.2}}
\@writefile{toc}{\contentsline {subsection}{\numberline {\unhbox \voidb@x \hbox {II-C}}Giroscopio}{1}{subsection.2.3}}
\@writefile{toc}{\contentsline {subsection}{\numberline {\unhbox \voidb@x \hbox {II-D}}Magnet\IeC {\'o}metro}{2}{subsection.2.4}}
\@writefile{toc}{\contentsline {subsection}{\numberline {\unhbox \voidb@x \hbox {II-E}}Unidad de medici\IeC {\'o}n inercial}{2}{subsection.2.5}}
\@writefile{lof}{\contentsline {figure}{\numberline {2}{\ignorespaces Unidad de medici\IeC {\'o}n inercial (IMU)}}{2}{figure.2}}
\newlabel{fig:ejemplo}{{2}{2}{Unidad de medición inercial (IMU)}{figure.2}{}}
\@writefile{toc}{\contentsline {section}{\numberline {III}Resultados}{2}{section.3}}
\@writefile{lof}{\contentsline {figure}{\numberline {3}{\ignorespaces Resultados de la primera medici\IeC {\'o}n}}{2}{figure.3}}
\newlabel{fig:ejemplo}{{3}{2}{Resultados de la primera medición}{figure.3}{}}
\@writefile{lof}{\contentsline {figure}{\numberline {4}{\ignorespaces Resultados de la segunda medici\IeC {\'o}n}}{3}{figure.4}}
\newlabel{fig:ejemplo}{{4}{3}{Resultados de la segunda medición}{figure.4}{}}
\@writefile{lof}{\contentsline {figure}{\numberline {5}{\ignorespaces Resultados de la tercera medici\IeC {\'o}n}}{3}{figure.5}}
\newlabel{fig:ejemplo}{{5}{3}{Resultados de la tercera medición}{figure.5}{}}
\@writefile{toc}{\contentsline {section}{\numberline {IV}Conclusi\IeC {\'o}n}{3}{section.4}}
