\relax 
\providecommand\hyper@newdestlabel[2]{}
\providecommand\HyperFirstAtBeginDocument{\AtBeginDocument}
\HyperFirstAtBeginDocument{\ifx\hyper@anchor\@undefined
\global\let\oldcontentsline\contentsline
\gdef\contentsline#1#2#3#4{\oldcontentsline{#1}{#2}{#3}}
\global\let\oldnewlabel\newlabel
\gdef\newlabel#1#2{\newlabelxx{#1}#2}
\gdef\newlabelxx#1#2#3#4#5#6{\oldnewlabel{#1}{{#2}{#3}}}
\AtEndDocument{\ifx\hyper@anchor\@undefined
\let\contentsline\oldcontentsline
\let\newlabel\oldnewlabel
\fi}
\fi}
\global\let\hyper@last\relax 
\gdef\HyperFirstAtBeginDocument#1{#1}
\providecommand\HyField@AuxAddToFields[1]{}
\providecommand\HyField@AuxAddToCoFields[2]{}
\@writefile{toc}{\contentsline {section}{\numberline {I}Introducci\IeC {\'o}n}{1}{section.1}}
\@writefile{toc}{\contentsline {section}{\numberline {II}Marco Te\IeC {\'o}rico}{1}{section.2}}
\@writefile{toc}{\contentsline {subsection}{\numberline {\unhbox \voidb@x \hbox {II-A}}MPU 6050}{1}{subsection.2.1}}
\@writefile{lof}{\contentsline {figure}{\numberline {1}{\ignorespaces Unidad de medici\IeC {\'o}n inercial (IMU)}}{1}{figure.1}}
\newlabel{fig:ejemplo}{{1}{1}{Unidad de medición inercial (IMU)}{figure.1}{}}
\@writefile{toc}{\contentsline {subsection}{\numberline {\unhbox \voidb@x \hbox {II-B}}RASPBERRY PI 3 B+}{2}{subsection.2.2}}
\@writefile{lof}{\contentsline {figure}{\numberline {2}{\ignorespaces Componentes de la Raspberry PI 3 B+}}{2}{figure.2}}
\newlabel{fig:ejemplo}{{2}{2}{Componentes de la Raspberry PI 3 B+}{figure.2}{}}
\@writefile{toc}{\contentsline {subsection}{\numberline {\unhbox \voidb@x \hbox {II-C}}COMUNICACI\IeC {\'O}N SERIAL}{2}{subsection.2.3}}
\@writefile{toc}{\contentsline {subsection}{\numberline {\unhbox \voidb@x \hbox {II-D}}I2C}{2}{subsection.2.4}}
\@writefile{toc}{\contentsline {subsection}{\numberline {\unhbox \voidb@x \hbox {II-E}}VNC Virtual Network Computing (Computaci\IeC {\'o}n Virtual en Red)}{2}{subsection.2.5}}
\@writefile{toc}{\contentsline {section}{\numberline {III}METODOLOG\IeC {\'I}A}{2}{section.3}}
\@writefile{toc}{\contentsline {subsection}{\numberline {\unhbox \voidb@x \hbox {III-A}}ADQUISICI\IeC {\'O}N Y CALIBRACI\IeC {\'O}N DE DATOS}{2}{subsection.3.1}}
\@writefile{toc}{\contentsline {subsection}{\numberline {\unhbox \voidb@x \hbox {III-B}}COMUNICACI\IeC {\'O}N SERIAL STM32-MATLAB}{2}{subsection.3.2}}
\@writefile{toc}{\contentsline {subsection}{\numberline {\unhbox \voidb@x \hbox {III-C}}COMUNICACI\IeC {\'O}N SERIAL STM32-RASPBERRY}{3}{subsection.3.3}}
\@writefile{toc}{\contentsline {section}{\numberline {IV}RESULTADOS}{3}{section.4}}
\@writefile{toc}{\contentsline {subsection}{\numberline {\unhbox \voidb@x \hbox {IV-A}}COMUNICACI\IeC {\'O}N SERIAL STM32-MATLAB}{3}{subsection.4.1}}
\@writefile{lof}{\contentsline {figure}{\numberline {3}{\ignorespaces Valores de los offset}}{3}{figure.3}}
\newlabel{fig:ejemplo}{{3}{3}{Valores de los offset}{figure.3}{}}
\@writefile{lof}{\contentsline {figure}{\numberline {4}{\ignorespaces Aceler\IeC {\'o}metro sin calibrar}}{3}{figure.4}}
\newlabel{fig:ejemplo}{{4}{3}{Acelerómetro sin calibrar}{figure.4}{}}
\@writefile{lof}{\contentsline {figure}{\numberline {5}{\ignorespaces Aceler\IeC {\'o}metro calibrado}}{3}{figure.5}}
\newlabel{fig:ejemplo}{{5}{3}{Acelerómetro calibrado}{figure.5}{}}
\@writefile{lof}{\contentsline {figure}{\numberline {6}{\ignorespaces Comparaci\IeC {\'o}n de datos aceler\IeC {\'o}metro (no calibrados y calibrados)}}{4}{figure.6}}
\newlabel{fig:ejemplo}{{6}{4}{Comparación de datos acelerómetro (no calibrados y calibrados)}{figure.6}{}}
\@writefile{lof}{\contentsline {figure}{\numberline {7}{\ignorespaces Giroscopio sin calibrado}}{4}{figure.7}}
\newlabel{fig:ejemplo}{{7}{4}{Giroscopio sin calibrado}{figure.7}{}}
\@writefile{lof}{\contentsline {figure}{\numberline {8}{\ignorespaces Giroscopio calibrado}}{4}{figure.8}}
\newlabel{fig:ejemplo}{{8}{4}{Giroscopio calibrado}{figure.8}{}}
\@writefile{lof}{\contentsline {figure}{\numberline {9}{\ignorespaces Comparaci\IeC {\'o}n de datos giroscopio (no calibrados y calibrados)}}{4}{figure.9}}
\newlabel{fig:ejemplo}{{9}{4}{Comparación de datos giroscopio (no calibrados y calibrados)}{figure.9}{}}
\@writefile{toc}{\contentsline {subsection}{\numberline {\unhbox \voidb@x \hbox {IV-B}}COMUNICACI\IeC {\'O}N SERIAL STM32-RASPBERRY}{4}{subsection.4.2}}
\@writefile{lof}{\contentsline {figure}{\numberline {10}{\ignorespaces Aceler\IeC {\'o}metro sin calibrar}}{5}{figure.10}}
\newlabel{fig:ejemplo}{{10}{5}{Acelerómetro sin calibrar}{figure.10}{}}
\@writefile{lof}{\contentsline {figure}{\numberline {11}{\ignorespaces Aceler\IeC {\'o}metro calibrado}}{5}{figure.11}}
\newlabel{fig:ejemplo}{{11}{5}{Acelerómetro calibrado}{figure.11}{}}
\@writefile{lof}{\contentsline {figure}{\numberline {12}{\ignorespaces Giroscopio sin calibrado}}{5}{figure.12}}
\newlabel{fig:ejemplo}{{12}{5}{Giroscopio sin calibrado}{figure.12}{}}
\@writefile{lof}{\contentsline {figure}{\numberline {13}{\ignorespaces Giroscopio calibrado}}{5}{figure.13}}
\newlabel{fig:ejemplo}{{13}{5}{Giroscopio calibrado}{figure.13}{}}
\@writefile{toc}{\contentsline {section}{\numberline {V}ANALISIS DE RESULTADOS}{5}{section.5}}
\@writefile{toc}{\contentsline {section}{\numberline {VI}CONCLUSIONES}{5}{section.6}}
