{
    "settings" : {
        "number_of_shards" : 1,
        "number_of_replicas" : 1
    },
    "mappings" : {
        "properties" : {
            "username" : { "type" : "keyword" },
            "password" : { "type" : "keyword" },
            "bancount" : { "type" : "integer" },
            "banned" : { "type" : "boolean" },
            "created" : { "type" : "date" }
        }
    }
}