1429613321873,80,0.0172191,0.0165245,0.0143095,78
1429613321884,80,0.0136913,0.0113664,0.0106161,69
1429613321926,80,0.00905724,0.00519256,0.00535915,45
1429613321938,80,0.00559814,0.000524053,0.00153327,42
1429613321979,80,0.00464054,-0.000361825,0.00145852,40
1429613322020,80,0.00527515,0.00120564,0.0032455,27
1429613322032,80,0.00711277,0.00533437,0.00782958,23
1429613322073,80,0.00829628,0.00919503,0.0116623,17
1429613322085,80,0.00801959,0.0110728,0.0133553,16
1429613322126,80,0.00661675,0.0100828,0.0121515,40
1429613322138,80,0.00401288,0.00678598,0.00865491,71
1429613322179,80,0.000651874,0.00273283,0.00422135,77
1429613322198,80,-0.00235486,0.000191211,0.00119,62
1429613322240,80,-0.00461715,-0.00127759,-0.0010833,42
1429613322266,80,-0.00533526,-0.00166604,-0.00175397,41
1429613322308,80,-0.00513456,-0.00245661,-0.0025106,37
1429613322330,80,-0.0043367,-0.00464456,-0.00408492,28
1429613322372,80,-0.00337672,-0.00616942,-0.0049112,19
1429613322398,80,-0.0026285,-0.00664473,-0.00458931,17
1429613322439,80,-0.00284248,-0.00639163,-0.00467795,16
1429613322466,80,-0.00524607,-0.00628913,-0.00539916,40
1429613322507,80,-0.00792364,-0.00752073,-0.00794175,84
1429613322529,80,-0.0100751,-0.00884487,-0.00950302,73
1429613322570,80,-0.011213,-0.0100109,-0.0105141,46
1429613322598,80,-0.0106715,-0.00981103,-0.00990949,40
1429613322640,80,-0.00992652,-0.00963391,-0.010129,39
1429613322666,80,-0.00946846,-0.0101074,-0.0112098,30
1429613322698,80,-0.00749724,-0.00887534,-0.0107609,21
1429613322732,80,-0.00378698,-0.00622784,-0.0089068,16
1429613322766,80,0.00102683,-0.0014074,-0.0043978,14
1429613322798,80,0.00620908,0.00483569,0.00224736,17
1429613322832,80,0.00909012,0.00894512,0.00677003,59
1429613322866,80,0.00943872,0.00968808,0.00809139,78
1429613322898,80,0.00749824,0.0073143,0.00622427,53
1429613322932,80,0.00582998,0.00517985,0.00495857,39
1429613322966,80,0.00488052,0.0038801,0.00376859,40
1429613322998,80,0.00500935,0.00465857,0.0042393,36
1429613323032,80,0.00524047,0.00662403,0.00532757,29
1429613323066,80,0.00412246,0.00733211,0.00544545,20
1429613323098,80,0.00186993,0.00578278,0.00373788,17
1429613323132,80,-0.000322833,0.0029949,0.00204579,21
1429613323166,80,-0.00235029,-0.000164546,0.00070112,69
1429613323200,79,-0.0026074,-0.00196615,0.00115314,74
1429613323232,79,-0.00179878,-0.00271489,0.00231481,51
1429613323265,79,-0.000585441,-0.00146159,0.00469158,37
1429613323299,79,-0.000243154,-0.00107241,0.00506149,39
1429613323332,79,-0.00144077,-0.00175293,0.00313733,35
1429613323366,79,-0.00274974,-0.00358108,-0.000317533,26
1429613323400,79,-0.00284768,-0.00509475,-0.00319339,18
1429613323433,79,-0.0016685,-0.00532401,-0.00445502,15
1429613323476,79,0.000482102,-0.0032191,-0.00256901,38
1429613323500,79,0.001955,-0.00152798,-0.00164819,76
1429613323532,78,0.00207506,-0.000391987,-0.00156841,76
1429613323565,78,0.00117923,0.000215707,-0.00228261,52
1429613323600,78,3.7293e-05,0.00136613,-0.00262659,40
1429613323632,78,-0.000967015,0.00313344,-0.00159561,41
1429613323667,78,-0.000852022,0.00552044,0.000822086,35
1429613323701,78,-0.000311957,0.00744862,0.00403686,26
1429613323732,78,0.000880482,0.00733934,0.00528112,19
1429613323767,78,0.00161219,0.00506825,0.00417429,16
1429613323800,78,0.0029117,0.00215274,0.00166153,39
1429613323833,78,0.00304302,-0.000960043,-0.00140562,79
1429613323867,76,0.00238566,-0.00271554,-0.00287897,69
1429613323901,76,0.00142759,-0.00222406,-0.00169424,45
1429613323933,76,-0.000253451,-0.00208957,-0.0012259,40
1429613323968,76,-0.00151711,-0.0025701,-0.00209196,40
1429613323998,76,-0.00188575,-0.00220855,-0.00181233,28
1429613324031,76,-0.00251943,-0.00300742,-0.00294052,20
1429613324066,76,-0.00254391,-0.00372362,-0.00438996,17
1429613324107,76,-0.00159919,-0.00313703,-0.00340395,25
1429613324149,76,-0.00129294,-0.00265754,-0.00223982,72
1429613324190,75,-0.00131094,-0.00166876,3.06801e-05,59
1429613324232,75,-0.00229827,-0.00162167,0.00100349,37
1429613324273,75,-0.00417324,-0.00312619,-6.41738e-05,39
1429613324319,75,-0.00510826,-0.00373241,-0.000342708,33
1429613324330,75,-0.00429509,-0.00262459,0.000879896,29
1429613324371,75,-0.00110398,0.000655895,0.00375676,21
1429613324413,75,0.00293791,0.00447849,0.00711528,19
1429613324455,75,0.00529468,0.00675474,0.0086323,68
1429613324496,75,0.00539833,0.00750438,0.00897758,73
1429613324538,75,0.00306713,0.00527228,0.00561437,45
1429613324579,75,-0.000315863,0.00279451,0.00175577,41
1429613324621,75,-0.00369486,-0.00155159,-0.00498321,39
1429613324662,75,-0.00483206,-0.00459627,-0.00982184,28
1429613324703,75,-0.00358512,-0.00592546,-0.011756,21
1429613324745,75,-0.000399841,-0.00355152,-0.00844491,27
1429613324786,75,0.00346564,0.000109598,-0.00280538,77
1429613324828,75,0.00655752,0.00427105,0.00396312,72
1429613324869,75,0.00746063,0.00616806,0.00782456,46
1429613324911,75,0.00575258,0.0052997,0.00720083,43
1429613324952,75,0.00291537,0.00300513,0.0040008,38
1429613324994,75,-0.000328882,0.00112454,0.000797993,27
1429613325036,75,-0.00216941,-0.000217059,-0.00230027,20
1429613325078,75,-0.0018928,-0.000805341,-0.00319087,20
1429613325119,75,2.94069e-05,-0.000928116,-0.00286034,66
1429613325161,75,0.00194304,-0.000951604,-0.00120599,78
1429613325203,75,0.00193245,-0.0022699,-0.00154213,48
1429613325245,75,0.00063093,-0.00345514,-0.00169686,42
1429613325286,75,-0.00194413,-0.00459258,-0.00236894,40
1429613325328,75,-0.00431726,-0.00437663,-0.00145967,30
1429613325369,75,-0.00507913,-0.00269803,0.000967336,22
1429613325411,75,-0.00459422,-0.00138915,0.00226094,20
1429613325452,75,-0.00317865,-0.000130782,0.00276883,43
1429613325494,75,-0.00165158,0.000614619,0.00213466,76
1429613325535,75,-0.000447472,0.00133935,0.00146141,50
1429613325576,75,0.000377327,0.0020618,0.00136411,39
1429613325617,75,0.000446456,0.00222538,0.000912545,40
1429613325659,75,-0.00039398,0.00170202,-0.00036351,32
1429613325671,75,-0.00093875,0.000319651,-0.00217453,29
1429613325712,75,-0.000365345,-0.000409856,-0.00313124,23
1429613325755,75,0.00108242,-0.000902007,-0.00331032,26
1429613325767,75,0.00257418,-0.000707261,-0.00281269,39
1429613325809,75,0.00332909,0.000160087,-0.00140144,80
1429613325820,75,0.00297176,0.000930448,-0.000373903,74
1429613325862,75,0.0019998,0.00177922,0.000579566,45
1429613325873,75,0.00198141,0.00306132,0.00219127,40
1429613325915,75,0.00182475,0.00406186,0.00384204,42
1429613325927,75,0.00214124,0.00384438,0.00493556,40
1429613325968,75,0.00223377,0.00150901,0.00406182,31
1429613326009,75,0.00249236,-0.0013191,0.00283008,22
1429613326050,75,0.00099735,-0.004392,0.000658273,18
1429613326092,75,-0.001471,-0.00590053,-0.00100551,41
1429613326104,75,-0.00508812,-0.00589245,-0.00299456,42
1429613326145,75,-0.00800915,-0.00521442,-0.00508784,0
1429613326157,75,-0.00841025,-0.00284563,-0.00501404,0
1429613326198,75,-0.00578691,-0.000162637,-0.00295544,0
1429613326210,75,-0.0014992,0.00211159,0.000419181,0
1429613326251,75,0.00265193,0.00240594,0.00143498,0
1429613326266,75,0.00571943,0.000741229,-5.10527e-05,0
1429613326308,75,0.00528063,-0.00294154,-0.0048837,0
1429613326330,75,0.00293255,-0.00471915,-0.00803925,0
1429613326371,75,0.000237589,-0.00357129,-0.00745818,0
1429613326398,75,-0.00111838,0.00130114,-0.00166515,0
1429613326439,75,-0.000414736,0.0081951,0.00749693,83
1429613326467,75,0.000807248,0.012329,0.0136575,59
1429613326498,75,0.00209381,0.0128131,0.0158303,42
1429613326530,75,0.00199123,0.00841588,0.0117722,37
1429613326566,75,0.00157927,0.0019877,0.00488425,38
1429613326598,75,7.8934e-05,-0.00442387,-0.00307229,33
1429613326629,75,-0.000859975,-0.00798402,-0.00829144,26
1429613326666,75,-0.00222851,-0.00704826,-0.00844616,22
1429613326698,75,-0.00193754,-0.00408096,-0.00567447,21
1429613326731,75,-0.000962078,-0.000827332,-0.00167441,28
1429613326766,75,-0.000562339,-0.000653096,-0.000323794,59
1429613326798,75,-6.37678e-06,-0.00261477,-0.00110378,62
1429613326832,75,-0.000245475,-0.00452966,-0.00257865,43
1429613326865,75,-0.001558,-0.00487544,-0.00356658,38
1429613326898,75,-0.0031813,-0.00250808,-0.00220358,39
1429613326932,75,-0.00315731,-0.00026495,-0.000804719,35
1429613326975,75,-0.000841945,0.000819,0.000556309,27
1429613326997,75,0.00224401,0.00111381,0.00142219,24
1429613327039,75,0.00441771,0.00154846,0.0030221,26
1429613327066,75,0.00497338,0.0029478,0.00530781,51
1429613327098,75,0.00425463,0.00382626,0.00633745,72
1429613327133,75,0.00246396,0.00325461,0.00469443,56
1429613327165,75,-0.000514402,0.00210427,0.00133918,42
1429613327199,75,-0.00248383,0.000483803,-0.00260817,40
1429613327232,75,-0.00371323,-0.000363691,-0.00515201,40
1429613327265,75,-0.00306063,-0.000317242,-0.00523629,32
1429613327299,75,-0.00125229,7.37111e-05,-0.00386936,25
1429613327333,75,0.0005684,0.000228414,-0.00210141,23
1429613327365,75,0.00198529,0.000143776,-0.000908345,26
1429613327400,75,0.000944045,-0.000970916,-0.00208808,67
1429613327433,75,-0.000924434,-0.000810483,-0.00233958,71
1429613327466,75,-0.00239589,-0.00158634,-0.00287366,53
1429613327500,75,-0.00192431,-0.00127091,-0.000612765,41
1429613327532,75,0.00036453,0.000373906,0.00413126,40
1429613327565,75,0.00316777,0.00139773,0.00828489,37
1429613327600,75,0.00500222,0.00145639,0.00955763,29
1429613327633,75,0.00399609,-0.000280912,0.00649948,24
1429613327666,75,0.00146239,-0.00179651,0.00183043,22
1429613327702,75,-0.00203737,-0.0030903,-0.00293445,40
1429613327733,75,-0.00548626,-0.00310894,-0.005906,66
1429613327765,76,-0.00695377,-0.00344491,-0.00793729,61
1429613327800,76,-0.00611311,-0.00280408,-0.00716774,42
1429613327832,76,-0.00390503,-0.00124976,-0.00363461,39
1429613327865,76,-9.13282e-05,0.000520066,4.71259e-05,40
1429613327900,76,0.00269207,0.00181322,0.0024388,34
1429613327930,76,0.00497074,0.00288516,0.00341861,26
1429613327965,76,0.00418545,0.00251647,0.0018307,22
1429613328000,76,0.00234956,0.00211358,0.000782798,24
1429613328030,76,-0.000922002,0.00156811,-0.000300749,59
1429613328066,76,-0.00238129,0.0019756,0.000301358,71
1429613328100,76,-0.00179344,0.00347158,0.00227913,53
1429613328130,76,0.000928518,0.00400059,0.0034758,41
1429613328165,76,0.00427255,0.00345608,0.00351776,43
1429613328198,76,0.00543899,0.00246977,0.00347408,39
1429613328240,76,0.00458165,0.00158279,0.00270345,30
1429613328281,76,0.00240298,0.00131987,0.00275699,26
1429613328323,76,-0.000429546,-0.00064202,0.000230831,32
1429613328364,76,-0.00262245,-0.00463602,-0.00416609,70
1429613328406,75,-0.00451493,-0.00972478,-0.0091298,62
1429613328447,75,-0.00504357,-0.0121552,-0.0114825,42
1429613328489,75,-0.00475491,-0.010922,-0.00994943,42
1429613328531,75,-0.00314836,-0.00511168,-0.00417766,39
1429613328572,75,-0.00104521,0.00131214,0.00221059,31
1429613328614,75,-0.000261132,0.00543253,0.00600467,26
1429613328655,75,0.000384001,0.00682899,0.00747978,23
1429613328697,75,0.000930528,0.00512575,0.00588075,50
1429613328739,75,0.0012572,0.00289602,0.00401143,65
1429613328780,75,0.00107206,-0.000906399,-0.000625275,43
1429613328821,75,0.00140138,-0.00227934,-0.00291404,35
1429613328863,75,0.00255756,-0.000826783,-0.00283269,34
1429613328905,75,0.00302056,0.00331862,0.000602374,24
1429613328947,75,0.00349386,0.00821315,0.00544393,17
1429613328988,75,0.00396074,0.0115778,0.00991346,18
1429613329030,75,0.00415305,0.011924,0.0112887,46
1429613329075,75,0.00405733,0.00938322,0.00937539,61
1429613329086,75,0.00260843,0.00406896,0.00434898,53
1429613329128,75,1.18543e-05,-0.00152626,-0.00119401,38
1429613329169,75,-0.00345461,-0.00659473,-0.00612262,42
1429613329211,75,-0.00706324,-0.00974074,-0.00868564,36
1429613329252,75,-0.008511,-0.01032,-0.00846519,26
1429613329293,75,-0.00830019,-0.0103911,-0.00856924,25
1429613329334,75,-0.00641699,-0.010794,-0.00942815,63
1429613329379,75,-0.00427102,-0.0111701,-0.0113459,71
1429613329423,75,-0.00226475,-0.0103481,-0.0119564,47
1429613329468,75,-0.000249659,-0.00701751,-0.00916904,41
1429613329512,75,0.000773058,-0.00178058,-0.00356461,39
1429613329555,75,0.00232003,0.00473594,0.00450126,30
1429613329597,75,0.00401439,0.00910321,0.0112988,23
1429613329639,75,0.00526623,0.0104947,0.0140915,42
1429613329680,75,0.00558897,0.00889175,0.0122651,71
1429613329722,75,0.00471934,0.00569805,0.0062416,52
1429613329764,75,0.00326463,0.00420351,0.00122404,38
1429613329805,75,0.00188245,0.00497588,-0.000940631,37
1429613329847,75,0.00122962,0.00698168,0.000339943,30
1429613329888,75,0.000718815,0.00756755,0.00255263,23
1429613329930,75,-0.000592031,0.00468129,0.00217917,27
1429613329971,75,-0.000974635,0.000257686,0.00170252,68
1429613330013,75,-0.00142858,-0.00534251,-0.0010113,60
1429613330055,75,-0.00106795,-0.0083347,-0.0027133,38
1429613330096,75,-3.20951e-05,-0.00879401,-0.00329206,36
1429613330108,75,0.000209665,-0.00749006,-0.00323594,36
1429613330150,75,-0.000834457,-0.00603177,-0.00329079,29
1429613330192,75,-0.00332976,-0.00511898,-0.00341409,21
1429613330203,75,-0.00378629,-0.00305784,-0.00151312,18
1429613330245,75,-0.00341275,-0.000477418,0.00108193,33
1429613330256,75,7.72879e-05,0.00379037,0.00553257,50
1429613330298,75,0.00448995,0.00762703,0.00852053,67
1429613330309,75,0.00718605,0.00887745,0.0078978,60
1429613330351,75,0.00640897,0.0064405,0.00270767,37
1429613330392,75,0.00255392,0.00212203,-0.00453832,36
1429613330433,75,-0.00283145,-0.00151746,-0.00908354,34
1429613330445,75,-0.00642878,-0.00245161,-0.00947588,30
1429613330487,75,-0.00655407,-0.00120303,-0.00552908,23
1429613330498,75,-0.0033382,0.000600189,-0.000110559,21
1429613330540,75,0.00087999,-0.000203473,0.000475592,35
1429613330581,75,0.00425142,-0.0034102,-0.00248806,70
1429613330592,75,0.0053584,-0.00568034,-0.00484078,68
1429613330634,75,0.00256812,-0.0068348,-0.0065065,43
1429613330646,75,-0.00218912,-0.00665042,-0.00608706,37
1429613330687,75,-0.00801194,-0.0045691,-0.00317412,39
1429613330698,75,-0.0113869,-0.00113633,0.00220139,38
1429613330740,75,-0.00913815,0.0052134,0.0121164,31
1429613330765,75,-0.00197724,0.0146406,0.0258481,26
1429613330808,75,0.00538434,0.0182044,0.030978,25
1429613330830,75,0.0106441,0.0175895,0.0279941,49
1429613330865,75,0.00850152,0.0129195,0.0175533,74
1429613330898,75,0.000914564,0.000236,-0.00273112,59
1429613330941,75,-0.0127383,-0.0191965,-0.0289186,40
1429613330965,75,-0.0207744,-0.033154,-0.0457043,40
1429613331007,75,-0.0122762,-0.0292077,-0.0426078,37
1429613331029,75,0.0139917,-0.000940524,-0.0208852,31
1429613331071,75,0.0544602,0.0389334,0.0122019,24
1429613331099,75,0.089635,0.0826326,0.0522792,22
1429613331133,75,0.0975132,0.0871321,0.0583124,50
1429613331166,75,0.0712133,0.0340968,0.0239092,74
1429613331198,75,0.061837,0.00762324,0.00673114,58
1429613331230,75,0.0709972,-0.0122889,-0.00908769,41
1429613331265,75,0.0941883,-0.00130284,-0.0188598,40
1429613331298,75,0.0597202,0.00451231,-0.0397945,38
1429613331333,75,-0.00587075,0.00511223,-0.0613013,31
1429613331365,75,-0.0930628,-0.0248988,-0.10065,24
1429613331397,75,-0.158756,-0.0443454,-0.0985111,21
1429613331432,75,-0.217441,-0.104008,-0.140159,39
1429613331466,75,-0.241297,-0.166913,-0.174887,71
1429613331497,76,-0.229865,-0.219653,-0.227776,61
1429613331533,76,-0.12959,-0.194311,-0.158813,44
1429613331565,76,-0.00509742,-0.120743,-0.0353027,39
1429613331599,76,0.0894239,-0.0182786,0.0979503,40
1429613331632,76,0.115036,0.0777925,0.201297,35
1429613331665,76,0.0635984,0.148459,0.266261,27
1429613331699,76,-0.00402053,0.188261,0.331413,25
1429613331733,76,-0.0511402,0.163406,0.27167,29
1429613331765,76,-0.0408757,0.0916607,0.122538,61
1429613331799,76,0.0175487,-0.0074352,-0.0865339,67
1429613331832,76,0.117174,-0.0313459,-0.153289,43
1429613331865,76,0.214085,-0.010273,-0.12979,33
1429613331900,76,0.233564,0.0621128,-0.0181052,35
1429613331933,76,0.233677,0.184848,0.213454,33
1429613331965,76,0.177348,0.224288,0.285723,27
1429613332000,76,0.0798467,0.173339,0.202235,24
1429613332032,76,-0.0393451,0.0670282,0.0380106,29
1429613332067,76,-0.140316,-0.0632506,-0.184995,65
1429613332100,76,-0.197416,-0.142472,-0.31014,71
1429613332134,76,-0.194629,-0.190913,-0.352295,47
1429613332165,76,-0.13749,-0.18601,-0.277897,40
1429613332200,76,-0.0872547,-0.142993,-0.117376,41
1429613332229,76,-0.0238804,-0.0775098,0.0620688,35
1429613332268,76,-0.0252969,-0.0308942,0.156402,25
1429613332300,76,-0.0569869,-0.0198177,0.131718,20
1429613332333,76,-0.0719647,-0.0134846,0.0869253,21
1429613332365,76,-0.0213647,0.0445846,0.13334,55
1429613332400,77,0.0829478,0.0800663,0.177304,67
1429613332429,77,0.146752,0.0880696,0.202205,51
1429613332471,77,0.133633,0.0360918,0.101394,40
1429613332513,77,0.0382358,-0.00903135,-0.0309757,40
1429613332556,77,-0.0826711,-0.071321,-0.199054,31
1429613332599,77,-0.13856,-0.0776609,-0.255017,24
1429613332642,77,-0.109876,-0.0229169,-0.163734,24
1429613332684,77,0.0164809,0.0695805,0.0149008,62
1429613332725,77,0.171767,0.143683,0.172277,59
1429613332767,77,0.256583,0.162294,0.239505,40
1429613332808,77,0.200262,0.116606,0.167201,41
1429613332850,77,0.0490393,0.0163238,-0.0326757,37
1429613332892,77,-0.147412,-0.0923125,-0.257739,27
1429613332933,77,-0.259519,-0.146067,-0.379252,22
1429613332975,77,-0.238279,-0.118089,-0.295546,52
1429613333016,78,-0.107067,-0.0276337,-0.056013,69
1429613333059,78,0.0469874,0.0435011,0.176015,46
1429613333101,78,0.138619,0.0553117,0.278368,40
1429613333143,78,0.10677,-0.00730616,0.195355,38
1429613333184,78,-0.0147591,-0.110953,-0.0139051,28
1429613333231,78,-0.0862266,-0.114498,-0.0457875,22
1429613333243,78,-0.120754,-0.0703704,-0.000680662,20
1429613333284,78,-0.142466,-0.0738086,-0.0571155,40
1429613333326,78,-0.0684765,-0.108869,-0.172379,73
1429613333368,78,0.0105399,-0.169675,-0.339696,54
1429613333409,78,0.0782027,-0.168561,-0.393402,40
1429613333451,78,0.159311,-0.0381671,-0.213217,40
1429613333493,78,0.201474,0.157938,0.10131,31
1429613333534,78,0.240526,0.384779,0.512911,23
1429613333576,78,0.25583,0.461776,0.659466,20
1429613333617,78,0.202809,0.381483,0.54907,33
1429613333659,78,0.119907,0.152601,0.137748,71
1429613333700,78,0.087368,-0.0438003,-0.227644,55
1429613333741,78,0.075772,-0.139546,-0.397317,40
1429613333783,78,0.0586171,-0.0919011,-0.252447,40
1429613333825,78,-0.043621,0.0272091,0.101431,32
1429613333866,78,-0.234869,0.0427619,0.305158,24
1429613333908,78,-0.37571,-0.0411175,0.294672,20
1429613333949,78,-0.420667,-0.220156,0.00110659,19
1429613333991,78,-0.316809,-0.334398,-0.280223,48
1429613334032,78,-0.186493,-0.341327,-0.419486,67
1429613334074,78,-0.0846376,-0.229779,-0.359731,42
1429613334115,78,0.027738,-0.019318,-0.0761429,39
1429613334157,78,0.00574149,0.152855,0.160072,39
1429613334199,78,0.0378736,0.27327,0.335527,28
1429613334240,78,0.120032,0.271567,0.33651,20
1429613334282,78,0.203144,0.215473,0.245714,19
1429613334323,78,0.178295,0.0535096,-0.0381259,46
1429613334365,78,0.0597769,-0.120076,-0.331078,75
1429613334407,78,-0.0405325,-0.168754,-0.419569,53
1429613334449,78,-0.0884809,-0.161767,-0.411429,41
1429613334491,78,-0.0159213,-0.0534181,-0.219683,40
1429613334532,78,0.0375117,0.0132444,-0.0880924,32
1429613334573,78,0.0948624,0.0484662,0.0192215,23
1429613334615,78,0.0961515,0.0286881,0.0617538,21
1429613334657,78,0.113416,-0.0227965,0.0933792,33
1429613334668,78,0.121702,-0.0439682,0.158233,49
1429613334712,78,0.160883,-0.0123184,0.271568,71
1429613334726,78,0.209142,0.0556873,0.370596,63
1429613334737,78,0.177319,0.149645,0.448252,50
1429613334779,78,0.142707,0.216431,0.462638,40
1429613334793,78,0.0307045,0.181775,0.314748,41
1429613334835,78,-0.0853615,0.0537071,0.0489612,38
1429613334848,78,-0.229252,-0.0972547,-0.257907,33
1429613334889,78,-0.306968,-0.199343,-0.445822,23
1429613334901,78,-0.283787,-0.210777,-0.500399,21
1429613334942,78,-0.205035,-0.105123,-0.337986,20
1429613334965,78,-0.090517,0.0505524,-0.0731408,21
1429613335007,78,-0.0216856,0.151128,0.117489,62
1429613335031,78,0.0387433,0.141,0.121689,73
1429613335065,78,0.0651466,0.0858738,0.0546137,54
1429613335097,78,0.16276,0.0187616,-0.0126964,40
1429613335133,78,0.21617,-0.0206989,-0.0681306,41
1429613335165,78,0.160711,-0.0146762,-0.0345501,38
1429613335197,78,-0.0237443,0.00840704,-0.00426163,29
1429613335231,78,-0.25126,0.0430065,0.0248186,23
1429613335265,78,-0.379779,0.102605,0.146944,22
1429613335307,78,-0.351348,0.0842449,0.187159,26
1429613335333,78,-0.155686,0.0398981,0.205148,52
1429613335375,78,0.0218176,-0.150649,-0.0748376,66
1429613335398,78,0.114896,-0.350368,-0.429353,48
1429613335439,78,0.0782756,-0.495217,-0.739858,35
1429613335465,78,-0.109424,-0.487172,-0.793611,40
1429613335507,78,-0.202644,-0.319412,-0.49672,37
1429613335533,78,-0.165115,-0.0588012,0.0221428,31
1429613335575,78,-0.0259804,0.146473,0.407181,24
1429613335599,78,0.121883,0.259708,0.559722,23
1429613335632,78,0.181548,0.251394,0.461924,48
1429613335665,78,0.235085,0.210182,0.330185,75
1429613335700,78,0.225595,0.17164,0.224109,60
1429613335734,78,0.21575,0.162152,0.181141,42
1429613335765,78,0.198461,0.155507,0.152932,44
1429613335797,78,0.20315,0.14587,0.143699,41
1429613335832,78,0.158753,0.104831,0.0901495,33
1429613335865,78,0.119199,0.108088,0.131274,26
1429613335900,78,0.0842326,0.0880817,0.115421,24
1429613335933,78,0.0701893,0.117106,0.168373,42
1429613335965,78,0.100068,0.138585,0.227446,78
1429613336000,79,0.122934,0.145307,0.21711,68
1429613336031,79,0.0254626,0.0583536,0.00399405,49
1429613336067,79,-0.164737,-0.0671718,-0.284514,44
1429613336100,79,-0.327823,-0.148922,-0.441296,43
1429613336133,79,-0.409744,-0.195839,-0.465931,35
1429613336167,79,-0.30151,-0.144926,-0.252893,27
1429613336200,79,-0.109492,-0.06006,0.0282773,24
1429613336230,79,0.058955,0.042183,0.256155,40
1429613336268,79,0.190964,0.0753574,0.288734,73
1429613336300,79,0.1416,-0.023209,0.00391253,66
1429613336333,79,0.0358652,-0.145045,-0.297039,47
1429613336365,79,-0.148488,-0.274389,-0.558522,42
1429613336401,79,-0.233325,-0.340899,-0.598865,40
1429613336430,79,-0.246986,-0.358012,-0.504608,33
1429613336465,79,-0.14787,-0.285613,-0.22703,26
1429613336500,79,0.00248757,-0.134942,0.14089,23
1429613336535,79,0.0349959,0.0188648,0.40997,23
1429613336568,79,-0.0297803,0.104698,0.434603,48
1429613336600,79,-0.119498,0.115274,0.275468,71
1429613336630,79,-0.157842,0.0840835,0.0714387,53
1429613336665,79,-0.0792151,0.080458,-0.0298269,41
1429613336707,79,0.135111,0.163507,0.103964,41
1429613336748,79,0.302457,0.276625,0.29998,34
1429613336789,79,0.473558,0.386292,0.492677,25
1429613336831,79,0.543086,0.416422,0.539585,23
1429613336872,79,0.460793,0.351462,0.43039,23
1429613336914,79,0.201119,0.183781,0.113722,44
1429613336956,79,-0.121638,-0.0236718,-0.262437,71
1429613336997,79,-0.307034,-0.190377,-0.532246,49
1429613337039,79,-0.308005,-0.240695,-0.552164,40
1429613337081,79,-0.151449,-0.201773,-0.399923,40
1429613337122,79,-0.031505,-0.151461,-0.240889,33
1429613337163,79,-0.00559073,-0.0889669,-0.10408,25
1429613337205,79,-0.0580133,-0.0810072,-0.0766051,23
1429613337246,79,-0.0762937,-0.0530081,-0.00430724,23
1429613337287,79,-0.0842028,-0.0271938,0.0473367,44
1429613337329,79,-0.0130055,0.0231395,0.127273,69
1429613337370,79,0.051599,0.0718302,0.187308,47
1429613337412,79,0.0762259,0.107666,0.214808,40
1429613337454,79,0.0749203,0.138834,0.252193,40
1429613337495,79,0.0292222,0.116321,0.208238,30
1429613337537,79,-0.0812572,0.0256529,0.0679318,23
1429613337578,79,-0.154538,-0.101579,-0.106133,22
1429613337619,79,-0.210348,-0.242134,-0.26304,26
1429613337661,79,-0.224759,-0.313991,-0.330034,65
1429613337702,79,-0.123892,-0.278893,-0.221676,60
1429613337743,79,-0.0474555,-0.210304,-0.121639,39
1429613337785,79,0.0363686,-0.125474,-0.028638,41
1429613337827,79,0.0528624,-0.0622851,-0.0215477,36
1429613337868,79,0.0689128,-0.0244295,-0.0350029,27
1429613337910,79,0.133538,0.0314045,0.0273355,23
1429613337951,79,0.21166,0.0950776,0.131302,24
1429613337993,79,0.255021,0.181708,0.246171,59
1429613338035,79,0.19144,0.233391,0.249227,65
1429613338077,79,0.0436395,0.248682,0.159491,41
1429613338119,79,-0.066213,0.240289,0.0618733,41
1429613338161,79,-0.129316,0.227801,0.00158356,39
1429613338202,79,-0.124502,0.185801,-0.0141863,30
1429613338244,79,-0.0562931,0.14541,0.00232787,25
1429613338285,79,0.0226612,0.124296,0.0647241,29
1429613338327,79,0.0956098,0.0943234,0.0978642,67
1429613338369,79,0.20005,0.0938342,0.147974,60
1429613338410,79,0.250303,0.07441,0.154708,40
1429613338452,79,0.251156,-0.0171854,0.0267877,43
1429613338494,79,0.202997,-0.12752,-0.137143,38
1429613338535,79,0.0655941,-0.269166,-0.342772,29
1429613338577,79,-0.0774179,-0.324693,-0.380751,26
1429613338589,79,-0.269293,-0.318932,-0.299817,26
1429613338630,79,-0.45419,-0.262191,-0.113862,57
1429613338672,79,-0.582087,-0.217453,0.0178059,65
1429613338683,79,-0.626103,-0.190235,0.0664076,57
1429613338725,79,-0.477071,-0.122509,0.0923844,40
1429613338767,79,-0.221759,-0.026986,0.0864621,42
1429613338779,79,0.104693,0.0786047,0.0945702,40
1429613338820,79,0.313659,0.130315,0.0640987,31
1429613338862,79,0.332548,0.110176,-0.0224234,26
1429613338903,79,0.290522,0.0902757,-0.0616817,27
1429613338944,79,0.243362,0.0829911,-0.0537189,62
1429613338985,79,0.234034,0.0907592,-0.00432811,60
1429613338997,79,0.282161,0.117515,0.0646719,52
1429613339038,79,0.305515,0.131474,0.106136,40
1429613339050,79,0.226143,0.0837137,0.050549,40
1429613339091,79,0.0484054,0.012516,-0.0628226,40
1429613339102,79,-0.152522,-0.0246379,-0.124225,37
1429613339144,79,-0.199975,-0.0137784,-0.0925761,28
1429613339155,79,-0.114071,0.0472826,0.0345035,26
1429613339197,79,0.0887146,0.117056,0.192886,25
1429613339208,79,0.215792,0.131733,0.251117,29
1429613339250,79,0.134109,0.0499753,0.152081,65
1429613339265,79,-0.0461473,-0.0427613,0.0146391,68
1429613339307,79,-0.231189,-0.141839,-0.176919,46
1429613339333,79,-0.21939,-0.138816,-0.233722,40
1429613339383,79,-0.14979,-0.0636661,-0.191912,41
1429613339398,79,-0.0130203,0.052869,-0.0357312,38
1429613339439,79,0.0720243,0.124838,0.125707,29
1429613339465,79,0.0132046,0.100485,0.213315,26
1429613339508,79,-0.0996174,-0.0234181,0.1441,25
1429613339533,79,-0.184131,-0.177337,-0.0030712,41
1429613339575,79,-0.202375,-0.286583,-0.152869,69
1429613339597,79,-0.144529,-0.295628,-0.209229,57
1429613339633,79,-0.0906007,-0.2115,-0.156788,40
1429613339665,79,-0.0190362,-0.0529783,0.0111413,41
1429613339697,79,0.0180677,0.114848,0.197159,40
1429613339733,79,0.0337296,0.217538,0.263383,32
1429613339765,79,-0.0333758,0.207927,0.152029,26
1429613339797,79,-0.00913305,0.1481,0.00631103,25
1429613339833,79,0.0947222,0.0661059,-0.125834,35
1429613339865,79,0.263444,0.012096,-0.165668,67
1429613339899,78,0.290742,-0.0174263,-0.163675,61
1429613339933,78,0.266548,0.00196843,-0.0977609,43
1429613339965,78,0.128977,0.0315945,-0.0429588,41
1429613339999,78,0.0205867,0.0665814,0.00856252,41
1429613340033,78,-0.0303044,0.0877448,0.0386272,34
1429613340065,78,-0.0672126,0.0798235,0.0430452,28
1429613340099,78,-0.0211024,0.0668073,0.0697583,26
1429613340133,78,0.0426176,0.0582879,0.127027,27
1429613340165,78,0.0866499,0.0433808,0.163064,55
1429613340199,78,0.0647084,0.0245892,0.181837,65
1429613340235,78,-0.0778404,-0.0391602,0.0685847,46
1429613340267,78,-0.198841,-0.0925877,-0.0551978,40
1429613340299,78,-0.225532,-0.146175,-0.215407,42
1429613340334,78,-0.140529,-0.137169,-0.285153,37
1429613340367,78,0.0188402,-0.0881107,-0.241013,30
1429613340400,78,0.117919,-0.0237866,-0.121694,27
1429613340433,78,0.147718,0.0259609,0.056726,28
1429613340466,78,0.0772411,0.0488083,0.219585,55
1429613340500,78,-0.00436035,0.0361829,0.296156,68
1429613340533,78,-0.103737,-0.0194727,0.241283,52
1429613340567,78,-0.180125,-0.0873798,0.111763,40
1429613340597,78,-0.2677,-0.145931,-0.0559071,42
1429613340633,78,-0.25689,-0.148998,-0.151378,39
1429613340667,78,-0.190558,-0.113421,-0.186666,31
1429613340697,78,-0.0836982,-0.0658995,-0.182509,26
1429613340733,78,0.0331499,-0.00800731,-0.13315,26
1429613340767,78,0.109,0.0365385,-0.0772771,50
1429613340797,78,0.121675,0.0624299,-0.0414583,71
1429613340834,78,0.100844,0.0810307,0.0105855,56
1429613340865,78,0.107896,0.0892726,0.0447736,42
1429613340906,78,0.165161,0.10615,0.0891283,42
1429613340948,78,0.235092,0.132073,0.13324,34
1429613340991,78,0.278417,0.130044,0.130721,27
1429613341033,78,0.271015,0.126146,0.126117,26
1429613341075,78,0.161605,0.085195,0.078722,43
1429613341116,78,0.0616116,0.0372739,0.00928403,72
1429613341158,78,-0.0587799,-0.0177526,-0.087694,54
1429613341200,78,-0.158656,-0.0401108,-0.12029,43
1429613341241,78,-0.187852,-0.0305796,-0.0835324,41
1429613341283,78,-0.217777,-0.0325794,-0.0560654,32
1429613341324,78,-0.18168,-0.0177427,-0.00895684,26
1429613341366,78,-0.0958241,-0.00589919,0.0219291,25
1429613341408,78,0.000289549,0.00663611,0.0478582,24
1429613341450,78,0.0702835,0.0131888,0.0827279,50
1429613341491,78,0.111819,0.0107946,0.094996,72
1429613341502,78,0.0892553,-0.00479805,0.0706095,67
1429613341544,78,0.0505954,-0.0357872,0.031169,48
1429613341586,78,-0.0508057,-0.089021,-0.0366903,43
1429613341627,78,-0.147922,-0.139148,-0.0922318,38
1429613341669,78,-0.230447,-0.179273,-0.134607,28
1429613341710,78,-0.275822,-0.198971,-0.181844,25
1429613341752,78,-0.265439,-0.179715,-0.182931,24
1429613341794,78,-0.118731,-0.0662258,-0.0231894,23
1429613341835,78,0.0515812,0.0480637,0.106825,21
1429613341877,78,0.217337,0.103948,0.126489,59
1429613341919,78,0.285622,0.0904388,0.0411349,72
1429613341961,78,0.298419,0.0460993,-0.0721768,52
1429613342002,78,0.22742,0.0206775,-0.137784,44
1429613342044,78,0.150936,0.0324103,-0.114857,40
1429613342086,78,0.0504168,0.0846325,-0.0121123,30
1429613342097,78,-0.0310929,0.122342,0.0601273,27
1429613342139,78,-0.0782142,0.132827,0.119966,24
1429613342180,78,-0.0430961,0.134643,0.183017,23
1429613342222,78,0.0361737,0.118914,0.191159,21
1429613342263,78,0.13367,0.109736,0.170005,19
1429613342304,78,0.152141,0.0986382,0.112623,59
1429613342346,78,0.0689238,0.087924,0.0664526,72
1429613342387,78,-0.0754562,0.0597682,0.0308027,51
1429613342429,78,-0.233877,-0.0383619,-0.0722682,43
1429613342470,78,-0.297661,-0.137479,-0.129981,40
1429613342512,78,-0.29587,-0.228702,-0.163589,29
1429613342558,78,-0.211931,-0.248566,-0.111333,23
1429613342569,78,-0.105758,-0.206075,-0.0158545,22
1429613342611,78,-0.0555332,-0.148729,0.0279148,21
1429613342652,78,-0.0681195,-0.11625,-0.0283321,18
1429613342693,78,-0.144558,-0.117451,-0.175301,19
1429613342735,78,-0.112621,-0.0925161,-0.229468,69
1429613342776,78,-0.00990609,0.000268015,-0.110177,68
1429613342818,78,0.181861,0.124169,0.0948278,50
1429613342859,78,0.34593,0.195303,0.197608,43
1429613342900,78,0.443932,0.218787,0.200888,40
1429613342942,78,0.392885,0.18184,0.121391,28
1429613342983,78,0.206068,0.109494,-0.0269763,22
1429613343025,78,-0.00512578,0.0601212,-0.0964321,20
1429613343066,78,-0.200339,0.0177064,-0.139925,19
1429613343108,78,-0.24288,0.0191575,-0.0770313,16
1429613343149,78,-0.133158,0.0507647,0.0575483,47
1429613343161,78,0.0745662,0.121022,0.276856,74
1429613343203,78,0.218189,0.142801,0.387116,69
1429613343244,78,0.204359,0.0905066,0.334739,46
1429613343286,78,0.0506764,-0.0339142,0.127244,43
1429613343328,78,-0.177086,-0.188185,-0.169376,38
1429613343340,78,-0.325016,-0.286563,-0.362602,34
1429613343381,78,-0.324295,-0.27989,-0.352172,22
1429613343393,78,-0.202683,-0.191535,-0.184432,20
1429613343434,78,-0.0607714,-0.0646978,0.0722257,18
1429613343476,78,0.0321234,0.0105641,0.177194,17
1429613343487,78,0.0900057,0.044157,0.151341,16
1429613343529,78,0.104517,0.0265017,-0.0116757,25
1429613343540,78,0.0197658,-0.0270251,-0.243808,44
1429613343582,78,-0.0416853,-0.047558,-0.369233,81
1429613343595,76,-0.053311,-0.0319345,-0.350549,76
1429613343639,76,-0.0135855,0.0156269,-0.224321,47
1429613343650,76,0.0983313,0.0848716,-0.0265057,43
1429613343692,76,0.187792,0.141369,0.152261,43
1429613343703,76,0.249297,0.170644,0.273019,41
1429613343745,76,0.237985,0.169554,0.320582,28
1429613343765,76,0.199244,0.151211,0.310592,22
1429613343807,76,0.0955849,0.103705,0.228295,16
1429613343833,76,-0.00744589,0.0655358,0.14581,15
1429613343875,76,-0.0900137,0.0475234,0.0797487,14
1429613343897,76,-0.101444,0.0642197,0.114429,27
1429613343938,76,-0.105995,0.0230426,0.0384019,82
1429613343965,74,-0.115058,-0.0647684,-0.0941265,77
1429613344006,74,-0.15489,-0.199342,-0.29172,50
1429613344033,74,-0.220104,-0.300677,-0.417103,42
1429613344065,74,-0.255602,-0.313247,-0.353426,43
1429613344097,74,-0.265619,-0.252709,-0.202545,37
1429613344133,74,-0.183839,-0.133702,0.0318176,26
1429613344165,74,-0.0873413,-0.0330971,0.152246,18
1429613344197,74,0.0388344,0.0403758,0.175166,16
1429613344233,74,0.158189,0.0866778,0.164334,16
1429613344266,74,0.227769,0.131059,0.196285,38
1429613344297,74,0.208358,0.137818,0.168053,82
1429613344333,73,0.120505,0.114123,0.091356,73
1429613344365,73,0.00285167,0.0667337,-0.0381901,49
1429613344397,73,-0.0739091,0.0320876,-0.123175,42
1429613344433,73,-0.0635307,0.0401377,-0.125488,43
1429613344467,73,0.0127508,0.0728344,-0.0746119,34
1429613344500,73,0.095948,0.121333,0.04556,23
1429613344533,73,0.174519,0.145683,0.142599,17
1429613344567,73,0.178928,0.12223,0.148656,16
1429613344597,73,0.159673,0.0704843,0.110635,21
1429613344633,73,0.104322,0.0082084,0.0209516,67
1429613344675,72,0.0668098,-0.0367206,-0.0599309,77
1429613344697,72,0.0471661,-0.048955,-0.105649,58
1429613344732,72,0.0145376,-0.0383812,-0.0989122,42
1429613344767,72,-0.0435644,-0.0399675,-0.0832635,44
1429613344797,72,-0.104949,-0.068373,-0.0667582,40
1429613344836,72,-0.14362,-0.106869,-0.0181485,27
1429613344867,72,-0.193232,-0.155464,-0.00651764,20
1429613344897,72,-0.181322,-0.171489,0.01033,18
1429613344935,72,-0.142357,-0.167835,-0.0194107,27
1429613344968,72,-0.0722724,-0.126506,-0.040261,72
1429613344997,72,0.0195829,-0.0826979,-0.0930698,77
1429613345035,72,0.125431,-0.00383657,-0.051692,54
1429613345067,72,0.150629,0.0492606,-0.0413677,43
1429613345097,72,0.0728967,0.0824692,-0.0422708,43
1429613345142,72,-0.0583934,0.0968117,-0.026351,34
1429613345165,72,-0.15455,0.0963607,-0.00581145,26
1429613345197,72,-0.190015,0.0674786,-0.0379172,20
1429613345239,72,-0.150408,0.0395425,-0.0787504,22
1429613345280,72,-0.0463069,0.0310433,-0.0673114,69
1429613345322,71,0.0497126,0.052993,0.0186485,74
1429613345363,71,0.0708936,0.0630337,0.0794725,47
1429613345405,71,0.0459951,0.067644,0.0868977,41
1429613345447,71,0.0439917,0.0601825,0.0651074,40
1429613345488,71,0.125803,0.0777729,0.108223,29
1429613345530,71,0.263287,0.123814,0.246639,21
1429613345571,71,0.350817,0.148468,0.35239,22
1429613345613,71,0.350471,0.14456,0.42488,69
1429613345654,71,0.211322,0.0975576,0.411253,67
1429613345696,71,0.0220041,-0.000300148,0.249475,48
1429613345741,71,-0.137333,-0.131158,-0.0155748,40
1429613345752,71,-0.26231,-0.258083,-0.317131,40
1429613345793,71,-0.278058,-0.321485,-0.511868,40
1429613345837,71,-0.245778,-0.305234,-0.557945,41
1429613345849,71,-0.176353,-0.202897,-0.417203,42
1429613345890,71,-0.073506,-0.0668279,-0.159757,41
1429613345932,71,-0.057592,0.0158887,-0.023819,38
1429613345973,71,-0.071197,0.0531344,0.0449234,34
1429613346015,71,-0.0743786,0.0726334,0.0847066,28
1429613346057,71,-0.0637142,0.0724168,0.0688976,24
1429613346099,71,-0.00757317,0.0961746,0.0875971,21
1429613346141,71,0.00541864,0.0943219,0.0231694,20
1429613346183,71,0.0292334,0.103204,0.00296133,19
1429613346224,71,0.0481618,0.109351,0.00925344,23
1429613346265,71,0.0995503,0.115334,0.0616676,44
1429613346307,71,0.181442,0.110078,0.113083,62
1429613346348,71,0.264556,0.095458,0.140936,74
1429613346390,71,0.272451,0.0512657,0.0534203,71
1429613346432,71,0.168433,0.00544854,-0.0526459,59
1429613346474,71,0.0123533,-0.0560147,-0.1763,49
1429613346515,71,-0.113377,-0.0732369,-0.108895,40
1429613346557,71,-0.174287,-0.0897795,0.000198799,38
1429613346599,71,-0.190308,-0.0951303,0.134679,40
1429613346641,71,-0.173531,-0.104851,0.16247,41
1429613346683,71,-0.179828,-0.125985,0.0712269,40
1429613346725,71,-0.167622,-0.134086,-0.061196,37
1429613346767,71,-0.125252,-0.0987054,-0.0790517,31
1429613346808,71,-0.0412402,-0.0495654,-0.0404661,28
1429613346850,71,0.111617,-2.53876e-05,-0.000610288,23
1429613346892,71,0.226763,0.0494717,0.0447285,22
1429613346933,71,0.357068,0.0876535,0.0652449,21
1429613346975,71,0.347257,0.100846,0.0347755,21
1429613347016,71,0.213679,0.0818685,-0.0728312,36
1429613347057,71,-0.0138476,0.0381941,-0.214565,52
1429613347099,71,-0.226887,0.0340509,-0.231001,72
1429613347140,71,-0.334156,0.0733025,-0.115604,73
1429613347182,71,-0.361774,0.0939719,-0.000355927,64
1429613347224,71,-0.251806,0.106227,0.13057,54
1429613347265,71,-0.112447,0.0629242,0.177799,41
1429613347308,71,0.0423478,-0.0331885,0.136338,39
1429613347320,71,0.149967,-0.140818,0.0454677,39
1429613347361,71,0.209194,-0.159235,0.0661544,41
1429613347402,71,0.174108,-0.177284,0.00327236,42
1429613347444,71,0.0828201,-0.165901,-0.0821684,40
1429613347486,71,-0.0613237,-0.153443,-0.208691,38
1429613347528,71,-0.146366,-0.103321,-0.24569,32
1429613347570,71,-0.184168,-0.00732716,-0.179853,29
1429613347612,71,-0.104465,0.119509,0.0131358,24
1429613347653,71,0.0664121,0.234132,0.257958,23
1429613347665,71,0.279658,0.326549,0.51699,22
1429613347707,71,0.4603,0.367448,0.658859,22
1429613347718,71,0.488572,0.269524,0.482799,22
1429613347761,71,0.342071,0.0836262,0.0655828,27
1429613347774,71,0.148971,-0.105178,-0.339428,32
1429613347815,71,-0.0938094,-0.239091,-0.635606,56
1429613347857,71,-0.268641,-0.236567,-0.635032,68
1429613347868,71,-0.311573,-0.152468,-0.410437,71
1429613347910,73,-0.319985,-0.0647392,-0.140554,70
1429613347923,73,-0.262822,-0.0347392,0.0380871,67
1429613347935,73,-0.26967,-0.0860127,0.073715,64
1429613347976,73,-0.265856,-0.151818,0.00498562,54
1429613348018,73,-0.208638,-0.152375,-0.00173762,40
1429613348033,73,-0.116576,-0.0911298,0.0444125,38
1429613348075,73,-0.00878411,0.0125578,0.152028,36
1429613348102,73,0.0984939,0.0856431,0.201278,38
1429613348133,73,0.152407,0.118265,0.187778,40
1429613348174,73,0.187884,0.115188,0.117708,40
1429613348197,73,0.244087,0.0798066,0.0222234,40
1429613348239,73,0.274136,0.0505579,0.00261805,37
1429613348265,73,0.273164,0.0688338,0.077668,33
1429613348307,73,0.233892,0.110426,0.202915,29
1429613348333,73,0.127869,0.124503,0.227629,26
1429613348374,73,0.0210653,0.0983498,0.157462,23
1429613348396,73,-0.0737834,0.0507664,0.0355259,22
1429613348438,73,-0.167829,-0.028742,-0.148542,20
1429613348465,73,-0.260194,-0.0888423,-0.292519,20
1429613348506,73,-0.329285,-0.123244,-0.396469,25
1429613348533,73,-0.310253,-0.0825918,-0.343897,39
1429613348574,73,-0.210307,0.00235448,-0.153886,55
1429613348597,73,-0.0532439,0.0993934,0.100858,63
1429613348639,73,0.0893322,0.129238,0.266627,71
1429613348665,75,0.11728,0.0610719,0.246967,66
1429613348706,75,0.0879849,-0.0685974,0.126266,57
1429613348733,75,0.0604887,-0.144453,0.0656038,47
1429613348775,75,0.0906163,-0.158818,0.0585889,39
1429613348798,75,0.105157,-0.113002,0.0653879,36
1429613348839,75,0.116203,-0.0381832,0.0746101,36
1429613348865,75,0.0580775,0.019397,0.0531864,39
1429613348906,75,0.0285655,0.0188826,-0.0304717,40
1429613348933,75,0.0105663,0.00196993,-0.0848465,40
1429613348974,75,-0.000922149,-0.0777029,-0.232471,38
1429613348997,75,-0.055321,-0.149231,-0.420825,36
1429613349038,75,-0.138453,-0.206741,-0.596453,30
1429613349066,75,-0.174089,-0.1459,-0.524899,27
1429613349097,75,-0.151902,-0.0457236,-0.32188,25
1429613349138,75,-0.0733435,0.0502923,-0.067718,22
1429613349166,75,0.0481532,0.16498,0.239493,20
1429613349197,75,0.14788,0.268751,0.537486,20
1429613349238,75,0.254386,0.35755,0.748604,27
1429613349266,75,0.298239,0.386455,0.789093,41
1429613349297,75,0.259372,0.349799,0.68969,59
1429613349339,75,0.139308,0.209615,0.406288,69
1429613349380,75,-0.0344097,0.037178,0.116821,68
1429613349423,77,-0.204413,-0.139067,-0.162309,60
1429613349465,77,-0.307943,-0.247727,-0.281061,44
1429613349506,77,-0.291406,-0.288348,-0.307354,37
1429613349547,77,-0.183653,-0.263969,-0.281188,35
1429613349589,77,-0.0240312,-0.171794,-0.15655,38
1429613349631,77,0.0320049,-0.132351,-0.213846,40
1429613349673,77,0.0159506,-0.11169,-0.320166,39
1429613349714,77,-0.087066,-0.131564,-0.461578,37
1429613349755,77,-0.138383,-0.120505,-0.438615,32
1429613349796,77,-0.133177,-0.0992716,-0.331732,28
1429613349839,77,-0.025713,-0.00975552,-0.0414294,23
1429613349881,77,0.103928,0.0738925,0.190988,21
1429613349922,77,0.184081,0.14636,0.315374,22
1429613349963,77,0.197172,0.181438,0.336508,31
1429613350005,77,0.176144,0.178441,0.263598,56
1429613350046,77,0.0808831,0.123919,0.111535,68
1429613350088,77,0.0213391,0.0567369,-0.0529098,69
1429613350129,79,0.0418545,0.049608,-0.0474619,61
1429613350171,79,0.107432,0.0862958,0.0847711,46
1429613350213,79,0.160461,0.125851,0.270769,38
1429613350255,79,0.140151,0.0970667,0.362054,35
1429613350297,79,0.0292372,0.00500541,0.29664,37
1429613350339,79,-0.131016,-0.145913,0.0493716,40
1429613350380,79,-0.247059,-0.24958,-0.179533,40
1429613350422,79,-0.293345,-0.289057,-0.399682,36
1429613350465,79,-0.239858,-0.183825,-0.343011,33
1429613350506,79,-0.135271,-0.0815972,-0.273567,28
1429613350547,79,-0.0613338,0.00417806,-0.180944,25
1429613350589,79,-0.054937,0.0192332,-0.146284,22
1429613350630,79,-0.102942,-0.00526527,-0.16456,23
1429613350672,79,-0.0908303,-0.00118114,-0.0948274,40
1429613350713,79,-0.00105343,0.0497485,0.0149163,57
1429613350758,79,0.180082,0.167871,0.226055,71
1429613350770,79,0.326538,0.262211,0.382976,71
1429613350813,80,0.410174,0.322682,0.514099,66
1429613350825,80,0.371102,0.30076,0.528188,61
1429613350866,80,0.225115,0.177073,0.373352,51
1429613350907,80,0.0480599,0.0037111,0.146162,39
1429613350948,80,-0.125109,-0.180397,-0.138063,36
1429613350990,80,-0.24043,-0.31338,-0.385188,39
1429613351031,80,-0.271509,-0.344892,-0.493456,40
1429613351072,80,-0.213296,-0.282746,-0.450741,40
1429613351114,80,-0.105172,-0.153663,-0.283405,38
1429613351156,80,0.00344799,-0.0448127,-0.141329,33
1429613351197,80,0.0776327,0.0363858,-0.0200292,30
1429613351239,80,0.0887083,0.0682314,0.0365169,25
1429613351280,80,0.0725962,0.0871351,0.124631,23
1429613351322,80,0.0387194,0.0974409,0.171451,27
1429613351363,80,0.000208269,0.10413,0.184017,39
1429613351405,80,0.00139125,0.110607,0.181031,63
1429613351447,80,-0.0163303,0.0959482,0.121955,71
1429613351489,81,-0.0061685,0.106862,0.145643,66
1429613351531,81,-0.0063397,0.0997568,0.13593,58
1429613351573,81,-0.0238064,0.0536537,0.0643726,43
1429613351614,81,-0.0686572,-0.0342635,-0.0648448,38
1429613351656,81,-0.122125,-0.130448,-0.200844,38
1429613351667,81,-0.201699,-0.218362,-0.350106,38
1429613351709,81,-0.214204,-0.223795,-0.360823,40
1429613351751,81,-0.175883,-0.174664,-0.288683,40
1429613351763,81,-0.0815994,-0.0953369,-0.138968,40
1429613351806,81,0.0464723,-0.0154611,0.0471725,37
1429613351817,81,0.183591,0.070493,0.253812,37
1429613351859,81,0.283087,0.126193,0.388956,32
1429613351900,81,0.318366,0.149588,0.389897,28
1429613351941,81,0.24077,0.133599,0.248691,24
1429613351952,81,0.127314,0.0844592,0.0382579,24
1429613351994,81,0.00778444,0.0200614,-0.15442,24
1429613352005,81,-0.0496721,-0.00975742,-0.225001,27
1429613352047,81,-0.0530746,0.00714432,-0.142768,40
1429613352089,81,-0.0188536,0.0597751,0.00947567,62
1429613352100,81,0.00158048,0.100162,0.111176,62
1429613352142,81,-0.0144838,0.0868072,0.0974614,70
1429613352183,83,-0.0832769,-0.00399303,-0.0540396,65
1429613352225,83,-0.147026,-0.117719,-0.207913,51
1429613352236,83,-0.190049,-0.229626,-0.345706,51
1429613352278,83,-0.20901,-0.292975,-0.401875,40
1429613352291,83,-0.169347,-0.272958,-0.343909,38
1429613352333,83,-0.102438,-0.185186,-0.196778,37
1429613352374,83,-0.00234946,-0.0519327,0.00571109,40
1429613352386,83,0.079647,0.0791849,0.216602,40
1429613352427,83,0.148083,0.178267,0.382621,40
1429613352439,83,0.201976,0.213747,0.432119,40
1429613352481,83,0.2121,0.208421,0.387818,38
1429613352522,83,0.153625,0.117546,0.154171,32
1429613352534,83,0.0458809,0.0330424,-0.07565,32
1429613352575,83,-0.0271097,-0.0563213,-0.271771,28
1429613352597,83,-0.0638436,-0.0772298,-0.291102,26
1429613352639,83,-0.0211356,-0.0209645,-0.115098,23
1429613352666,83,0.021598,0.0883995,0.161642,23
1429613352707,83,0.0416266,0.19435,0.400352,33
1429613352735,83,0.0111133,0.238588,0.450365,40
1429613352765,83,-0.0119844,0.261245,0.45069,56
1429613352797,83,-0.0533056,0.156795,0.229476,68
1429613352838,83,-0.0841713,-0.00694392,-0.0368879,70
1429613352865,84,-0.124127,-0.209863,-0.342181,65
1429613352906,84,-0.146183,-0.334982,-0.487254,52
1429613352933,84,-0.129031,-0.323985,-0.37626,47
1429613352974,84,-0.0784558,-0.244587,-0.223683,39
1429613352999,84,0.0137756,-0.0985973,-0.0176351,38
1429613353033,84,0.0539901,-0.043436,-0.0486232,39
1429613353074,84,0.0522949,-0.0850008,-0.253258,41
1429613353099,84,0.0266986,-0.14326,-0.445926,41
1429613353132,84,0.024378,-0.141025,-0.433443,40
1429613353166,84,0.0540034,-0.0270533,-0.153739,39
1429613353198,84,0.0934097,0.1453,0.25334,35
1429613353233,84,0.12759,0.292008,0.58251,32
1429613353274,84,0.140153,0.377761,0.761415,27
1429613353297,84,0.112336,0.368131,0.712475,26
1429613353342,84,0.0514455,0.269955,0.462892,24
1429613353366,84,0.0191092,0.148828,0.170177,24
1429613353397,84,0.00626802,0.0516964,-0.076026,30
1429613353434,84,0.0280953,0.00258393,-0.188445,42
1429613353467,84,0.0512866,-0.00977842,-0.171113,58
1429613353497,84,0.0583181,-0.0199083,-0.0692483,68
1429613353538,84,-0.0127031,-0.0964311,-0.10466,69
1429613353580,85,-0.121882,-0.227472,-0.261517,59
1429613353625,85,-0.226435,-0.350405,-0.456426,45
1429613353638,85,-0.269747,-0.401684,-0.564253,45
1429613353680,85,-0.230399,-0.3226,-0.437366,38
1429613353722,85,-0.0972795,-0.161969,-0.167781,40
1429613353764,85,0.030058,0.0240099,0.155308,41
1429613353805,85,0.129447,0.145809,0.337768,42
1429613353849,85,0.154702,0.187447,0.365096,40
1429613353861,85,0.134492,0.168683,0.283471,38
1429613353902,85,0.0628401,0.129183,0.184407,35
1429613353944,85,-0.00412342,0.111838,0.119808,30
1429613353985,85,-0.0141449,0.122614,0.115443,27
1429613354027,85,-0.00947068,0.133412,0.104054,25
1429613354069,85,-0.00125262,0.115051,0.057956,25
1429613354110,85,-0.0568805,0.041784,-0.0653383,39
1429613354152,85,-0.104835,-0.0690421,-0.235053,54
1429613354204,85,-0.142897,-0.16613,-0.34976,70
1429613354218,85,-0.112208,-0.210996,-0.38205,71
1429613354261,86,-0.0117623,-0.152949,-0.238366,63
1429613354304,86,0.0874629,-0.0607075,-0.0549385,54
1429613354346,86,0.143072,0.0136412,0.0924239,42
1429613354388,86,0.1814,0.0821281,0.22373,40
1429613354434,86,0.138717,0.10677,0.292907,40
1429613354447,86,0.0905412,0.0837836,0.255872,41
1429613354488,86,0.0244733,0.0101131,0.125848,33
1429613354629,86,-0.0384166,-0.0795726,-0.0705457,31
1429613354671,86,-0.115281,-0.152952,-0.245989,28
1429613354712,86,-0.159988,-0.16445,-0.309166,26
1429613354755,86,-0.144789,-0.101102,-0.215636,26
1429613354796,86,-0.105728,0.00622569,-0.0333613,39
1429613354838,86,-0.019268,0.114865,0.175279,54
1429613354879,86,0.0700633,0.197916,0.329676,71
1429613354921,86,0.116678,0.23619,0.380942,71
1429613354963,86,0.117455,0.205601,0.300414,62
1429613355005,86,0.0489907,0.117836,0.110147,53
1429613355046,86,-0.000521389,0.0107181,-0.0599662,43
1429613355089,86,-0.0618103,-0.116548,-0.20891,41
1429613355130,86,-0.0950586,-0.202898,-0.25849,42
1429613355172,86,-0.110592,-0.223629,-0.215987,43
1429613355214,86,-0.121579,-0.167838,-0.0935272,41
1429613355256,86,-0.0746703,-0.0764528,0.0415622,39
1429613355297,86,-0.0372908,0.0100545,0.115451,33
1429613355339,86,0.0177711,0.0331287,0.0607157,30
1429613355381,86,0.0928858,0.0496186,0.0137296,27
1429613355423,86,0.162106,0.0365314,-0.080977,26
1429613355465,86,0.181251,0.0252668,-0.153247,27
1429613355507,86,0.136432,0.0165151,-0.187272,36
1429613355518,86,0.0491476,0.000361024,-0.20059,42
1429613355560,86,-0.0107644,0.0322355,-0.102139,59
1429613355602,86,-0.0409608,0.0852247,0.0292562,73
1429613355644,86,0.0132214,0.148117,0.17732,70
1429613355685,87,0.0960781,0.191231,0.319579,62
1429613355727,87,0.143039,0.19009,0.4046,54
1429613355770,87,0.0944461,0.113649,0.38103,45
1429613355782,87,-0.0149723,-0.0334879,0.177414,43
1429613355824,87,-0.170827,-0.228585,-0.167324,42
1429613355866,87,-0.266036,-0.353011,-0.446065,43
1429613355907,87,-0.293215,-0.390089,-0.595619,42
1429613355949,87,-0.213239,-0.281281,-0.471204,40
1429613355990,87,-0.0696094,-0.0850588,-0.117473,36
1429613356032,87,0.096567,0.150452,0.33195,31
1429613356075,87,0.19575,0.301672,0.605804,28
1429613356088,87,0.188796,0.288086,0.520436,27
1429613356130,87,0.10077,0.125802,0.114895,26
1429613356171,87,0.010169,-0.0707607,-0.344988,26
1429613356215,87,0.0033945,-0.132602,-0.523014,26
1429613356227,87,0.0594685,-0.0686822,-0.375062,26
1429613356268,87,0.146218,0.105398,0.0196838,34
1429613356310,87,0.198494,0.26798,0.435271,48
1429613356351,87,0.181743,0.355112,0.680591,69
1429613356393,87,0.115042,0.342105,0.715312,73
1429613356434,87,-0.0413203,0.187792,0.430608,67
1429613356476,87,-0.213395,-0.0182885,0.0286957,60
1429613356488,87,-0.332897,-0.225914,-0.378886,56
1429613356529,87,-0.381616,-0.371093,-0.645658,49
1429613356542,87,-0.340468,-0.414391,-0.690284,46
1429613356584,87,-0.229506,-0.401578,-0.614841,42
1429613356596,87,-0.0995968,-0.326525,-0.424621,42
1429613356639,87,0.0337169,-0.222956,-0.207945,42
1429613356650,87,0.0900459,-0.128889,-0.0843134,42
1429613356692,87,0.124458,-0.0376138,0.0147549,41
1429613356704,87,0.153536,0.0460633,0.10947,40
1429613356746,87,0.179388,0.117497,0.176996,38
1429613356765,87,0.181978,0.165381,0.214317,34
1429613356806,87,0.169681,0.21538,0.252199,31
1429613356833,87,0.13831,0.231787,0.24433,28
1429613356874,87,0.077922,0.235513,0.231609,26
1429613356897,87,0.00779119,0.215017,0.22689,25
1429613356940,87,-0.0568281,0.137287,0.126263,25
1429613356965,87,-0.113678,0.0384438,-0.0153137,25
1429613357006,87,-0.134996,-0.043172,-0.146473,25
1429613357047,87,-0.127224,-0.072577,-0.184671,25
1429613357089,87,-0.0596311,0.00278163,-0.0237058,25
1429613357100,87,0.0453412,0.111533,0.203853,27
1429613357142,87,0.139487,0.202802,0.389848,37
1429613357164,87,0.198221,0.184253,0.383922,52
1429613357207,87,0.195121,0.0804304,0.245857,67
1429613357232,87,0.117067,-0.0708893,0.0147585,73
1429613357274,87,0.0109528,-0.215649,-0.204975,71
1429613357298,87,-0.0776338,-0.281603,-0.312265,66
1429613357333,87,-0.117955,-0.258651,-0.279549,58
1429613357374,87,-0.107769,-0.170455,-0.143051,51
1429613357398,87,-0.0706578,-0.0634666,0.0105513,48
1429613357441,87,-0.0142443,-0.012065,0.0584927,43
1429613357465,87,-0.00665094,-0.019146,-0.0246119,42
1429613357506,87,-0.0257744,-0.0502811,-0.134821,42
1429613357533,87,-0.0905737,-0.113053,-0.316184,41
1429613357574,87,-0.144306,-0.131367,-0.401176,40
1429613357596,87,-0.14405,-0.101312,-0.370843,38
1429613357639,87,-0.0946227,-0.0241364,-0.23701,33
1429613357665,87,-0.000571312,0.0876527,-0.00697355,32
1429613357706,87,0.072455,0.173569,0.178373,27
1429613357733,87,0.118059,0.232929,0.314616,26
1429613357774,87,0.126836,0.233676,0.345065,25
1429613357815,87,0.115343,0.199923,0.312614,24
1429613357857,87,0.123984,0.170789,0.314623,24
1429613357898,87,0.120282,0.13934,0.306212,24
1429613357940,87,0.0950033,0.111462,0.287116,24
1429613357981,87,0.0508015,0.0472146,0.170945,22
1429613358023,87,-0.0125336,-0.0252069,0.00908728,22
1429613358064,87,-0.0547878,-0.0912896,-0.148776,27
1429613358106,87,-0.0806807,-0.129728,-0.262304,48
1429613358147,87,-0.0888889,-0.13516,-0.320043,65
1429613358189,87,-0.0646355,-0.0991384,-0.268175,73
1429613358230,87,-0.038836,-0.0442355,-0.126116,70
1429613358273,87,-0.00662551,-0.0125569,0.0184572,59
1429613358314,87,0.00128583,-0.0594932,0.0116695,52
1429613358356,87,-0.0333902,-0.173003,-0.150894,44
1429613358397,87,-0.0815431,-0.271549,-0.324514,42
1429613358439,87,-0.110791,-0.279012,-0.347244,42
1429613358480,87,-0.119806,-0.199307,-0.225052,41
1429613358522,87,-0.102591,-0.0460602,0.0299278,39
1429613358563,87,-0.0713122,0.0945735,0.256899,35
1429613358605,87,-0.0388175,0.17287,0.370363,30
1429613358646,87,0.00373968,0.189727,0.362122,27
1429613358688,87,0.049651,0.133518,0.213858,24
1429613358730,87,0.105302,0.0924689,0.0859036,23
1429613358771,87,0.137578,0.0638843,-0.014129,23
1429613358813,87,0.128947,0.0784146,-0.013572,22
1429613358854,87,0.104092,0.0980918,0.020202,22
1429613358895,87,0.0669515,0.117422,0.0535303,21
1429613358937,87,0.0574337,0.120161,0.0627784,20
1429613358948,87,0.0899532,0.128795,0.0811593,20
1429613358990,87,0.10411,0.116123,0.0663612,20
1429613359031,87,0.0842828,0.0841355,0.0505389,30
1429613359074,87,0.0400072,0.032484,0.0147189,55
1429613359115,87,0.00515537,-0.0288332,-0.0575838,70
1429613359157,87,-0.0225609,-0.0802405,-0.122583,73
1429613359199,87,-0.0249862,-0.0940192,-0.124831,67
1429613359240,87,-0.0488823,-0.0701275,-0.0485979,56
1429613359281,87,-0.0587499,-0.0444114,0.0517817,48
1429613359323,87,-0.07186,-0.0437913,0.122352,42
1429613359364,87,-0.064578,-0.0718837,0.137281,41
1429613359406,87,-0.0820369,-0.141764,0.021697,41
1429613359447,87,-0.134714,-0.20344,-0.136612,40
1429613359489,87,-0.165654,-0.216766,-0.263069,37
1429613359530,87,-0.163963,-0.169974,-0.290644,34
1429613359572,87,-0.112439,-0.0946235,-0.23163,28
1429613359614,87,-0.0248073,-0.0180711,-0.14958,25
1429613359656,87,0.0501926,0.0307637,-0.0819734,22
1429613359698,87,0.135599,0.0775132,-0.00166947,21
1429613359740,87,0.160269,0.110014,0.0798159,21
1429613359781,87,0.145676,0.121189,0.106427,21
1429613359823,87,0.108285,0.132407,0.116841,21
1429613359864,87,0.0709718,0.13039,0.0915075,20
1429613359905,87,0.0481621,0.133928,0.0980425,18
1429613359946,87,0.0308537,0.104432,0.0805007,19
1429613359988,87,0.0245473,0.0670275,0.091517,37
1429613360030,87,0.0106361,0.0336568,0.108214,56
1429613360071,87,-0.0385844,0.00304814,0.0840641,75
1429613360114,87,-0.0864767,-0.00236395,0.0522091,75
1429613360155,87,-0.100446,0.0176435,0.0517906,65
1429613360196,87,-0.0851935,0.0434391,0.0737761,56
1429613360238,87,-0.0623116,0.0443802,0.0829854,45
1429613360279,87,-0.00419605,0.0303485,0.106035,42
1429613360321,87,0.0496825,-0.0126643,0.112228,41
1429613360362,87,0.0470177,-0.0933952,0.0313817,42
1429613360403,87,0.0299717,-0.170845,-0.0795788,40
1429613360445,87,-0.00709001,-0.218995,-0.194594,38
1429613360486,87,-0.0497567,-0.226565,-0.284202,34
1429613360529,87,-0.0668706,-0.183992,-0.28836,28
1429613360571,87,-0.0202183,-0.0927295,-0.196141,24
1429613360612,87,0.0503521,0.0139923,-0.0581566,22
1429613360654,87,0.117014,0.114419,0.0947713,21
1429613360695,87,0.111709,0.159302,0.137022,20
1429613360738,87,0.0530093,0.151125,0.089864,20
1429613360750,87,0.00805244,0.12586,0.0170321,20
1429613360762,87,-0.0426819,0.0611826,-0.114529,20
1429613360805,87,-0.0746225,-0.00377378,-0.219561,19
1429613360817,87,-0.0813089,-0.0431973,-0.229884,19
1429613360859,87,-0.0520099,-0.0281902,-0.0964817,18
1429613360901,87,0.0057726,0.0317099,0.119492,23
1429613360942,87,0.042157,0.102176,0.315111,47
1429613360984,87,0.0682593,0.144734,0.414461,67
1429613361026,87,0.0434189,0.137607,0.384122,77
1429613361067,87,0.0104108,0.0829483,0.258973,73
1429613361109,87,-0.035518,0.00235924,0.0877693,61
1429613361151,87,-0.0882514,-0.0860503,-0.0513032,52
1429613361193,87,-0.151596,-0.186541,-0.215019,42
1429613361205,87,-0.166323,-0.2489,-0.31117,42
1429613361247,87,-0.106286,-0.24977,-0.309944,40
1429613361258,87,-0.0124622,-0.195427,-0.257754,40
1429613361300,87,0.0758408,-0.107032,-0.16618,41
1429613361342,87,0.127019,-0.0151891,-0.0681032,40
1429613361384,87,0.121313,0.0579539,0.0259808,38
1429613361395,87,0.10004,0.119399,0.140257,36
1429613361437,87,0.0580595,0.16399,0.245031,32
1429613361478,87,-0.00508007,0.145952,0.221922,25
1429613361520,87,-0.0468262,0.10333,0.128781,22
1429613361561,87,-0.0781005,0.0361163,-0.0271496,19
1429613361603,87,-0.0621302,-0.0136352,-0.156828,18
1429613361614,87,-0.0174585,-0.0346613,-0.215168,18
1429613361655,87,0.066277,-0.011937,-0.150084,18
1429613361667,87,0.135379,0.0430449,-0.00625635,18
1429613361708,87,0.164928,0.0871638,0.133591,18
1429613361721,87,0.12869,0.104989,0.201261,18
1429613361762,87,0.058888,0.0966369,0.213527,19
1429613361774,87,-0.0182323,0.0464306,0.123673,22
1429613361815,87,-0.0509173,0.0164058,0.0578925,36
1429613361857,87,-0.0535537,-0.0120733,-0.0161168,56
1429613361874,87,-0.0237575,-0.0170615,-0.0306487,73
1429613361885,87,-0.00893606,-0.0407485,-0.0595764,73
1429613361927,87,-0.0347667,-0.0781657,-0.0950974,78
1429613361939,87,-0.0641906,-0.114273,-0.121216,78
1429613361988,87,-0.0945433,-0.136308,-0.125259,68
1429613361999,87,-0.117515,-0.137044,-0.103467,63
1429613362041,87,-0.149233,-0.127659,-0.103589,49
1429613362083,87,-0.181281,-0.108618,-0.0995595,42
1429613362125,87,-0.189427,-0.0894543,-0.107242,40
1429613362167,87,-0.16469,-0.0648482,-0.102503,41
1429613362208,87,-0.065102,-0.00829709,-0.0318282,41
1429613362250,87,0.0547252,0.0541773,0.0581539,40
1429613362291,87,0.14856,0.108292,0.137771,35
1429613362333,87,0.197656,0.14412,0.204504,30
1429613362375,87,0.202432,0.150381,0.213031,24
1429613362416,87,0.176574,0.123599,0.171302,21
1429613362458,87,0.156732,0.085672,0.107502,18
1429613362499,87,0.160825,0.0489894,0.048062,18
1429613362541,87,0.15971,0.0176473,-0.00961391,18
1429613362582,87,0.152695,0.00620198,-0.0487648,18
1429613362624,87,0.10597,0.00135312,-0.0785048,27
1429613362665,87,0.0474648,0.00600854,-0.0702342,44
1429613362707,87,-0.0312194,0.00556857,-0.0583642,64
1429613362751,87,-0.100579,-0.00148288,-0.0595096,79
1429613362762,87,-0.149288,-0.0145745,-0.0747879,78
1429613362805,85,-0.188418,-0.0302911,-0.0888653,74
1429613362847,85,-0.181334,-0.0347648,-0.0616511,60
1429613362889,85,-0.168673,-0.0361154,-0.00539113,50
1429613362930,85,-0.149005,-0.0522195,0.0357021,41
1429613362972,85,-0.0980157,-0.0720944,0.0570599,40
1429613363013,85,-0.0841324,-0.113659,-0.00736018,42
1429613363055,85,-0.0653356,-0.141748,-0.0989646,42
1429613363096,85,-0.0459232,-0.128823,-0.135209,40
1429613363138,85,-0.0404424,-0.11766,-0.188756,36
1429613363179,85,0.00327198,-0.0827537,-0.168407,29
1429613363220,85,0.0461233,-0.0309013,-0.109046,26
1429613363262,85,0.0915279,0.0160098,-0.0383535,21
1429613363303,85,0.112064,0.0649306,0.0277949,20
1429613363345,85,0.115162,0.105414,0.102453,19
1429613363387,85,0.120856,0.153945,0.207054,19
1429613363428,85,0.116993,0.193853,0.295104,30
1429613363470,85,0.113664,0.217318,0.339175,46
1429613363512,85,0.0745299,0.204565,0.305901,71
1429613363554,85,0.0436273,0.160428,0.224425,76
1429613363595,84,0.0187037,0.0923179,0.0996442,70
1429613363638,84,0.011659,0.0239011,0.000126076,61
1429613363680,84,0.000119761,-0.0417432,-0.0836966,47
1429613363722,84,0.0108955,-0.0864042,-0.109277,41
1429613363764,84,-0.00631262,-0.122903,-0.11151,40
1429613363805,84,-0.0493565,-0.144568,-0.0953598,41
1429613363847,84,-0.0863837,-0.142339,-0.0812729,41
1429613363888,84,-0.0855495,-0.102456,-0.0296557,40
1429613363929,84,-0.0727971,-0.0614917,-0.0273832,35
1429613363971,84,-0.0475662,-0.0262853,-0.037912,31
1429613364012,84,-0.0444918,-0.0207567,-0.0906623,25
1429613364054,84,-0.0452188,-0.0289589,-0.135609,23
1429613364096,84,-0.0179328,-0.0203557,-0.0874549,20
1429613364107,84,-0.00173857,-0.00709471,-0.0335955,20
1429613364119,84,0.00857552,0.0206037,0.000736431,20
1429613364160,84,0.00606735,0.0526349,-0.0110399,19
1429613364201,84,0.0122014,0.0782676,-0.0740653,28
1429613364243,84,0.0326154,0.0920337,-0.131208,42
1429613364284,84,0.084134,0.109747,-0.118114,67
1429613364326,84,0.11213,0.0993454,-0.088396,73
1429613364368,83,0.107596,0.0690894,-0.020906,68
1429613364409,83,0.0474349,0.00397437,-0.00362817,59
1429613364450,83,-0.042651,-0.0733213,-0.00820524,44
1429613364492,83,-0.122754,-0.132982,-0.0082902,39
1429613364533,83,-0.162613,-0.158991,0.0227346,38
1429613364576,83,-0.139637,-0.13392,0.115396,40
1429613364617,83,-0.075886,-0.084016,0.189774,40
1429613364659,83,-0.00677737,-0.0284374,0.222652,39
1429613364671,83,0.0316216,0.000481997,0.167532,37
1429613364712,83,0.0197101,0.00507915,0.0619973,34
1429613364724,83,-0.0172722,0.00310147,-0.0225964,32
1429613364766,83,-0.0405967,0.015681,-0.045452,26
1429613364808,83,-0.00892111,0.0548637,0.0201125,23
1429613364820,83,0.0381239,0.0986333,0.110123,22
1429613364862,83,0.0983837,0.127498,0.166157,20
1429613364904,83,0.124112,0.114154,0.120461,19
1429613364946,83,0.116514,0.0737707,-0.0018272,23
1429613364958,83,0.0963185,0.0346848,-0.0956635,29
1429613365001,83,0.0685797,0.0112093,-0.148599,54
1429613365012,83,0.0473467,0.010704,-0.1354,54
1429613365054,83,0.0178098,0.0132311,-0.101471,71
1429613365067,83,0.00168235,0.0145698,-0.0437281,72
1429613365109,82,-0.0166798,-0.00300869,0.0139774,69
1429613365123,82,-0.0195772,-0.031607,0.0638664,65
1429613365165,82,-0.0495067,-0.0754812,0.0508757,50
1429613365177,82,-0.0820079,-0.11136,-0.00428501,50
1429613365218,82,-0.113141,-0.118447,-0.065098,39
1429613365233,82,-0.100955,-0.0757662,-0.0520671,37
1429613365274,82,-0.0554769,-0.0128709,-0.003641,37
1429613365296,82,-0.0311698,0.0239255,-0.00511902,38
1429613365338,82,-0.0320929,0.0115157,-0.0856086,40
1429613365364,82,-0.0477668,-0.0380376,-0.204146,40
1429613365406,82,-0.0480375,-0.07394,-0.244303,39
1429613365432,82,-0.0138662,-0.0673807,-0.165187,36
1429613365474,82,0.0407859,-0.00920882,0.0317788,32
1429613365498,82,0.0879035,0.0592147,0.208331,28
1429613365539,82,0.0987631,0.117916,0.311703,25
1429613365565,82,0.0651208,0.120278,0.244331,23
1429613365606,82,0.0205843,0.0930759,0.102115,21
1429613365632,82,-0.00868527,0.06167,-0.0158674,21
1429613365674,82,-0.000610402,0.0476459,-0.0502954,29
1429613365696,82,0.0374596,0.0589829,0.00995903,36
1429613365738,82,0.0766072,0.0625178,0.0793434,60
1429613365766,82,0.0849983,0.0455997,0.116526,70
1429613365800,82,0.0466266,-0.00588099,0.077099,70
1429613365832,81,-0.0278266,-0.0844691,-0.0296816,64
1429613365865,81,-0.119603,-0.145139,-0.116294,54
1429613365896,81,-0.164553,-0.169246,-0.160854,49
1429613365938,81,-0.13602,-0.149752,-0.157469,38
1429613365965,81,-0.0405488,-0.0873463,-0.0934996,36
1429613366000,81,0.0506386,-0.0282773,-0.0331475,37
1429613366042,81,0.0785117,0.0205236,0.0126629,40
1429613366066,81,0.0533437,0.0708579,0.0851594,40
1429613366096,81,-0.00381144,0.076425,0.0836845,40
1429613366138,81,-0.0447837,0.0597826,0.0496166,37
1429613366166,81,-0.0531492,0.0222357,-0.02362,34
1429613366200,81,-0.014479,-0.00160728,-0.0839539,30
1429613366233,81,0.0384694,-0.010876,-0.113166,27
1429613366266,81,0.102578,0.0272035,-0.0456473,24
1429613366296,81,0.135782,0.0742246,0.0577688,23
1429613366338,81,0.113112,0.111561,0.15853,22
1429613366379,81,0.0670352,0.117666,0.201691,31
1429613366421,81,-0.00954759,0.0808085,0.144221,54
1429613366462,81,-0.0654556,0.0162925,0.0147944,66
1429613366504,81,-0.0831744,-0.0401363,-0.0843508,68
1429613366547,81,-0.0868156,-0.0762311,-0.127369,61
1429613366558,81,-0.0626708,-0.0923539,-0.104698,56
1429613366599,81,-0.0280221,-0.0969218,-0.0604222,41
1429613366641,81,0.0081055,-0.0895849,-0.0194523,36
1429613366686,81,0.0296174,-0.0782945,-0.0110898,36
1429613366698,81,0.0146846,-0.0583451,-0.0326034,36
1429613366739,81,-0.011134,-0.0255648,-0.0271953,40
1429613366780,81,-0.0410229,0.00301865,-0.0249143,40
1429613366822,81,-0.0438762,0.025751,-0.00368398,38
1429613366864,81,-0.0359454,0.0330234,0.0140195,35
1429613366906,81,-0.0125038,0.0199825,0.00251251,30
1429613366947,81,0.00157634,0.0038958,-0.011942,27
1429613366989,81,0.0154282,-0.00305444,-0.0118879,23
1429613367031,81,0.0484742,0.0118028,0.0178145,26
1429613367072,81,0.0746372,0.0376534,0.0563919,43
1429613367113,81,0.0921178,0.0787193,0.0886779,58
1429613367155,81,0.0892798,0.102271,0.0786094,69
1429613367196,82,0.0667521,0.113887,0.0676897,65
1429613367238,82,0.0389331,0.0925311,0.0527436,52
1429613367281,82,0.0341993,0.067005,0.0716612,43
1429613367322,82,0.00914461,0.00386294,0.0389245,36
1429613367368,82,-0.0189114,-0.0713323,-0.00978963,39
1429613367381,82,-0.0621695,-0.140947,-0.0788696,39
1429613367423,82,-0.0974296,-0.155584,-0.0999207,40
1429613367465,82,-0.118071,-0.123807,-0.0859916,40
1429613367506,82,-0.10231,-0.0557159,-0.0315227,37
1429613367548,82,-0.0823651,0.00721596,0.0220394,34
1429613367589,82,-0.0612578,0.0322707,0.0268653,29
1429613367631,82,-0.0347146,0.0358605,0.00356124,26
1429613367672,82,0.000518556,0.0325209,-0.0209399,26
1429613367713,82,0.0522974,0.0443272,-0.0249296,36
1429613367755,82,0.0728959,0.0555721,-0.0181775,57
1429613367796,82,0.0797469,0.0558469,-0.0136483,67
1429613367838,82,0.0664521,0.0481553,-0.00732585,65
1429613367879,82,0.0332564,0.0209001,-0.0160909,57
1429613367921,82,0.00508479,-0.0120027,-0.019087,43
1429613367963,82,-0.046266,-0.0521624,-0.0257516,37
1429613368004,82,-0.0801048,-0.0799728,-0.00858639,37
1429613368046,82,-0.0960794,-0.0922865,0.00296612,39
1429613368088,82,-0.0743662,-0.0798625,0.0193615,40
1429613368130,82,-0.0248343,-0.0465749,0.0290171,39
1429613368172,82,0.00450056,-0.028126,0.00101653,35
1429613368213,82,0.0307861,0.00489041,0.00545486,32
1429613368255,82,0.0514223,0.010782,-0.0255963,27
1429613368298,82,0.0796112,0.0231795,-0.0228125,27
1429613368339,82,0.0742026,0.0127517,-0.0469975,40
1429613368381,82,0.0637526,0.020755,-0.030668,55
1429613368423,82,0.0352985,0.0389449,-0.0137744,66
1429613368464,83,0.028802,0.0796878,0.0391856,64
1429613368506,83,0.0361679,0.115342,0.0922066,52
1429613368547,83,0.0672055,0.129892,0.148505,43
1429613368588,83,0.0436128,0.0850189,0.117856,36
1429613368630,83,0.00397156,0.00227035,0.046872,36
1429613368671,83,-0.0445158,-0.0757386,-0.0408018,39
1429613368683,83,-0.051894,-0.101858,-0.0693871,39
1429613368724,83,-0.0632114,-0.0784125,-0.0663009,39
1429613368766,83,-0.0410667,-0.0374346,-0.0384068,37
1429613368778,83,-0.00958867,0.0121345,0.0175603,36
1429613368819,83,0.0267574,0.0232948,0.0455506,33
1429613368860,83,0.0520489,0.0293589,0.0687198,28
1429613368902,83,0.0446915,0.00275826,0.0355671,26
1429613368943,83,-0.00108965,-0.0430631,-0.0596133,37
1429613368985,83,-0.0554032,-0.0858235,-0.162777,51
1429613368996,83,-0.0979862,-0.0918338,-0.207675,57
1429613369037,83,-0.0862333,-0.0288921,-0.128793,65
1429613369079,86,-0.0273754,0.0559868,-0.00356844,61
1429613369120,86,0.0194176,0.0978908,0.0834463,53
1429613369162,86,0.0111785,0.0477125,0.072891,40
1429613369176,86,-0.0732417,-0.0661979,-0.00920048,37
1429613369188,86,-0.167017,-0.155712,-0.0798744,37
1429613369231,86,-0.219697,-0.1789,-0.0962826,35
1429613369242,86,-0.153217,-0.105611,-0.0168464,35
1429613369284,86,-0.0320848,-0.00662736,0.0807833,37
1429613369295,86,0.107102,0.0686721,0.139641,38
1429613369337,86,0.180918,0.0940901,0.134453,38
1429613369349,86,0.189936,0.103861,0.0932372,37
1429613369398,86,0.151519,0.127115,0.06901,34
1429613369410,86,0.114653,0.159164,0.0655641,32
1429613369452,86,0.104396,0.177556,0.067666,29
1429613369466,86,0.0634457,0.125596,0.0164156,27
1429613369508,86,0.0156627,0.0391574,-0.0421298,25
1429613369532,86,-0.0195752,-0.0451173,-0.0943374,27
1429613369574,86,0.0161196,-0.0540716,-0.0658439,44
1429613369600,86,0.0594962,-0.0156593,-0.00599418,52
1429613369642,86,0.0969147,0.02777,0.0721068,66
1429613369665,86,0.0673331,0.0101757,0.104593,66
1429613369706,89,-0.0271034,-0.0753222,0.0612157,57
1429613369732,89,-0.170412,-0.187802,-0.0305725,52
1429613369774,89,-0.271039,-0.25645,-0.131466,40
1429613369800,89,-0.269737,-0.24519,-0.175837,37
1429613369842,89,-0.141718,-0.139583,-0.143471,35
1429613369866,89,0.0397386,0.0301101,-0.0263233,36
1429613369897,89,0.130457,0.133219,0.0465933,38
1429613369938,89,0.0973488,0.126743,0.0364131,38
1429613369965,89,0.00462393,0.0375239,-0.0435865,37
1429613370000,89,-0.0590261,-0.0204208,-0.0932856,35
1429613370033,89,-0.0651717,-0.0111408,-0.0884457,32
1429613370076,89,0.0587361,0.0823016,-0.00120333,27
1429613370096,89,0.237103,0.195044,0.124999,26
1429613370138,89,0.355173,0.255208,0.203591,24
1429613370166,89,0.325272,0.234879,0.218298,25
1429613370200,89,0.124968,0.13476,0.131341,34
1429613370233,89,-0.102413,0.00507434,0.0141266,49
1429613370266,89,-0.295458,-0.104714,-0.0833057,62
1429613370296,89,-0.332988,-0.137656,-0.0877398,67
1429613370338,91,-0.261127,-0.132594,-0.0446314,63
1429613370364,91,-0.128469,-0.116203,0.014917,55
1429613370401,91,-0.0521776,-0.131694,0.0217299,45
1429613370435,91,-0.0515978,-0.18325,-0.0465007,38
1429613370464,91,-0.0896846,-0.232921,-0.132424,35
1429613370496,91,-0.134971,-0.235286,-0.185159,36
1429613370538,91,-0.071346,-0.139507,-0.152333,38
1429613370579,91,0.0244296,0.0101796,-0.0599445,39
1429613370621,91,0.152012,0.153323,0.0615373,38
1429613370662,91,0.134882,0.199159,0.140237,34
1429613370707,91,0.105405,0.151352,0.150974,29
1429613370719,91,0.0358176,0.0603046,0.110864,29
1429613370763,91,-0.0441882,-0.0195089,0.0224599,25
1429613370808,91,-0.0445407,-0.00776628,-0.0361184,26
1429613370820,91,0.0509508,0.106797,-0.0240417,26
1429613370864,91,0.166281,0.242352,0.0360394,42
1429613370876,91,0.216488,0.309977,0.0953031,50
1429613370917,91,0.194901,0.238449,0.1022,64
1429613370959,91,0.0572628,0.0433164,0.0405755,67
1429613371001,92,-0.0674493,-0.175456,-0.0663824,61
1429613371042,92,-0.230454,-0.339824,-0.161211,47
1429613371087,92,-0.294741,-0.405037,-0.222609,40
1429613371098,92,-0.269648,-0.38123,-0.224226,38
1429613371140,92,-0.0903509,-0.262064,-0.138187,37
1429613371181,92,0.0959504,-0.107386,-0.00430888,40
1429613371222,92,0.250313,0.0554764,0.118334,41
1429613371264,92,0.252077,0.162667,0.17135,40
1429613371305,92,0.148174,0.197735,0.138125,37
1429613371346,92,0.030451,0.17321,0.0730674,33
1429613371389,92,-0.0653196,0.130359,0.0254373,30
1429613371431,92,-0.112358,0.109804,0.0325505,27
1429613371475,92,-0.134659,0.0710455,0.0283285,34
1429613371487,92,-0.0692266,0.0454214,0.0200108,34
1429613371528,92,0.0354317,0.0349494,0.00974769,55
1429613371570,92,0.183631,0.082916,0.0304846,68
1429613371612,92,0.276195,0.166695,0.0780454,71
1429613371654,93,0.222654,0.206878,0.0974481,64
1429613371696,93,0.0737785,0.16846,0.0793829,51
1429613371742,93,-0.143111,0.0310722,0.00961412,42
1429613371754,93,-0.257861,-0.107803,-0.0363828,42
1429613371796,93,-0.289273,-0.250174,-0.109557,41
1429613371837,93,-0.185365,-0.360308,-0.181378,42
1429613371879,93,-0.0231695,-0.358042,-0.198622,42
1429613371921,93,0.0610703,-0.283687,-0.180409,40
1429613371962,93,0.0904419,-0.172267,-0.13381,37
1429613372004,93,0.0365608,-0.0722333,-0.0928548,33
1429613372045,93,-0.0194948,0.00367805,-0.0565381,29
1429613372087,93,-0.0211166,0.0864121,0.0259347,28
1429613372129,93,0.045671,0.186172,0.152796,28
1429613372170,93,0.0814135,0.248398,0.241718,37
1429613372212,93,0.106722,0.280039,0.288759,59
1429613372254,93,0.0631433,0.263635,0.247912,71
1429613372295,93,0.0368734,0.218211,0.162023,71
1429613372337,94,-0.00944984,0.147646,0.0412225,65
1429613372379,94,-0.0169692,0.0778429,-0.0366377,52
1429613372421,94,-0.0499806,-0.0397332,-0.13073,45
1429613372462,94,-0.0361751,-0.135779,-0.148137,41
1429613372504,94,-0.0768153,-0.237164,-0.159255,41
1429613372545,94,-0.0854038,-0.273696,-0.114123,41
1429613372587,94,-0.0857885,-0.259138,-0.0897055,40
1429613372629,94,-0.0698904,-0.198257,-0.0829815,36
1429613372670,94,-0.0762136,-0.14605,-0.135269,33
1429613372711,94,-0.0473428,-0.088237,-0.158207,29
1429613372753,94,0.00864393,-0.0211912,-0.119486,27
1429613372765,94,0.0434047,0.0611266,-0.0143762,26
1429613372806,94,0.0802362,0.132735,0.100636,25
1429613372848,94,0.0770415,0.184524,0.177821,25
1429613372890,94,0.0574348,0.201441,0.19554,27
1429613372931,94,0.057859,0.192649,0.173495,43
1429613372973,94,0.0819847,0.172224,0.134605,58
1429613373014,94,0.11222,0.164359,0.126623,71
1429613373056,94,0.129801,0.139188,0.111227,69
1429613373067,94,0.119846,0.0884051,0.0768231,67
1429613373109,94,0.0762836,-0.0017584,-0.0063762,59
1429613373151,94,0.0109583,-0.1025,-0.0778541,48
1429613373193,94,-0.0680261,-0.183878,-0.114873,43
1429613373235,94,-0.130671,-0.210541,-0.0716439,41
1429613373278,94,-0.184778,-0.204886,-0.031283,41
1429613373293,94,-0.21486,-0.180684,-0.0402952,41
1429613373305,94,-0.215421,-0.140191,-0.0688413,41
1429613373346,94,-0.168843,-0.0907996,-0.111705,40
1429613373389,94,-0.111745,-0.0523537,-0.158378,36
1429613373400,94,-0.0333279,-0.0108406,-0.145631,34
1429613373442,94,0.0593921,0.0254835,-0.119522,31
1429613373483,94,0.13183,0.0694199,-0.0422129,27
1429613373525,94,0.196052,0.121075,0.0511754,25
1429613373566,94,0.202114,0.163632,0.145422,24
1429613373578,94,0.145248,0.172899,0.166697,24
1429613373619,94,0.0612286,0.150141,0.147376,24
1429613373631,94,-0.0066516,0.110972,0.114855,24
1429613373672,94,-0.0257382,0.0801487,0.109893,25
1429613373713,94,0.0127814,0.0558434,0.103601,25
1429613373755,94,0.039847,0.0364799,0.0812018,27
1429613373766,94,0.0688047,0.0255808,0.0537538,32
1429613373808,94,0.0599394,0.0274532,0.0593695,45
1429613373820,94,0.0161408,0.0158036,0.0356383,54
1429613373861,94,-0.021108,0.00120977,0.0388476,68
1429613373903,94,-0.0204287,-0.0285263,0.0519458,71
1429613373915,94,-0.0249072,-0.0961517,-0.0426105,69
1429613373956,94,-0.0549924,-0.184271,-0.209763,63
1429613373969,94,-0.140305,-0.279725,-0.450126,59
1429613374011,94,-0.228282,-0.315584,-0.578459,51
1429613374032,94,-0.259259,-0.27478,-0.532334,45
1429613374073,94,-0.213939,-0.167151,-0.314869,42
1429613374100,94,-0.0825786,-0.00236706,0.100386,41
1429613374142,94,0.0496965,0.125663,0.409826,41
1429613374165,94,0.180549,0.205598,0.594015,41
1429613374206,94,0.235413,0.218572,0.577522,40
1429613374232,94,0.194096,0.167089,0.347919,37
1429613374273,94,0.117737,0.105392,0.103145,33
1429613374300,94,0.0608151,0.0662702,-0.053543,30
1429613374342,94,0.0349845,0.047543,-0.140283,27
1429613374365,94,0.0562885,0.0671047,-0.0780696,25
1429613374408,94,0.075053,0.0890805,0.000203489,24
1429613374432,94,0.0756328,0.109432,0.117947,23
1429613374474,94,0.0528881,0.114695,0.222039,23
1429613374500,94,0.016034,0.0958461,0.299901,23
1429613374541,94,-0.0526192,0.0495346,0.208865,23
1429613374564,94,-0.10943,-0.0222827,-0.0592171,23
1429613374606,94,-0.116183,-0.0861622,-0.350932,22
1429613374633,94,-0.0901395,-0.125513,-0.546781,21
1429613374674,94,-0.0337771,-0.124846,-0.511437,20
1429613374700,94,0.00777693,-0.0998147,-0.346893,25
1429613374742,94,0.0269996,-0.0676822,-0.169967,39
1429613374784,94,0.039585,-0.0301336,0.00174746,65
1429613374825,94,0.0253634,-0.00303364,0.137379,73
1429613374867,94,0.0351181,0.0116332,0.295714,69
1429613374908,94,0.0223126,-0.0342284,0.209888,61
1429613374950,94,-0.00122079,-0.0833596,0.117439,49
1429613374991,94,-0.0315585,-0.153254,-0.132228,44
1429613375034,94,-0.0771626,-0.195498,-0.352192,41
1429613375076,94,-0.0979287,-0.160576,-0.360011,41
1429613375118,94,-0.104142,-0.0821558,-0.229309,40
1429613375160,94,-0.0843743,0.0371283,0.0499424,39
1429613375201,94,-0.0324982,0.145547,0.374207,34
1429613375243,94,0.00438808,0.197381,0.520135,31
1429613375284,94,0.0136201,0.176185,0.417601,26
1429613375326,94,0.0142956,0.117429,0.198882,24
1429613375368,94,-0.00353857,0.0578117,-0.0239246,22
1429613375410,94,-0.00976073,0.0139085,-0.163551,21
1429613375451,94,0.013457,0.000458671,-0.196029,21
1429613375493,94,0.0730058,0.032986,-0.071354,21
1429613375535,94,0.127941,0.0771127,0.072479,20
1429613375576,94,0.156948,0.114863,0.228694,20
1429613375618,94,0.116039,0.0939955,0.114422,17
1429613375659,94,0.0487092,0.0453439,-0.0618823,20
1429613375701,94,0.00644525,0.00612906,-0.166931,41
1429613375742,94,0.00283636,-0.00799127,-0.081528,62
1429613375783,94,0.0406153,0.0251706,0.182345,77
1429613375826,94,0.0525978,0.0436109,0.33061,75
1429613375838,94,0.0306535,0.0228686,0.297821,72
1429613375883,94,0.00904902,-0.0394232,0.0697449,63
1429613375895,94,-0.0207574,-0.117214,-0.182104,59
1429613375936,94,-0.0557365,-0.187649,-0.397629,47
1429613375977,94,-0.112312,-0.237282,-0.53406,43
1429613376019,94,-0.181027,-0.241945,-0.540517,42
1429613376060,94,-0.207421,-0.199587,-0.415113,42
1429613376102,94,-0.152246,-0.103029,-0.151146,41
1429613376143,94,-0.0489241,0.0105723,0.166097,39
1429613376185,94,0.0399466,0.0943737,0.371609,34
1429613376231,94,0.0515569,0.124572,0.423523,30
1429613376243,94,0.0288562,0.104382,0.300362,28
1429613376284,94,-0.0336279,0.0500516,0.0787198,25
1429613376326,94,-0.0428082,0.00873268,-0.0797461,22
1429613376368,94,-0.010427,-0.00385925,-0.191768,21
1429613376409,94,0.0606959,0.0308666,-0.171317,20
1429613376452,94,0.129424,0.0988959,-0.0348105,20
1429613376494,94,0.146377,0.149686,0.0388533,20
1429613376535,94,0.122519,0.154306,0.0383288,19
1429613376578,94,0.0746574,0.114611,-0.00637146,18
1429613376620,94,0.0492652,0.0815545,0.0609923,20
1429613376661,94,0.0581226,0.0606337,0.203168,33
1429613376703,94,0.0971792,0.075949,0.430804,63
1429613376746,94,0.121854,0.0730499,0.495201,77
1429613376758,94,0.118571,0.058786,0.439943,79
1429613376799,94,0.075033,0.0184352,0.248209,77
1429613376841,94,-0.0136574,-0.0433637,-0.0306714,65
1429613376884,94,-0.123532,-0.118741,-0.318109,56
1429613376925,94,-0.221505,-0.19116,-0.517217,45
1429613376967,94,-0.260047,-0.235576,-0.565435,42
1429613377008,94,-0.247564,-0.240626,-0.480705,42
1429613377049,94,-0.161497,-0.199545,-0.282537,42
1429613377092,94,-0.0391598,-0.126998,-0.0573647,40
1429613377133,94,0.0852964,-0.0331038,0.146767,37
1429613377175,94,0.134067,0.0439737,0.230984,31
1429613377217,94,0.108308,0.0824246,0.209681,27
1429613377259,94,0.0181373,0.0745995,0.0956677,22
1429613377300,94,-0.0779091,0.0254286,-0.0725719,20
1429613377341,94,-0.142175,-0.0163964,-0.177446,18
1429613377384,94,-0.132765,-0.0115391,-0.153746,17
1429613377429,94,-0.0626243,0.0320103,-0.0462872,17
1429613377441,94,0.032386,0.0984894,0.107009,17
1429613377483,94,0.117862,0.149882,0.231511,17
1429613377524,94,0.153536,0.150441,0.229719,16
1429613377565,94,0.158827,0.116809,0.159325,17
1429613377607,94,0.140455,0.0774034,0.0791509,39
1429613377649,94,0.108547,0.0490482,0.0167687,60
1429613377660,94,0.0575298,0.0271954,-0.0299549,70
1429613377702,94,-0.0220701,0.00172867,-0.0952324,79
1429613377744,94,-0.0733606,-0.0279328,-0.131315,76
1429613377756,94,-0.0958547,-0.0597087,-0.14216,72
1429613377797,94,-0.0870529,-0.087864,-0.111257,63
1429613377839,94,-0.0635751,-0.0975584,-0.0479236,49
1429613377880,94,-0.059617,-0.10994,-0.015392,43
1429613377922,94,-0.0681873,-0.110456,0.00214434,41
1429613377963,94,-0.056517,-0.0919221,0.0203195,41
1429613378004,94,-0.0526539,-0.0768969,-0.00505571,42
1429613378046,94,-0.00901573,-0.0426245,0.0164772,40
1429613378058,94,0.0368301,-0.00445338,0.0504504,38
1429613378100,94,0.0701153,0.0333468,0.09263,34
1429613378112,94,0.0842781,0.0715173,0.158193,32
1429613378153,94,0.071195,0.0868235,0.153578,27
1429613378195,94,0.0390801,0.0701225,0.0807527,22
1429613378206,94,0.00482368,0.0417408,-0.0115249,20
1429613378247,94,-0.0387114,-0.000150503,-0.121798,18
1429613378289,94,-0.0568077,-0.0209344,-0.168802,16
1429613378300,94,-0.0680348,-0.0333307,-0.197365,16
1429613378343,94,-0.054185,-0.0162831,-0.148973,16
1429613378355,94,-0.0195556,0.0191276,-0.0619334,16
1429613378397,94,0.0399792,0.0595564,0.0372852,16
1429613378408,94,0.0843595,0.0783335,0.0856299,16
1429613378451,94,0.113362,0.087807,0.117397,16
1429613378466,94,0.117705,0.0754148,0.116839,17
1429613378507,94,0.082462,0.0540513,0.10331,37
1429613378548,94,0.0173379,0.0255319,0.0778859,58
1429613378564,94,-0.0257568,0.000695941,0.0690662,68
1429613378606,94,-0.0472007,-0.0259347,0.0479422,79
1429613378633,94,-0.0400712,-0.0585355,0.00674168,79
1429613378674,94,-0.0272429,-0.08728,-0.0367465,68
1429613378699,94,-0.0169122,-0.106869,-0.0649081,63
1429613378741,94,-0.0533999,-0.124104,-0.112372,47
1429613378764,94,-0.0933209,-0.132395,-0.163529,43
1429613378805,94,-0.140905,-0.126983,-0.211946,40
1429613378835,94,-0.156781,-0.100676,-0.220558,40
1429613378864,94,-0.112047,-0.0485626,-0.153107,40
1429613378905,94,-0.0208792,0.0236953,-0.0081758,41
1429613378933,94,0.0743987,0.0871218,0.128848,40
1429613378964,94,0.13206,0.128424,0.23402,37
1429613379005,94,0.127882,0.126377,0.230027,33
1429613379047,94,0.0967869,0.0956846,0.169365,27
1429613379089,94,0.0587706,0.0602239,0.0861795,23
1429613379135,94,0.0456869,0.0398391,0.040532,18
1429613379147,94,0.0446617,0.0387348,0.0299951,17
1429613379188,94,0.0258641,0.0383891,0.0179113,16
1429613379231,94,-0.00682517,0.0273767,-0.0154057,15
1429613379272,94,-0.030156,0.0103565,-0.0466648,16
1429613379314,94,-0.0420403,0.00188059,-0.0552616,16
1429613379359,94,-0.0444555,-0.00456195,-0.0533208,31
1429613379371,94,-0.0414192,-0.011719,-0.0530914,31
1429613379413,94,-0.0246354,-0.0172244,-0.0476024,61
1429613379454,94,-0.0129155,-0.0167026,-0.0358123,75
1429613379495,94,0.0175231,-0.0145681,-0.00813643,75
1429613379537,91,0.0352309,-0.0304015,-0.0122382,67
1429613379583,91,0.0269541,-0.0634579,-0.0427248,50
1429613379594,91,-0.0104318,-0.0996035,-0.0930687,45
1429613379637,91,-0.0674449,-0.117102,-0.121867,38
1429613379679,91,-0.102056,-0.0920804,-0.084278,37
1429613379721,91,-0.101127,-0.0383334,0.000211654,40
1429613379762,91,-0.0411907,0.0239609,0.108276,41
1429613379805,91,0.0332412,0.069361,0.175214,40
1429613379846,91,0.0895171,0.079515,0.178378,35
1429613379889,91,0.109098,0.0648044,0.122613,31
1429613379931,91,0.087598,0.0327014,0.0459902,24
1429613379972,91,0.0435097,0.00236798,-0.0295839,21
1429613380014,91,-0.0126922,-0.00939167,-0.0772742,18
1429613380056,91,-0.0627418,-0.0324166,-0.164866,17
1429613380097,91,-0.0805764,-0.0310502,-0.191552,17
1429613380139,91,-0.0581906,-0.0184775,-0.153123,18
1429613380180,91,-0.0119802,0.021508,-0.035862,33
1429613380222,91,0.0235685,0.0603714,0.0812279,52
1429613380263,91,0.0562294,0.0903877,0.172613,74
1429613380305,91,0.0733465,0.0976238,0.195992,75
1429613380347,88,0.0764372,0.0916765,0.191896,64
1429613380389,88,0.0553642,0.0596415,0.143483,52
1429613380431,88,0.00839932,0.00525413,0.0451803,37
1429613380473,88,-0.0245918,-0.043649,-0.0253429,33
1429613380515,88,-0.0671023,-0.0946085,-0.116558,37
1429613380556,88,-0.0669981,-0.115198,-0.15545,40
1429613380598,88,-0.0425981,-0.103469,-0.148043,40
1429613380640,88,-0.0118704,-0.0728555,-0.118303,38
1429613380682,88,0.000820931,-0.0387608,-0.0720252,32
1429613380727,88,-0.0142546,-0.0144955,-0.0368409,28
1429613380738,88,-0.0317679,-0.00457693,-0.0144623,26
1429613380782,88,-0.042172,-0.00626046,-0.00834399,21
1429613380793,88,-0.02398,0.00152052,0.009142,21
1429613380835,88,0.0217584,0.0203994,0.0397464,18
1429613380876,88,0.0641905,0.0416095,0.0593341,17
1429613380920,88,0.0889908,0.0657863,0.0982119,22
1429613380932,88,0.0818688,0.0814108,0.117272,29
1429613380973,88,0.0259683,0.0703263,0.080436,47
1429613381015,88,-0.0501852,0.0370951,-0.0100796,72
1429613381057,88,-0.10658,-9.77689e-05,-0.0944912,74
1429613381100,86,-0.101027,-0.0226935,-0.118806,64
1429613381112,86,-0.0544906,-0.036124,-0.0910347,58
1429613381153,86,0.0206803,-0.0384684,-0.0200154,46
1429613381195,86,0.0737065,-0.0421576,0.0309242,36
1429613381236,86,0.0745116,-0.0462551,0.0366325,31
1429613381279,86,0.0410722,-0.0459181,0.0200541,37
1429613381321,86,-0.0139047,-0.0450903,-0.0287183,40
1429613381364,86,-0.0360815,-0.0198265,-0.0157061,39
1429613381376,86,-0.0308871,0.0165098,0.0386432,39
1429613381418,86,0.00133045,0.0551146,0.110702,35
1429613381460,86,0.00789307,0.0562919,0.112077,30
1429613381504,86,0.0212565,0.0429642,0.0864763,25
1429613381516,86,0.0233281,0.0181438,0.0219976,23
1429613381557,86,0.0297645,0.00531028,-0.0188638,20
1429613381599,86,0.0292901,0.00649183,-0.0436182,18
1429613381641,86,0.0246759,0.0193328,-0.0353251,19
1429613381654,86,0.0113421,0.0272555,-0.0199455,24
1429613381695,86,-0.0237326,0.0150575,-0.0445248,40
1429613381737,86,-0.0478507,-0.0063542,-0.0758485,69
1429613381750,86,-0.0495968,-0.0175436,-0.0841202,74
1429613381792,86,-0.0162997,-0.0134466,-0.0462349,76
1429613381833,85,0.0359427,0.00354206,0.0352424,64
1429613381845,85,0.0856076,0.0207257,0.119709,64
1429613381887,85,0.108368,0.0245812,0.168571,46
1429613381900,85,0.0681635,-0.00161494,0.124213,41
1429613381942,85,-0.0015427,-0.036758,0.0182309,34
1429613381954,85,-0.0782642,-0.0738605,-0.110901,33
1429613381995,85,-0.131905,-0.0945553,-0.202779,35
1429613382037,85,-0.140943,-0.0874024,-0.2241,40
1429613382049,85,-0.12496,-0.0603897,-0.188628,41
1429613382090,85,-0.0903805,-0.0292399,-0.126709,41
1429613382102,85,-0.0301496,0.00919239,-0.0377471,40
1429613382143,85,0.0361756,0.0408972,0.0533288,37
1429613382165,85,0.0830164,0.0647751,0.129112,33
1429613382206,85,0.108103,0.0789065,0.180134,29
1429613382232,85,0.0974203,0.0775572,0.181571,26
1429613382274,85,0.0845471,0.068329,0.158152,23
1429613382300,85,0.0426513,0.0475086,0.0920925,20
1429613382341,85,0.0176059,0.0282371,0.0389258,21
1429613382365,85,-0.0141361,0.0121576,-0.00889272,33
1429613382401,85,-0.019179,0.00757383,-0.0122783,51
1429613382431,85,-0.0129562,0.0048364,-0.0111255,69
1429613382465,85,-0.00295036,0.000108805,-0.00308379,76
1429613382500,85,-0.00228954,-0.0209223,-0.0331372,73
1429613382532,84,-0.0177692,-0.0439793,-0.0708276,65
1429613382573,84,-0.0346082,-0.0703312,-0.116526,53
1429613382601,84,-0.0470337,-0.0825885,-0.131407,42
1429613382643,84,-0.0367101,-0.0694087,-0.0974412,36
1429613382665,84,-0.0182144,-0.0367007,-0.0219822,35
1429613382700,84,-0.00692455,-0.00448191,0.0315557,39
1429613382742,84,-0.014726,0.0158966,0.0499035,41
1429613382766,84,-0.0287269,0.0136624,0.0110193,41
1429613382801,84,-0.022031,0.0108612,-0.0143656,40
1429613382833,84,0.0162922,0.0153213,-0.00649155,38
1429613382864,84,0.046613,0.0260923,0.0260803,36
1429613382905,84,0.0583588,0.0398723,0.0676211,30
1429613382934,84,0.0520794,0.044499,0.0889456,27
1429613382964,84,0.0349908,0.036667,0.0736046,25
1429613383005,84,0.0197909,0.0193479,0.0253649,22
1429613383034,84,0.0118713,0.0068863,-0.0262642,27
1429613383064,84,0.0101282,0.00681501,-0.0318977,33
1429613383101,84,0.0270799,0.0198332,0.0209988,59
1429613383134,84,0.0210103,0.0171346,0.0525891,72
1429613383164,84,0.00784704,0.00113064,0.0544633,74
1429613383205,83,-0.0283101,-0.0326906,-0.00428843,68
1429613383247,83,-0.0610542,-0.0689216,-0.083922,58
1429613383288,83,-0.0925569,-0.0912624,-0.153438,42
1429613383331,83,-0.0810007,-0.0792076,-0.147244,37
1429613383375,83,-0.05724,-0.0404443,-0.0737129,37
1429613383388,83,-0.0145668,0.0149219,0.0451513,39
1429613383430,83,0.00971487,0.0481359,0.107595,41
1429613383472,83,0.0221431,0.0532689,0.10189,41
1429613383513,83,0.0337514,0.0417717,0.0664421,39
1429613383555,83,0.0337674,0.0303342,0.0346564,34
1429613383600,83,0.0315706,0.0252347,0.015525,28
1429613383611,83,0.0351293,0.0329722,0.0241798,28
1429613383654,83,0.0369679,0.0434461,0.0364853,23
1429613383695,83,0.0381888,0.0432495,0.0377234,22
1429613383737,83,0.0280813,0.0268867,0.0124471,34
1429613383779,83,0.0219625,0.00704139,-0.00721449,51
1429613383791,83,0.0293953,0.0036153,0.0133692,60
1429613383832,83,0.0349856,0.00174618,0.0240863,72
1429613383874,83,0.0179379,-0.00778262,0.00738984,71
1429613383917,83,-0.0223376,-0.0313307,-0.0463163,58
1429613383958,83,-0.0657562,-0.0618466,-0.10515,47
1429613384000,83,-0.10987,-0.0930708,-0.16604,40
1429613384042,83,-0.123957,-0.103009,-0.178827,37
1429613384084,83,-0.109759,-0.0935379,-0.155725,41
1429613384125,83,-0.0726322,-0.0628951,-0.0992208,42
1429613384167,83,-0.0198223,-0.0199246,-0.010899,41
1429613384208,83,0.0231261,0.0203505,0.072162,37
1429613384250,83,0.0622091,0.0453566,0.127284,33
1429613384292,83,0.0835658,0.0550435,0.148131,28
1429613384334,83,0.0781495,0.0500866,0.113541,24
1429613384376,83,0.0469124,0.0323196,0.0292331,22
1429613384418,83,0.0319223,0.0255729,-0.0398863,32
1429613384459,83,0.00877006,0.0247321,-0.0815683,47
1429613384501,83,0.0177228,0.0415863,-0.0473383,64
1429613384542,83,0.0399457,0.0714444,0.055115,72
1429613384584,82,0.0786403,0.0969615,0.1816,67
1429613384625,82,0.0814241,0.0964037,0.251739,52
1429613384667,82,0.0609658,0.0622466,0.230063,42
1429613384708,82,0.00250853,-0.0114288,0.0859458,37
1429613384750,82,-0.0668649,-0.084443,-0.0885516,38
1429613384792,82,-0.114095,-0.126153,-0.202981,41
1429613384834,82,-0.114133,-0.113426,-0.19812,42
1429613384876,82,-0.0903446,-0.0742667,-0.135302,40
1429613384919,82,-0.0544785,-0.0302001,-0.0641787,35
1429613384961,82,-0.0460254,-0.00575537,-0.00683477,32
1429613385002,82,-0.0476022,0.000611285,0.0126323,28
1429613385044,82,-0.0363589,0.00560912,0.0402528,26
1429613385086,82,-0.0114527,0.0107861,0.0268746,33
1429613385127,82,0.038133,0.0176165,-0.000107743,47
1429613385169,82,0.0791428,0.0216386,-0.0356166,63
1429613385210,82,0.100038,0.0276525,-0.0526758,73
1429613385252,82,0.0633029,0.0167252,-0.0727753,70
1429613385294,82,0.0184197,0.0118346,-0.0547323,57
1429613385337,82,-0.0221639,-0.00304756,-0.0317786,44
1429613385350,82,-0.0248371,-0.0160911,-0.00562278,44
1429613385392,82,-0.00813649,-0.0286546,0.0103961,43
1429613385532,82,0.0275081,-0.0265701,0.0241175,43
1429613385574,82,0.0314371,-0.0302591,-0.0133725,39
1429613385615,82,0.00565154,-0.0129198,-0.0329573,36
1429613385657,82,-0.0395919,-0.00641635,-0.0636063,32
1429613385669,82,-0.0406995,0.0230469,0.0382193,32
1429613385710,82,-0.00702177,0.0275611,0.124533,29
1429613385753,82,0.0789766,0.0405147,0.217841,32
1429613385764,82,0.151047,0.0518455,0.243811,37
1429613385806,82,0.170199,0.0677558,0.208317,57
1429613385818,82,0.104858,0.0734895,0.106008,57
1429613385859,82,0.0176316,0.0746081,0.0369168,72
1429613385901,82,-0.0824337,0.0507115,-0.0209333,72
1429613385942,85,-0.172388,-0.00587577,-0.0767758,62
1429613385984,85,-0.210375,-0.0631616,-0.113768,54
1429613385995,85,-0.199106,-0.106207,-0.120944,50
1429613386037,85,-0.122958,-0.122371,-0.119156,44
1429613386078,85,-0.0554645,-0.113847,-0.129424,43
1429613386090,85,0.0198483,-0.0897945,-0.148373,44
1429613386132,85,0.0484248,-0.0683078,-0.196254,44
1429613386143,85,0.0659792,-0.0497699,-0.23961,44
1429613386184,85,0.0603604,-0.0321693,-0.240037,43
1429613386226,85,0.0296216,-0.00859872,-0.18095,39
1429613386237,85,0.0290221,0.0305465,-0.0453758,39
1429613386279,85,0.0343044,0.0776179,0.134535,35
1429613386291,85,0.0457217,0.12069,0.258828,33
1429613386332,85,0.0612314,0.143869,0.317673,31
1429613386374,85,0.0697122,0.135216,0.284143,29
1429613386386,85,0.0830649,0.106487,0.219292,29
1429613386428,85,0.0879177,0.0786873,0.170716,28
1429613386439,85,0.0672945,0.0526963,0.113712,30
1429613386480,85,0.0274995,0.0277745,0.0468348,40
1429613386501,85,-0.0311763,0.00181513,-0.029844,46
1429613386542,85,-0.0710573,-0.0184898,-0.0556169,67
1429613386565,85,-0.10151,-0.0409676,-0.0546837,71
1429613386600,85,-0.10383,-0.0760142,-0.0456954,73
1429613386632,85,-0.106025,-0.128309,-0.103126,68
1429613386665,85,-0.0889661,-0.154864,-0.121994,61
1429613386700,85,-0.0840901,-0.170314,-0.174473,54
1429613386742,85,-0.0417223,-0.136426,-0.149694,45
1429613386764,85,0.0153861,-0.077128,-0.086031,44
1429613386807,85,0.081145,-0.0132532,0.00481066,43
1429613386833,85,0.0815193,0.0329661,0.0384414,43
1429613386874,85,0.0138057,0.0360273,-0.0526931,42
1429613386899,85,-0.0752393,0.0245765,-0.161323,41
1429613386942,85,-0.125254,0.0205155,-0.202285,37
1429613386964,85,-0.0855992,0.0474598,-0.100478,35
1429613387005,85,0.0603922,0.117667,0.181221,32
1429613387033,85,0.198672,0.180589,0.428545,29
1429613387064,85,0.309537,0.21415,0.569869,27
1429613387106,85,0.295826,0.196715,0.531702,26
1429613387135,85,0.185179,0.12844,0.315138,25
1429613387164,85,0.0493395,0.0626605,0.103193,25
1429613387205,85,-0.0467601,0.0105914,-0.0523512,26
1429613387232,85,-0.08834,-0.00760986,-0.119889,25
1429613387264,85,-0.058651,-0.0081143,-0.128324,28
1429613387305,85,-0.0467213,-0.0297963,-0.199211,38
1429613387334,85,-0.0682761,-0.0815705,-0.340357,53
1429613387364,85,-0.124724,-0.143937,-0.506844,67
1429613387405,85,-0.157613,-0.184568,-0.534339,72
1429613387432,85,-0.199367,-0.209892,-0.509276,70
1429613387474,85,-0.206824,-0.201144,-0.351388,61
1429613387515,85,-0.199036,-0.171709,-0.143825,54
1429613387557,85,-0.159791,-0.114987,0.0960584,45
1429613387598,85,-0.0870895,-0.0452361,0.312386,42
1429613387640,85,0.00297331,0.00556178,0.355599,42
1429613387684,85,0.101655,0.0433127,0.306757,41
1429613387695,85,0.188405,0.0380141,0.104319,40
1429613387737,85,0.23364,0.0330372,-0.0376213,39
1429613387778,85,0.252049,0.0594218,-0.0266785,34
1429613387820,85,0.206654,0.116607,0.138951,31
1429613387862,85,0.139656,0.183187,0.318461,27
1429613387903,85,0.0574743,0.220713,0.37432,26
1429613387945,85,0.000532797,0.199365,0.291249,24
1429613387986,85,-0.00801309,0.155238,0.208258,24
1429613388027,85,0.00889736,0.0956455,0.128397,24
1429613388069,85,0.029731,0.0443239,0.0913599,23
1429613388110,85,0.0121512,-0.00654067,-0.00350077,23
1429613388152,85,-0.0242123,-0.0433745,-0.148133,22
1429613388194,85,-0.0618914,-0.0649667,-0.305911,20
1429613388237,85,-0.128877,-0.102553,-0.506437,25
1429613388278,85,-0.174089,-0.12543,-0.579334,47
1429613388320,85,-0.163278,-0.108557,-0.45306,65
1429613388361,85,-0.0928297,-0.0607906,-0.139831,74
1429613388403,85,-0.0249412,0.00242465,0.181672,71
1429613388444,85,0.0672483,0.0532126,0.450915,60
1429613388487,85,0.105252,0.0498437,0.548356,53
1429613388529,85,0.0963353,-0.0110094,0.462059,45
1429613388570,85,0.0137464,-0.123799,0.136006,43
1429613388612,85,-0.0748957,-0.216452,-0.232853,42
1429613388654,85,-0.131051,-0.247041,-0.526236,41
1429613388695,85,-0.113715,-0.182959,-0.58242,39
1429613388737,85,-0.0386471,-0.0647369,-0.378138,35
1429613388779,85,0.0246564,0.0381678,-0.159842,30
1429613388821,85,0.0348081,0.0911796,0.0378477,27
1429613388862,85,0.00471644,0.0951355,0.11438,24
1429613388904,85,-0.0223188,0.0825762,0.14761,23
1429613388945,85,-0.0142762,0.0852079,0.232655,23
1429613388987,85,0.0382983,0.114483,0.350784,23
1429613389029,85,0.0863844,0.15151,0.440589,22
1429613389070,85,0.0977296,0.177776,0.412236,21
1429613389112,85,0.0852433,0.165799,0.236881,20
1429613389154,85,0.0873542,0.137542,0.0481303,19
1429613389195,85,0.0896173,0.0760872,-0.166088,19
1429613389237,85,0.0797885,0.0143989,-0.248483,28
1429613389279,85,0.048462,-0.0440684,-0.237574,55
1429613389321,85,0.014222,-0.0801571,-0.152677,71
1429613389362,85,-0.0261544,-0.0991609,-0.107674,75
1429613389408,85,-0.047904,-0.086182,-0.110892,70
1429613389420,85,-0.0790518,-0.0715317,-0.162195,66
1429613389461,85,-0.0815277,-0.0533763,-0.159512,54
1429613389503,85,-0.0735681,-0.0426697,-0.0555591,47
1429613389544,85,-0.0826455,-0.0752987,0.0166186,44
1429613389586,85,-0.133267,-0.126217,0.0219224,42
1429613389627,85,-0.157757,-0.172803,-0.0381786,42
