[Header]
File Type: 1
Version: 1
Channels exported: 13
Samples per channel: 1000
Start time: 15:40:45
End time: 15:40:46
Ch. Info. Pointer: 320
Stamp Data: T
Mux format: 0
Mux Block Size: 
Data Format 1
Sample Rate: 1000Hz
Channel #:   1
Label: I
Range: 5mv 
Low: .1Hz
High: 25Hz
Sample rate: 1000Hz
Color: FFFFFF
Scale: -7
Channel #:   2
Label: II
Range: 5mv 
Low: .1Hz
High: 25Hz
Sample rate: 1000Hz
Color: FFFFFF
Scale: -7
Channel #:   3
Label: III
Range: 5mv 
Low: .1Hz
High: 25Hz
Sample rate: 1000Hz
Color: FFFFFF
Scale: -7
Channel #:   4
Label: aVR
Range: 5mv 
Low: .1Hz
High: 25Hz
Sample rate: 1000Hz
Color: FFFFFF
Scale: -7
Channel #:   5
Label: aVL
Range: 5mv 
Low: .1Hz
High: 25Hz
Sample rate: 1000Hz
Color: FFFFFF
Scale: -7
Channel #:   6
Label: aVF
Range: 5mv 
Low: .1Hz
High: 25Hz
Sample rate: 1000Hz
Color: FFFFFF
Scale: -7
Channel #:   7
Label: V1
Range: 5mv 
Low: .1Hz
High: 25Hz
Sample rate: 1000Hz
Color: FFFFFF
Scale: -7
Channel #:   8
Label: V2
Range: 5mv 
Low: .1Hz
High: 25Hz
Sample rate: 1000Hz
Color: FFFFFF
Scale: -7
Channel #:   9
Label: V3
Range: 5mv 
Low: .1Hz
High: 25Hz
Sample rate: 1000Hz
Color: FFFFFF
Scale: -7
Channel #:  10
Label: V4
Range: 5mv 
Low: .1Hz
High: 25Hz
Sample rate: 1000Hz
Color: FFFFFF
Scale: -7
Channel #:  11
Label: V5
Range: 5mv 
Low: .1Hz
High: 25Hz
Sample rate: 1000Hz
Color: FFFFFF
Scale: -7
Channel #:  12
Label: V6
Range: 5mv 
Low: .1Hz
High: 25Hz
Sample rate: 1000Hz
Color: FFFFFF
Scale: -7
Channel #:  13
Label: 7/8
Range: 1mv 
Low: 30Hz
High: 250Hz
Sample rate: 1000Hz
Color: FFFFFF
Scale: -6

[Data]
176,368,176,-288,0,272,544,1856,1120,928,560,416,192
192,384,192,-304,0,288,544,1888,1136,944,592,448,32
208,400,192,-320,0,304,544,1920,1168,960,608,464,160
208,432,208,-336,0,320,544,1936,1184,992,624,480,16
224,448,224,-352,0,336,544,1968,1200,1008,640,496,256
224,464,224,-368,0,352,528,1984,1216,1024,656,512,224
224,480,224,-368,0,352,528,2016,1232,1040,672,528,128
240,512,240,-400,0,384,528,2048,1248,1056,688,544,176
256,528,256,-416,0,400,528,2080,1280,1088,720,560,320
272,560,272,-448,0,416,544,2112,1296,1120,736,592,64
288,576,272,-464,0,432,544,2144,1312,1136,768,608,176
304,592,272,-464,0,432,544,2176,1344,1168,784,624,320
304,608,288,-480,0,448,528,2192,1360,1168,800,624,128
304,624,288,-480,0,464,528,2224,1376,1200,816,640,32
320,640,304,-496,0,464,528,2240,1392,1216,848,672,224
320,656,320,-512,0,480,512,2272,1408,1232,864,688,112
352,688,336,-544,0,512,512,2288,1424,1248,880,704,160
352,720,336,-560,0,528,512,2320,1440,1280,912,720,256
368,736,352,-576,0,544,496,2352,1456,1296,928,736,112
384,768,368,-592,0,560,496,2384,1472,1312,944,752,160
384,784,384,-608,0,592,496,2416,1504,1344,976,768,16
400,816,400,-624,0,608,496,2432,1520,1360,992,800,240
400,832,416,-640,0,624,496,2464,1536,1392,1024,816,240
416,864,416,-656,0,640,480,2480,1552,1408,1040,832,32
432,880,432,-672,0,656,480,2512,1568,1424,1056,848,160
448,896,448,-688,0,672,464,2528,1584,1440,1072,864,128
448,912,448,-704,0,688,464,2560,1600,1456,1104,880,208
464,928,448,-704,0,688,464,2576,1616,1472,1120,896,192
448,944,464,-720,-16,704,464,2592,1632,1504,1136,912,144
464,960,480,-736,-16,720,464,2624,1648,1520,1168,944,208
480,992,496,-752,-16,752,448,2640,1664,1536,1184,960,160
496,1024,512,-784,0,768,464,2656,1680,1552,1200,976,128
512,1056,512,-800,0,784,448,2672,1680,1568,1216,992,-112
512,1056,528,-800,-16,800,432,2688,1696,1584,1232,1008,32
512,1072,544,-816,-16,816,432,2704,1712,1600,1264,1024,336
512,1088,560,-816,-32,832,432,2736,1728,1616,1280,1040,256
528,1120,576,-832,-32,848,432,2752,1744,1632,1296,1072,96
528,1120,576,-848,-32,864,432,2752,1744,1648,1312,1088,128
528,1136,576,-848,-32,864,416,2768,1760,1664,1328,1104,144
528,1136,592,-848,-32,864,416,2784,1760,1680,1344,1104,16
544,1168,592,-864,-32,880,416,2800,1776,1696,1376,1120,64
576,1168,592,-880,-16,880,416,2816,1792,1712,1392,1136,80
592,1200,592,-912,-16,896,416,2832,1792,1728,1408,1168,144
592,1216,608,-928,-16,912,416,2848,1808,1744,1424,1184,112
592,1232,624,-928,-16,928,400,2848,1808,1760,1424,1200,48
608,1248,624,-928,-16,944,384,2848,1824,1760,1440,1216,-160
608,1264,640,-944,-16,960,384,2864,1824,1776,1456,1232,32
592,1264,640,-944,-32,960,384,2880,1824,1776,1472,1232,144
608,1264,640,-944,-32,960,384,2880,1840,1792,1488,1248,112
608,1280,656,-960,-32,976,368,2880,1840,1808,1504,1280,160
624,1296,656,-976,-16,976,368,2896,1856,1824,1520,1296,96
640,1312,656,-992,-16,976,368,2896,1856,1840,1536,1312,-32
656,1328,656,-1008,0,992,368,2912,1856,1840,1552,1328,112
672,1344,672,-1024,0,1008,352,2912,1872,1872,1568,1344,-64
672,1344,672,-1024,0,1008,352,2912,1872,1872,1568,1360,32
672,1360,672,-1024,0,1024,336,2912,1872,1888,1584,1360,80
672,1376,672,-1040,0,1024,320,2912,1888,1888,1584,1376,32
688,1392,688,-1056,0,1040,320,2912,1888,1904,1600,1392,-16
688,1392,688,-1056,-16,1040,320,2912,1888,1904,1616,1408,160
688,1408,704,-1056,0,1056,304,2912,1888,1920,1616,1408,128
704,1424,704,-1072,0,1056,304,2912,1904,1920,1632,1424,64
704,1424,704,-1072,0,1072,288,2896,1888,1920,1632,1424,-176
704,1424,704,-1072,-16,1072,272,2896,1904,1936,1648,1440,-224
704,1424,720,-1072,-16,1072,272,2896,1904,1952,1648,1440,48
704,1440,720,-1088,0,1072,272,2880,1904,1952,1648,1456,80
704,1440,720,-1088,0,1072,256,2864,1904,1952,1648,1456,-128
704,1440,720,-1088,0,1072,256,2864,1904,1952,1664,1456,-32
720,1456,720,-1104,0,1088,256,2848,1904,1952,1664,1456,0
720,1456,720,-1104,0,1088,256,2832,1904,1952,1664,1472,256
720,1456,704,-1104,0,1088,240,2816,1888,1952,1664,1456,-192
720,1440,704,-1104,0,1072,240,2800,1888,1952,1664,1456,-96
720,1440,704,-1104,0,1072,240,2800,1888,1952,1664,1456,64
720,1440,704,-1088,0,1072,240,2768,1872,1936,1664,1456,-64
720,1440,704,-1104,0,1072,240,2752,1872,1936,1648,1456,-32
720,1424,704,-1088,0,1072,240,2720,1872,1920,1648,1440,-176
704,1408,688,-1072,0,1056,240,2688,1872,1920,1632,1440,32
688,1408,688,-1072,0,1056,224,2656,1856,1904,1616,1424,-128
704,1392,688,-1072,0,1040,240,2624,1840,1888,1616,1424,-96
704,1376,656,-1056,16,1024,240,2608,1824,1872,1600,1408,-160
704,1360,656,-1056,16,1008,240,2576,1808,1856,1584,1392,-64
688,1344,640,-1040,16,992,240,2544,1808,1840,1584,1376,-160
688,1328,624,-1024,32,976,240,2512,1792,1824,1568,1360,-176
672,1312,624,-1008,16,960,256,2464,1792,1808,1552,1344,-128
656,1280,608,-992,32,944,256,2432,1776,1792,1520,1328,-96
656,1264,592,-976,32,928,272,2384,1760,1760,1504,1312,-144
640,1248,592,-960,16,912,256,2336,1728,1728,1472,1280,-144
624,1216,576,-944,16,896,256,2288,1712,1712,1456,1264,-256
624,1200,560,-928,32,880,272,2240,1696,1680,1424,1232,-352
608,1168,544,-912,32,864,272,2192,1680,1664,1408,1216,112
592,1136,528,-880,32,832,272,2144,1648,1632,1376,1184,32
576,1104,512,-864,32,816,288,2096,1632,1600,1344,1152,-64
560,1072,496,-848,32,800,288,2032,1616,1568,1312,1120,-272
528,1040,480,-800,16,768,288,1984,1584,1536,1280,1088,-80
512,992,464,-768,16,736,288,1920,1552,1504,1248,1056,-80
496,960,448,-752,16,704,288,1872,1536,1472,1200,1024,-128
480,944,432,-736,16,688,288,1824,1504,1440,1168,992,-176
464,896,416,-704,16,656,288,1760,1472,1408,1136,960,48
448,864,416,-672,16,640,288,1696,1440,1376,1088,928,-64
416,832,400,-656,16,624,288,1632,1408,1328,1056,880,-16
400,800,384,-624,16,592,288,1584,1392,1296,1024,848,-128
384,768,368,-592,0,576,304,1536,1360,1264,976,816,-96
352,736,352,-560,0,544,304,1472,1328,1232,944,784,-176
336,688,336,-528,0,512,304,1424,1312,1200,912,752,-192
320,656,336,-512,-16,496,304,1360,1280,1168,880,720,16
288,624,320,-480,-16,464,288,1296,1232,1120,832,672,-128
272,576,288,-448,-16,432,288,1248,1200,1088,800,640,-96
256,544,272,-416,-16,400,304,1200,1168,1056,752,608,16
240,496,256,-384,-16,384,304,1136,1152,1024,720,576,192
224,464,240,-368,-16,352,304,1088,1120,992,688,544,-256
208,448,224,-336,-16,336,304,1040,1088,944,656,512,-256
176,416,208,-320,-16,320,304,992,1056,912,624,480,96
160,384,192,-288,-16,288,304,944,1024,880,592,448,-112
160,352,176,-272,-16,272,304,896,992,848,560,416,-16
144,320,160,-240,-16,240,304,864,976,816,528,384,-80
112,272,144,-224,-16,208,304,816,944,784,496,368,-32
96,256,128,-192,-16,192,320,784,912,768,464,336,-16
96,224,112,-176,-16,160,304,720,880,720,432,304,32
64,176,96,-144,-16,128,304,688,848,688,400,272,-32
48,144,80,-112,-16,112,304,640,816,656,368,256,-96
48,112,48,-96,-16,80,304,608,784,624,352,224,-32
32,80,16,-80,0,48,320,576,768,608,320,208,-32
32,48,0,-64,0,32,320,544,736,576,304,192,-144
16,16,0,-32,0,0,336,512,720,560,272,160,272
0,-16,-16,-16,0,-16,336,464,688,528,256,144,-80
-16,-32,-32,0,0,-32,320,432,656,496,224,112,-48
-16,-48,-48,16,0,-48,320,400,640,464,192,96,96
-32,-80,-64,32,16,-80,336,368,624,432,176,80,-80
-48,-112,-80,64,0,-96,336,336,592,416,144,64,-256
-64,-128,-80,80,0,-112,336,304,576,384,128,48,-128
-80,-160,-96,96,0,-128,336,288,544,368,112,32,192
-96,-192,-112,128,0,-160,336,240,512,336,96,0,208
-96,-208,-128,144,0,-176,336,224,496,320,64,-16,-96
-96,-224,-144,144,16,-192,336,192,480,288,48,-32,48
-112,-256,-160,160,16,-208,336,176,448,272,32,-48,128
-128,-288,-160,192,0,-224,320,144,432,240,0,-80,-128
-144,-320,-176,224,16,-256,320,112,400,208,-32,-96,-144
-144,-336,-192,224,16,-272,320,80,384,192,-48,-112,-80
-144,-352,-208,240,16,-272,320,64,352,160,-64,-128,112
-160,-368,-208,256,16,-288,304,32,336,144,-96,-144,48
-176,-368,-192,256,0,-288,320,16,320,128,-96,-160,-112
-192,-384,-208,272,0,-304,304,0,304,112,-112,-176,64
-192,-400,-208,288,0,-304,320,0,304,112,-112,-176,128
-192,-400,-224,272,16,-304,320,-16,304,96,-128,-192,-96
-192,-416,-240,288,16,-320,320,-32,288,80,-144,-192,48
-176,-416,-240,288,16,-320,304,-48,272,64,-160,-208,0
-176,-416,-240,288,32,-336,304,-64,256,48,-176,-224,-16
-176,-432,-256,304,32,-352,304,-80,240,32,-176,-224,112
-208,-464,-272,320,16,-368,304,-80,240,16,-192,-240,112
-208,-480,-256,336,16,-368,304,-96,224,16,-192,-240,112
-208,-480,-272,336,16,-384,320,-96,224,0,-208,-256,64
-224,-480,-272,336,16,-384,320,-112,208,0,-208,-256,80
-208,-480,-272,336,16,-384,304,-128,192,-16,-224,-272,-144
-208,-496,-272,336,32,-384,320,-128,192,-16,-224,-272,160
-224,-496,-272,336,16,-384,320,-128,192,-32,-224,-272,192
-224,-496,-272,352,16,-384,320,-128,192,-32,-240,-288,128
-240,-512,-288,352,16,-400,320,-160,176,-48,-256,-288,-176
-240,-528,-288,368,16,-400,320,-160,160,-48,-256,-304,272
-256,-528,-288,384,16,-416,320,-160,160,-64,-256,-304,112
-256,-544,-304,384,16,-416,320,-176,144,-64,-272,-304,48
-240,-544,-304,384,32,-432,320,-176,144,-64,-272,-320,-16
-240,-544,-320,384,32,-432,320,-192,144,-80,-288,-320,-32
-240,-560,-320,384,32,-448,320,-192,144,-80,-288,-336,144
-256,-576,-320,400,16,-448,320,-192,128,-80,-288,-336,192
-272,-576,-304,416,16,-448,320,-208,128,-96,-304,-336,112
-272,-576,-304,416,16,-448,320,-224,112,-112,-304,-352,48
-272,-592,-320,416,16,-448,320,-224,112,-112,-304,-352,0
-288,-592,-304,416,0,-448,320,-224,112,-112,-320,-352,112
-288,-608,-320,432,0,-464,320,-224,112,-112,-320,-352,48
-288,-592,-320,432,16,-464,320,-224,112,-112,-320,-352,368
-272,-592,-320,416,16,-464,320,-224,96,-112,-320,-352,-192
-288,-608,-320,432,16,-464,320,-240,96,-128,-320,-368,48
-304,-608,-320,432,16,-464,304,-240,96,-128,-336,-368,48
-304,-624,-320,448,0,-480,320,-256,96,-144,-336,-384,32
-304,-624,-336,448,16,-480,304,-256,80,-144,-336,-384,48
-288,-624,-336,448,16,-480,320,-256,96,-144,-336,-384,112
-288,-624,-336,448,16,-480,304,-256,80,-144,-352,-384,160
-288,-624,-336,432,16,-480,304,-256,80,-144,-336,-384,96
-272,-624,-336,432,32,-480,304,-256,80,-160,-336,-384,128
-272,-624,-336,432,32,-480,304,-256,80,-160,-352,-384,-32
-288,-624,-336,432,16,-480,304,-256,80,-160,-352,-400,240
-288,-624,-336,448,16,-480,304,-272,64,-160,-352,-400,224
-288,-624,-336,448,16,-480,304,-256,64,-160,-352,-400,-112
-272,-624,-352,432,32,-480,304,-256,64,-160,-336,-400,192
-272,-624,-352,432,32,-480,304,-272,64,-160,-352,-400,0
-272,-608,-352,432,32,-480,304,-272,64,-176,-352,-400,0
-256,-608,-368,416,48,-496,304,-272,64,-176,-352,-400,-16
-256,-624,-368,432,48,-496,304,-272,64,-176,-352,-400,32
-240,-608,-368,416,48,-496,304,-272,64,-160,-352,-400,240
-240,-608,-368,416,48,-496,304,-272,64,-160,-352,-400,96
-256,-624,-368,432,48,-496,304,-272,48,-160,-352,-400,16
-256,-624,-352,432,32,-496,304,-272,64,-160,-336,-400,224
-272,-624,-352,448,32,-496,304,-272,48,-160,-336,-416,176
-272,-624,-352,448,32,-496,304,-272,48,-160,-336,-416,128
-272,-624,-352,432,32,-496,304,-272,48,-160,-336,-400,0
-272,-624,-352,432,32,-496,304,-272,48,-160,-336,-416,-48
-256,-624,-368,432,32,-496,288,-272,48,-176,-352,-416,96
-256,-624,-352,432,32,-496,288,-288,32,-176,-352,-416,112
-272,-640,-368,448,32,-496,288,-288,32,-176,-352,-416,-32
-288,-656,-368,464,32,-512,288,-288,32,-176,-352,-416,224
-288,-640,-352,464,16,-512,288,-272,32,-176,-336,-416,208
-288,-656,-368,464,16,-512,288,-272,32,-176,-336,-416,144
-304,-656,-368,464,16,-512,288,-272,32,-176,-336,-416,32
-304,-656,-368,480,16,-512,288,-272,32,-176,-336,-416,-64
-320,-672,-368,480,16,-512,272,-272,16,-176,-336,-416,-64
-304,-672,-368,480,16,-512,272,-272,16,-192,-336,-416,0
-304,-656,-352,464,16,-512,272,-272,16,-192,-336,-416,240
-288,-640,-352,448,16,-496,288,-272,16,-192,-336,-400,112
-288,-640,-352,448,16,-496,272,-272,16,-192,-336,-400,112
-304,-640,-352,464,16,-496,272,-272,0,-192,-336,-400,112
-304,-656,-352,464,16,-512,272,-272,0,-192,-336,-400,112
-304,-656,-368,464,16,-512,272,-272,0,-192,-320,-400,0
-304,-656,-352,464,16,-512,272,-272,0,-192,-336,-400,-96
-288,-640,-368,448,32,-512,272,-256,0,-192,-320,-400,64
-288,-656,-368,464,32,-512,272,-256,-16,-192,-320,-400,-80
-288,-656,-368,448,32,-512,272,-272,-16,-192,-320,-400,256
-288,-640,-368,448,32,-512,256,-272,-16,-208,-336,-416,64
-288,-656,-368,448,32,-512,272,-272,-16,-208,-320,-400,48
-304,-656,-352,464,16,-512,256,-272,-16,-208,-336,-416,-32
-304,-656,-352,464,16,-496,256,-272,-32,-208,-336,-416,160
-320,-656,-352,464,0,-496,256,-272,-32,-208,-336,-416,144
-320,-656,-352,464,16,-512,256,-272,-32,-208,-336,-416,-32
-304,-656,-352,448,16,-512,256,-256,-32,-208,-320,-416,0
-304,-656,-352,464,16,-512,256,-272,-32,-208,-336,-416,128
-320,-656,-352,464,0,-512,256,-272,-48,-224,-336,-416,48
-320,-672,-352,480,0,-512,240,-288,-48,-224,-352,-432,32
-336,-672,-352,480,0,-512,240,-272,-48,-224,-352,-432,128
-320,-672,-368,480,0,-528,240,-272,-48,-224,-352,-432,-80
-320,-672,-368,480,16,-512,256,-272,-48,-224,-352,-432,-16
-304,-672,-368,464,16,-512,240,-272,-48,-224,-352,-432,-16
-304,-656,-368,448,32,-512,256,-272,-48,-224,-352,-432,48
-304,-656,-368,464,16,-512,256,-256,-48,-224,-352,-432,0
-304,-656,-352,464,16,-512,256,-256,-48,-240,-352,-448,-176
-320,-656,-352,464,0,-496,256,-256,-48,-224,-368,-448,80
-320,-656,-336,464,0,-496,256,-256,-64,-240,-368,-448,64
-336,-656,-336,480,0,-496,240,-256,-64,-240,-368,-448,-96
-320,-640,-336,464,0,-496,240,-256,-64,-240,-368,-448,-96
-304,-624,-336,448,16,-480,256,-240,-64,-240,-368,-448,-64
-288,-624,-336,432,16,-480,256,-240,-64,-240,-368,-448,144
-288,-608,-336,432,16,-480,256,-224,-64,-240,-368,-448,176
-272,-608,-336,416,16,-480,256,-224,-64,-224,-368,-448,240
-272,-608,-352,416,32,-480,256,-224,-48,-224,-368,-448,-176
-272,-592,-336,416,32,-464,256,-208,-48,-224,-368,-448,-112
-272,-592,-320,400,16,-448,272,-208,-48,-224,-368,-448,96
-272,-576,-320,400,16,-448,256,-208,-48,-224,-368,-448,176
-272,-576,-304,400,0,-432,256,-208,-48,-224,-368,-448,-128
-272,-560,-304,400,0,-432,256,-192,-48,-224,-368,-448,16
-272,-576,-304,400,0,-432,256,-192,-48,-224,-368,-448,48
-272,-560,-288,400,0,-416,256,-192,-64,-224,-368,-448,-32
-272,-560,-288,400,0,-416,256,-192,-64,-224,-368,-448,176
-272,-560,-288,400,0,-416,256,-192,-48,-208,-368,-448,-96
-272,-544,-288,384,0,-416,256,-176,-48,-208,-368,-448,16
-256,-544,-288,384,0,-416,256,-176,-48,-208,-368,-448,-128
-256,-560,-288,400,0,-416,256,-160,-48,-208,-368,-448,-48
-272,-560,-288,400,0,-416,240,-176,-64,-224,-368,-448,0
-288,-560,-272,400,-16,-416,256,-176,-64,-224,-384,-448,272
-288,-560,-272,400,-16,-416,240,-176,-64,-224,-384,-448,-96
-288,-544,-272,400,-16,-416,256,-176,-64,-224,-384,-448,144
-272,-544,-272,400,-16,-400,256,-176,-64,-224,-384,-448,-144
-272,-544,-272,400,-16,-416,256,-160,-48,-208,-368,-448,32
-272,-544,-272,400,-16,-400,256,-160,-48,-224,-384,-448,112
-288,-544,-272,400,-16,-400,256,-160,-48,-224,-384,-448,64
-288,-544,-272,400,-16,-416,256,-160,-48,-208,-384,-432,-128
-288,-544,-272,400,-16,-400,256,-144,-48,-208,-384,-432,96
-288,-544,-272,400,-16,-400,256,-144,-48,-224,-384,-448,32
-288,-544,-272,400,-16,-416,256,-144,-48,-224,-384,-448,-64
-288,-544,-272,400,-16,-400,256,-144,-48,-224,-384,-448,-224
-288,-544,-272,400,-16,-416,256,-144,-48,-224,-384,-448,160
-288,-560,-272,416,-16,-416,256,-144,-32,-224,-384,-448,144
-288,-560,-272,416,-16,-416,272,-144,-32,-208,-384,-448,64
-288,-560,-272,416,-16,-432,272,-128,-32,-208,-384,-432,-112
-304,-576,-288,416,-16,-432,272,-128,-16,-208,-384,-432,128
-304,-560,-272,416,-16,-416,272,-128,-32,-208,-384,-448,16
-288,-560,-272,416,-16,-416,272,-128,-16,-208,-384,-432,96
-288,-560,-272,400,-16,-416,272,-128,-16,-192,-384,-432,-80
-288,-560,-272,400,-16,-416,288,-128,-16,-192,-384,-432,-16
-288,-560,-272,416,-16,-416,272,-128,-16,-208,-400,-432,96
-288,-560,-272,416,-16,-416,288,-128,-16,-192,-384,-432,-160
-288,-560,-272,416,-16,-416,288,-128,0,-192,-400,-432,64
-272,-560,-288,400,-16,-416,288,-112,0,-176,-384,-416,112
-256,-544,-288,384,0,-416,304,-112,16,-176,-368,-416,-96
-256,-544,-288,384,0,-416,304,-112,16,-176,-368,-416,64
-256,-544,-288,384,0,-416,304,-112,16,-176,-384,-416,96
-256,-560,-304,384,16,-432,304,-112,32,-176,-368,-416,80
-256,-544,-304,384,16,-416,304,-96,32,-176,-368,-416,16
-256,-528,-288,384,0,-416,304,-96,32,-176,-368,-416,80
-256,-528,-288,368,0,-400,304,-96,32,-160,-368,-416,-64
-240,-512,-272,368,0,-400,320,-96,48,-160,-352,-400,96
-240,-496,-272,352,0,-384,320,-96,48,-160,-352,-400,64
-240,-512,-272,352,16,-384,320,-96,48,-144,-336,-400,96
-240,-496,-272,352,16,-384,320,-96,64,-144,-336,-384,0
-224,-496,-272,336,16,-384,336,-80,64,-144,-336,-384,-16
-224,-496,-272,352,16,-384,336,-80,64,-128,-320,-384,48
-224,-496,-272,352,16,-384,336,-80,80,-128,-320,-384,-128
-224,-496,-272,336,16,-384,336,-96,64,-128,-320,-384,32
-224,-496,-272,352,16,-384,336,-80,80,-128,-320,-384,32
-224,-496,-272,352,16,-384,320,-96,64,-128,-320,-384,-128
-240,-496,-256,352,0,-384,336,-96,80,-128,-320,-384,48
-240,-496,-256,352,0,-384,336,-96,80,-128,-304,-384,128
-256,-496,-256,368,0,-384,320,-96,80,-128,-304,-384,-128
-256,-496,-240,368,-16,-368,336,-96,80,-112,-304,-384,48
-256,-496,-240,368,-16,-368,336,-96,80,-112,-304,-368,112
-256,-480,-240,352,-16,-368,336,-80,96,-96,-288,-368,80
-256,-480,-224,352,-16,-352,336,-96,96,-96,-288,-368,96
-256,-480,-240,352,-16,-352,336,-96,96,-96,-288,-368,-96
-272,-480,-224,368,-16,-368,320,-112,80,-112,-304,-384,48
-272,-480,-224,368,-32,-368,336,-96,96,-96,-304,-384,64
-272,-496,-224,368,-32,-368,336,-96,96,-96,-304,-384,-32
-272,-496,-224,384,-32,-368,336,-112,96,-96,-304,-384,32
-272,-496,-224,384,-32,-368,336,-112,96,-96,-288,-384,-16
-272,-496,-224,368,-32,-368,336,-112,96,-96,-288,-368,272
-272,-480,-208,368,-32,-352,336,-96,96,-96,-288,-368,-112
-256,-464,-208,352,-32,-336,336,-96,96,-96,-288,-368,208
-256,-464,-208,352,-32,-336,336,-96,112,-80,-272,-368,32
-272,-464,-192,352,-32,-336,336,-96,112,-80,-288,-352,-16
-272,-464,-192,352,-48,-336,336,-96,112,-80,-272,-368,0
-272,-448,-192,352,-48,-320,336,-96,112,-80,-288,-368,64
-256,-448,-192,352,-48,-320,352,-96,112,-80,-272,-352,16
-256,-448,-192,352,-48,-320,352,-96,112,-80,-272,-352,-96
-272,-464,-192,352,-48,-336,352,-96,112,-80,-272,-352,112
-272,-464,-192,352,-48,-336,352,-96,112,-80,-256,-352,-16
-256,-448,-192,352,-32,-336,352,-112,112,-80,-256,-352,64
-256,-448,-192,352,-32,-336,352,-96,112,-64,-256,-336,64
-256,-464,-208,352,-32,-336,352,-96,128,-64,-256,-336,208
-256,-464,-192,352,-48,-336,352,-96,128,-80,-256,-336,64
-256,-448,-192,336,-32,-320,352,-112,112,-80,-256,-336,32
-256,-448,-208,336,-32,-336,352,-112,128,-80,-256,-320,0
-256,-448,-192,352,-48,-320,352,-112,128,-64,-240,-320,-48
-256,-448,-192,352,-48,-320,368,-112,128,-64,-240,-320,160
-256,-448,-192,336,-32,-320,368,-112,128,-64,-240,-320,176
-240,-432,-192,336,-32,-320,368,-112,144,-64,-240,-304,16
-240,-432,-192,336,-32,-320,368,-112,144,-64,-224,-304,176
-256,-448,-192,336,-32,-320,368,-112,144,-64,-224,-304,-64
-256,-448,-192,336,-48,-320,368,-112,144,-48,-224,-304,-48
-256,-448,-192,336,-32,-320,368,-128,144,-64,-224,-304,80
-256,-448,-192,336,-32,-320,368,-128,144,-48,-224,-304,144
-256,-432,-192,336,-32,-320,352,-128,128,-64,-224,-320,-208
-256,-448,-176,336,-48,-320,368,-128,144,-64,-224,-320,160
-272,-448,-176,352,-48,-320,368,-144,128,-64,-224,-320,144
-272,-448,-176,352,-48,-304,368,-144,144,-64,-224,-320,288
-272,-432,-176,336,-48,-304,368,-144,144,-64,-224,-304,112
-272,-432,-160,336,-64,-304,368,-144,144,-64,-224,-304,-112
-272,-416,-160,336,-64,-288,368,-144,144,-48,-208,-304,0
-256,-416,-160,320,-64,-288,352,-144,144,-48,-224,-304,176
-256,-416,-160,320,-64,-288,352,-144,144,-64,-224,-304,112
-272,-416,-144,336,-64,-288,352,-160,144,-64,-240,-320,96
-272,-432,-144,336,-64,-288,352,-160,144,-64,-240,-320,128
-288,-432,-160,336,-64,-288,352,-160,144,-64,-240,-320,-80
-288,-432,-160,336,-64,-288,352,-160,144,-64,-240,-320,16
-288,-432,-144,352,-80,-288,352,-160,144,-64,-240,-320,192
-304,-432,-144,352,-80,-288,336,-160,144,-64,-240,-304,-144
-288,-432,-144,352,-80,-288,352,-160,144,-64,-224,-304,272
-304,-432,-128,352,-80,-288,336,-160,144,-64,-240,-320,176
-304,-416,-128,352,-80,-288,336,-160,144,-64,-240,-304,-176
-288,-416,-128,336,-80,-272,336,-160,144,-64,-240,-320,160
-288,-416,-128,336,-80,-272,336,-160,160,-64,-224,-304,128
-288,-400,-128,336,-80,-272,336,-160,144,-64,-240,-304,-128
-288,-400,-112,320,-80,-256,320,-176,160,-64,-224,-304,176
-272,-400,-128,320,-80,-256,320,-160,160,-48,-224,-304,128
-272,-400,-128,320,-80,-272,336,-160,160,-48,-224,-304,192
-288,-400,-128,320,-80,-256,320,-160,160,-48,-224,-304,320
-288,-400,-128,336,-80,-272,320,-176,144,-48,-224,-304,-16
-272,-400,-128,320,-80,-272,320,-160,160,-32,-208,-288,208
-272,-400,-128,320,-80,-256,320,-160,160,-32,-224,-288,160
-272,-384,-128,320,-80,-256,320,-176,160,-48,-224,-288,128
-272,-384,-112,320,-80,-256,304,-176,144,-48,-224,-304,128
-272,-384,-112,320,-80,-256,304,-176,144,-48,-208,-304,176
-272,-384,-112,304,-80,-240,304,-192,144,-32,-208,-288,192
-272,-384,-112,304,-80,-256,304,-176,144,-32,-208,-288,144
-256,-368,-112,304,-80,-240,304,-176,144,-32,-208,-288,208
-256,-368,-112,288,-80,-240,304,-192,144,-32,-208,-288,192
-256,-368,-112,288,-80,-240,320,-176,144,-32,-208,-288,128
-256,-368,-112,288,-80,-240,320,-192,144,-32,-208,-288,160
-256,-368,-112,304,-80,-240,304,-192,144,-32,-208,-304,288
-272,-384,-128,304,-80,-256,304,-192,144,-32,-208,-304,96
-272,-384,-128,304,-80,-256,304,-192,128,-32,-208,-304,208
-256,-384,-128,304,-80,-256,304,-208,112,-48,-208,-320,128
-256,-384,-128,304,-64,-256,304,-208,112,-48,-208,-320,64
-272,-400,-128,320,-80,-256,288,-208,112,-48,-224,-320,80
-272,-400,-128,320,-80,-256,288,-208,112,-48,-224,-320,0
-272,-400,-128,320,-80,-272,304,-208,112,-48,-224,-320,80
-288,-400,-128,320,-80,-256,304,-208,96,-48,-224,-336,16
-272,-400,-128,320,-80,-256,304,-208,96,-48,-224,-336,96
-272,-400,-128,320,-80,-272,288,-208,96,-48,-224,-336,-48
-272,-400,-128,320,-80,-256,288,-224,96,-64,-224,-336,-32
-256,-384,-128,304,-64,-256,288,-224,96,-64,-224,-320,-32
-256,-384,-144,304,-48,-272,304,-224,96,-64,-224,-320,-336
-256,-400,-144,320,-64,-272,304,-224,80,-64,-224,-320,-112
-272,-400,-144,320,-64,-272,288,-240,80,-64,-240,-336,-176
-272,-416,-144,336,-80,-288,288,-240,80,-64,-240,-336,-192
-288,-432,-144,336,-80,-288,288,-240,64,-80,-240,-336,-240
-288,-432,-144,336,-80,-288,288,-240,80,-64,-240,-336,-384
-272,-416,-144,320,-64,-272,288,-256,80,-64,-240,-336,-320
-256,-384,-144,304,-64,-272,288,-256,80,-80,-240,-336,-224
-240,-384,-144,304,-64,-272,288,-256,80,-80,-240,-320,-224
-240,-384,-144,304,-64,-256,272,-256,64,-80,-240,-320,-272
-256,-384,-144,304,-64,-256,288,-256,64,-80,-240,-320,-352
-256,-384,-144,304,-64,-272,272,-256,48,-80,-240,-336,-256
-256,-400,-144,304,-64,-272,288,-256,64,-80,-240,-320,-176
-256,-384,-144,304,-64,-272,272,-272,64,-80,-240,-336,-160
-256,-400,-144,320,-64,-272,288,-272,64,-80,-240,-336,-112
-240,-400,-160,304,-48,-272,288,-256,64,-64,-224,-320,-224
-240,-400,-144,304,-48,-272,272,-272,48,-80,-240,-336,-208
-256,-400,-160,320,-64,-272,272,-272,48,-80,-240,-336,-272
-256,-400,-160,320,-48,-288,256,-272,32,-96,-256,-336,-240
-240,-400,-160,304,-48,-272,256,-272,32,-96,-256,-336,-144
-240,-384,-144,304,-48,-272,256,-272,32,-96,-256,-336,32
-240,-384,-144,304,-64,-256,272,-272,32,-80,-240,-336,-160
-256,-384,-128,304,-64,-256,272,-272,32,-96,-256,-336,-112
-240,-384,-144,304,-48,-272,272,-272,16,-96,-256,-336,-192
-240,-400,-160,304,-48,-272,272,-272,16,-96,-256,-336,64
-240,-384,-160,304,-48,-272,272,-272,16,-96,-256,-336,-96
-240,-400,-160,304,-48,-272,272,-272,16,-96,-256,-336,-112
-240,-400,-160,304,-48,-272,272,-272,0,-96,-256,-336,-112
-240,-400,-160,304,-48,-272,272,-272,0,-96,-256,-336,-208
-240,-400,-160,304,-48,-288,256,-288,0,-112,-272,-336,-32
-240,-400,-160,304,-48,-288,256,-288,0,-112,-256,-336,-240
-240,-400,-160,304,-48,-288,256,-288,-16,-112,-272,-352,-64
-240,-400,-160,304,-48,-288,272,-288,-16,-112,-256,-336,-16
-224,-400,-160,304,-48,-272,256,-288,-16,-96,-256,-336,-96
-224,-384,-160,304,-48,-272,272,-288,-16,-96,-256,-336,96
-240,-400,-160,304,-48,-272,272,-288,-16,-96,-256,-336,0
-240,-400,-160,304,-48,-272,256,-304,-16,-112,-256,-336,-96
-256,-400,-160,320,-64,-272,256,-304,-16,-112,-272,-352,-64
-240,-400,-160,304,-48,-288,256,-288,-16,-112,-272,-352,-64
-240,-416,-160,320,-48,-288,256,-304,-16,-112,-272,-352,128
-240,-416,-160,320,-48,-288,256,-304,-32,-128,-272,-352,-224
-240,-416,-176,320,-48,-304,256,-304,-32,-112,-272,-352,0
-240,-416,-176,320,-48,-304,256,-304,-32,-112,-272,-368,-16
-240,-416,-176,320,-48,-304,240,-320,-32,-112,-272,-368,0
-240,-416,-176,320,-48,-304,240,-320,-32,-128,-272,-368,-112
-240,-432,-176,320,-48,-304,240,-304,-32,-112,-272,-368,-224
-240,-416,-176,320,-32,-304,240,-320,-32,-128,-288,-368,-80
-240,-416,-176,320,-32,-304,240,-320,-32,-112,-288,-368,112
-240,-416,-176,320,-32,-304,240,-320,-32,-112,-288,-368,-192
-224,-400,-176,304,-48,-288,240,-336,-48,-128,-288,-368,-80
-240,-400,-176,304,-32,-288,240,-336,-48,-128,-288,-368,-48
-240,-416,-192,320,-32,-304,240,-336,-48,-128,-304,-368,-224
-224,-416,-176,304,-32,-304,240,-336,-48,-128,-288,-368,-176
-224,-400,-192,304,-32,-288,240,-336,-48,-128,-288,-368,144
-224,-400,-192,304,-16,-304,240,-336,-48,-112,-288,-368,-160
-224,-400,-192,304,-32,-304,240,-336,-48,-128,-288,-368,-64
-224,-416,-192,304,-32,-304,224,-352,-64,-128,-304,-368,-80
-208,-416,-192,304,-16,-304,224,-352,-64,-128,-304,-368,-112
-208,-400,-192,288,-16,-288,224,-352,-64,-128,-304,-368,-176
-192,-384,-192,288,-16,-288,224,-352,-64,-128,-304,-352,16
-208,-384,-192,288,-16,-288,224,-368,-64,-128,-304,-352,32
-208,-384,-176,288,-32,-272,240,-368,-64,-128,-304,-352,-80
-208,-384,-160,288,-32,-272,240,-384,-64,-128,-288,-352,0
-208,-368,-160,288,-32,-272,240,-368,-64,-128,-288,-352,-32
-208,-368,-160,288,-32,-256,240,-368,-64,-128,-288,-352,16
-208,-368,-160,272,-32,-256,240,-368,-64,-112,-288,-352,-32
-224,-368,-144,288,-48,-256,224,-368,-64,-112,-288,-336,-96
-224,-368,-128,288,-48,-240,224,-368,-64,-112,-288,-352,-144
-240,-368,-128,288,-64,-240,240,-384,-64,-112,-288,-336,32
-240,-352,-128,288,-64,-240,224,-384,-64,-112,-288,-336,64
-224,-336,-112,272,-64,-224,240,-368,-48,-96,-272,-336,112
-224,-320,-96,272,-64,-208,240,-368,-48,-96,-256,-336,-64
-224,-304,-80,256,-80,-192,256,-368,-32,-64,-240,-320,80
-224,-288,-64,240,-80,-176,256,-368,-32,-64,-240,-304,-160
-240,-288,-48,240,-96,-160,256,-352,-16,-48,-224,-304,-80
-240,-272,-32,256,-112,-160,272,-336,0,-32,-208,-288,16
-256,-256,-16,240,-128,-144,272,-336,0,-32,-208,-288,-48
-240,-240,0,224,-128,-112,288,-336,16,-16,-192,-288,112
-224,-224,0,208,-128,-112,288,-320,32,0,-192,-272,-80
-224,-208,16,208,-128,-96,304,-320,48,0,-176,-256,-144
-224,-192,32,192,-144,-80,320,-320,48,16,-160,-256,-112
-224,-192,48,192,-144,-64,336,-304,80,32,-144,-240,48
-240,-176,64,192,-160,-64,336,-304,80,32,-144,-240,160
-224,-160,64,176,-160,-48,352,-288,96,48,-128,-224,-16
-224,-144,80,176,-160,-32,368,-272,112,64,-112,-208,48
-224,-112,112,160,-176,0,384,-256,128,80,-96,-208,112
-224,-96,128,144,-176,16,384,-256,144,96,-80,-192,-64
-208,-64,144,128,-176,32,400,-240,160,96,-64,-192,112
-208,-64,144,112,-192,48,400,-240,176,112,-64,-192,80
-208,-48,160,112,-192,48,416,-240,176,112,-64,-176,208
-192,-32,160,96,-192,64,432,-224,192,128,-48,-160,32
-192,-16,176,80,-192,80,432,-224,208,128,-48,-160,-144
-192,0,192,80,-192,96,432,-224,224,144,-32,-144,64
-192,0,192,80,-192,96,432,-224,224,144,-32,-144,176
-192,16,192,80,-208,112,448,-208,240,160,-16,-144,112
-192,32,208,64,-208,112,448,-192,256,160,-16,-128,128
-176,32,208,64,-192,128,448,-192,256,160,-16,-144,144
-176,48,224,48,-208,144,448,-192,272,160,-16,-128,32
-176,80,240,32,-208,160,448,-192,272,176,-16,-128,192
-160,112,256,16,-208,176,464,-176,304,176,0,-96,112
-160,128,288,0,-224,208,464,-176,304,192,16,-96,0
-160,144,304,0,-224,224,464,-176,320,208,32,-80,160
-160,160,304,-16,-240,240,448,-176,336,208,32,-80,-64
-160,176,336,-32,-240,256,448,-160,352,224,48,-64,160
-144,208,336,-32,-256,272,448,-160,352,240,48,-64,64
-144,208,352,-48,-256,272,432,-176,368,240,48,-48,0
-144,208,352,-48,-256,288,432,-176,368,240,64,-48,-48
-144,224,368,-48,-256,288,432,-176,368,256,64,-32,32
-144,240,368,-64,-256,304,416,-176,384,256,64,-32,-128
-128,256,384,-80,-256,320,400,-192,384,256,80,-16,-128
-128,272,400,-80,-272,336,384,-192,384,272,80,-16,-96
-144,272,416,-80,-272,352,384,-208,384,272,80,-16,-272
-144,288,432,-80,-288,352,384,-208,400,288,96,0,-432
-144,304,448,-96,-304,368,352,-224,400,288,96,0,-496
-160,304,448,-80,-304,368,352,-224,400,288,112,16,-512
-160,304,464,-80,-320,384,336,-240,400,288,112,16,-560
-160,320,464,-96,-320,400,320,-256,384,288,112,16,-512
-160,320,480,-96,-320,400,304,-272,384,288,112,16,-368
-160,320,480,-96,-320,400,288,-288,384,272,112,16,-368
-176,320,480,-80,-336,400,272,-304,368,272,112,16,-192
-176,304,480,-80,-336,384,256,-320,352,272,96,16,-560
-176,304,480,-80,-336,400,240,-336,352,272,96,16,-448
-176,320,480,-80,-336,400,224,-352,336,256,96,16,-336
-160,320,480,-96,-336,400,208,-352,336,272,112,16,-416
-176,320,496,-96,-336,416,192,-368,320,256,112,16,-288
-192,320,496,-80,-352,400,176,-384,304,256,96,16,-544
-192,304,496,-64,-352,400,160,-400,304,240,96,16,-544
-192,304,496,-80,-352,400,144,-400,288,240,96,16,-656
-192,320,512,-80,-368,416,128,-416,288,240,96,16,-352
-192,320,512,-80,-368,416,112,-432,272,224,80,16,-448
-192,320,512,-80,-352,416,112,-432,272,224,80,16,-304
-192,304,496,-64,-352,400,80,-448,256,224,80,16,-128
-192,288,480,-64,-352,384,80,-448,240,224,80,16,-336
-192,288,480,-64,-352,384,64,-464,240,208,80,16,-416
-192,272,464,-48,-336,368,64,-464,224,208,64,16,-352
-192,256,448,-48,-336,352,48,-464,208,208,64,16,-304
-192,240,432,-32,-320,336,32,-480,192,192,48,0,-416
-192,224,416,-32,-320,320,16,-480,176,192,48,0,-464
-192,224,400,-32,-304,304,16,-480,176,176,48,0,-464
-176,208,384,-32,-288,288,0,-464,160,176,48,-16,-432
-176,208,368,-32,-272,288,0,-464,144,160,32,-16,-384
-160,192,352,-16,-272,272,0,-464,144,176,48,-16,-304
-176,176,336,-16,-256,256,-16,-464,128,160,32,-16,-560
-160,160,320,0,-256,240,-16,-464,128,144,32,-16,-416
-160,128,288,0,-240,208,-16,-464,112,144,16,-32,-448
-176,112,272,16,-224,192,-32,-464,96,128,16,-48,-544
-160,80,240,32,-208,160,-32,-464,80,128,0,-48,-368
-160,48,192,48,-192,112,-32,-448,64,112,0,-64,-528
-160,0,160,64,-160,80,-32,-448,48,96,-16,-80,-480
-144,-16,128,64,-144,48,-48,-464,32,80,-32,-96,-416
-144,-48,96,80,-128,32,-48,-448,32,80,-32,-96,-512
-160,-64,80,96,-128,0,-48,-448,16,48,-48,-112,-384
-160,-96,48,112,-112,-16,-48,-448,0,48,-64,-128,-544
-144,-112,32,112,-96,-48,-48,-448,-16,32,-80,-144,-352
-144,-144,0,128,-80,-64,-32,-448,-32,32,-80,-144,-336
-160,-176,-16,144,-80,-96,-32,-432,-48,16,-96,-160,-176
-160,-192,-48,176,-64,-128,-48,-448,-64,0,-112,-192,-512
-176,-240,-80,192,-48,-160,-48,-448,-96,-16,-144,-208,-352
-176,-272,-96,208,-48,-192,-48,-448,-112,-48,-160,-240,-352
-176,-304,-128,240,-32,-224,-48,-448,-128,-48,-176,-240,-128
-192,-352,-160,256,-16,-256,-48,-448,-144,-80,-192,-272,-224
-192,-368,-176,272,-16,-272,-32,-448,-160,-80,-208,-272,-304
-208,-400,-208,288,0,-304,-32,-464,-176,-96,-224,-288,-464
-208,-432,-240,304,0,-336,-32,-464,-192,-112,-240,-304,-336
-208,-464,-256,320,16,-368,-32,-464,-208,-128,-256,-336,-336
-224,-496,-288,352,16,-384,-32,-464,-224,-144,-272,-352,-320
-240,-528,-288,368,16,-416,-32,-464,-240,-160,-288,-368,-256
-256,-544,-304,384,16,-432,-16,-480,-256,-176,-304,-384,-304
-256,-576,-320,400,32,-448,-32,-480,-272,-192,-320,-416,-240
-256,-592,-336,416,32,-464,-32,-480,-288,-224,-336,-432,-240
-272,-624,-352,432,32,-480,-16,-480,-304,-224,-352,-432,-256
-288,-656,-368,448,32,-512,-16,-496,-320,-240,-368,-448,-208
-288,-672,-400,464,48,-528,0,-496,-320,-256,-384,-464,-368
-272,-672,-400,464,64,-544,-16,-512,-336,-272,-400,-480,-256
-288,-704,-432,480,64,-560,-16,-512,-352,-272,-400,-480,-128
-288,-736,-448,496,64,-592,0,-512,-368,-288,-416,-496,-288
-288,-752,-464,512,80,-608,-16,-528,-384,-304,-432,-512,-240
-304,-768,-464,528,80,-624,-16,-528,-400,-320,-448,-528,-192
-320,-784,-480,544,64,-624,-16,-544,-416,-336,-464,-528,-352
-336,-800,-480,544,80,-640,0,-544,-416,-352,-464,-544,-80
-320,-800,-496,544,96,-656,0,-560,-432,-352,-480,-544,-112
-304,-816,-512,544,96,-672,0,-544,-432,-368,-480,-544,-496
-304,-816,-528,544,112,-672,0,-560,-448,-384,-496,-560,-128
-304,-832,-528,560,112,-688,0,-560,-448,-384,-496,-560,-96
-304,-848,-544,576,112,-704,0,-576,-464,-400,-512,-560,-240
-320,-864,-544,576,112,-704,0,-576,-464,-400,-512,-560,-176
-336,-880,-560,592,96,-720,0,-576,-480,-400,-528,-560,-160
-352,-896,-560,608,112,-736,0,-576,-480,-416,-528,-576,-208
-352,-912,-576,608,112,-736,0,-592,-496,-432,-544,-576,-240
-352,-912,-592,624,112,-752,-16,-592,-512,-432,-544,-576,-64
-336,-928,-608,624,128,-768,0,-592,-512,-448,-544,-576,-64
-336,-928,-608,624,128,-768,-16,-608,-528,-448,-560,-576,-192
-336,-944,-608,624,128,-768,0,-592,-512,-448,-560,-576,-208
-336,-944,-608,640,128,-784,0,-608,-528,-464,-560,-576,-192
-352,-944,-608,640,128,-784,0,-608,-528,-464,-560,-576,-208
-368,-960,-608,640,112,-784,0,-608,-528,-464,-560,-576,48
-368,-960,-608,656,112,-784,0,-608,-528,-464,-560,-576,-96
-384,-976,-592,656,96,-784,0,-608,-544,-480,-576,-592,-192
-384,-976,-608,656,96,-784,0,-608,-544,-480,-576,-592,-192
-384,-976,-608,672,112,-800,0,-608,-544,-480,-576,-592,-128
-368,-976,-624,656,112,-800,0,-608,-544,-480,-576,-592,-144
-368,-992,-624,672,128,-816,16,-608,-544,-480,-576,-592,128
-384,-1008,-640,688,128,-832,0,-608,-544,-496,-576,-608,-144
-384,-1024,-640,688,112,-832,0,-608,-544,-496,-576,-608,-144
-400,-1024,-640,688,112,-832,16,-608,-544,-496,-576,-608,-272
-384,-1008,-640,688,112,-832,16,-592,-544,-496,-576,-608,-96
-384,-1008,-640,688,128,-816,16,-592,-544,-496,-592,-608,-96
-384,-1008,-640,688,128,-816,32,-592,-544,-496,-592,-624,-48
-384,-1008,-640,672,128,-816,32,-592,-544,-496,-592,-624,-80
-384,-1008,-640,672,112,-816,16,-608,-544,-512,-608,-624,-192
-384,-1008,-624,672,112,-816,32,-592,-544,-512,-592,-624,-208
-384,-1008,-640,672,112,-816,32,-592,-544,-512,-608,-624,-288
-384,-1008,-640,672,112,-816,48,-592,-544,-496,-592,-624,-64
-384,-1008,-640,672,112,-816,48,-592,-528,-496,-592,-624,-176
-384,-1008,-640,688,128,-832,64,-592,-528,-496,-592,-624,-112
-384,-1024,-656,688,128,-832,48,-576,-528,-496,-592,-624,64
-384,-1024,-656,688,128,-832,48,-592,-528,-496,-592,-624,0
-384,-1024,-656,688,128,-848,48,-576,-528,-496,-592,-640,-160
-384,-1008,-640,688,128,-832,48,-576,-528,-496,-592,-640,-160
-384,-1008,-640,672,128,-816,64,-576,-528,-496,-592,-624,-128
-384,-992,-640,672,128,-816,64,-576,-528,-496,-592,-624,-144
-384,-992,-624,672,112,-816,64,-576,-512,-480,-592,-624,-112
-384,-1008,-624,688,112,-816,64,-576,-512,-480,-592,-624,16
-400,-1008,-640,688,112,-816,64,-560,-512,-464,-576,-624,112
-400,-1008,-624,688,112,-816,80,-560,-512,-464,-576,-624,-64
-384,-992,-640,672,112,-816,80,-560,-496,-464,-560,-624,96
-384,-1008,-640,672,112,-816,80,-560,-496,-448,-560,-624,-48
-384,-992,-640,672,128,-816,80,-544,-496,-448,-560,-608,-16
-384,-992,-640,672,128,-816,80,-544,-480,-448,-544,-608,-64
-384,-992,-624,672,112,-816,80,-544,-480,-432,-544,-608,-112
-400,-992,-624,672,96,-800,96,-544,-464,-416,-544,-608,-144
-384,-976,-608,672,112,-800,80,-544,-464,-416,-528,-608,48
-384,-976,-608,656,112,-800,96,-528,-448,-400,-528,-592,64
-384,-976,-624,656,112,-800,96,-512,-448,-400,-528,-608,64
-368,-976,-624,656,112,-800,112,-480,-432,-384,-512,-608,32
-368,-976,-624,656,128,-800,128,-464,-416,-384,-512,-608,64
-368,-976,-624,656,112,-800,144,-432,-400,-368,-512,-608,128
-368,-960,-608,640,112,-784,160,-384,-368,-352,-512,-608,-32
-352,-944,-608,640,112,-768,192,-336,-320,-320,-480,-608,-96
-352,-928,-592,624,112,-752,224,-272,-272,-272,-448,-576,96
-352,-912,-576,608,96,-736,240,-208,-224,-240,-432,-560,128
-336,-880,-560,592,96,-720,288,-112,-144,-176,-384,-544,96
-336,-864,-544,592,96,-704,320,-16,-64,-128,-352,-528,112
-320,-848,-544,576,96,-688,368,96,48,-48,-304,-496,128
-304,-816,-528,544,112,-672,432,224,144,32,-256,-464,-160
-288,-800,-528,528,112,-656,464,336,240,128,-192,-432,192
-256,-768,-528,496,128,-640,496,400,320,208,-128,-384,160
-240,-752,-528,480,128,-624,512,480,400,320,-32,-336,192
-192,-704,-512,432,144,-608,528,576,496,448,64,-256,160
-128,-640,-528,368,192,-576,544,768,656,656,240,-144,368
-48,-576,-544,304,240,-560,560,928,800,848,416,-32,288
0,-512,-528,240,256,-512,560,1040,928,1040,576,80,400
80,-416,-512,144,288,-448,544,1168,1072,1248,768,224,432
160,-320,-480,64,320,-400,512,1280,1200,1488,976,384,528
240,-224,-464,-32,352,-336,464,1392,1328,1712,1184,544,480
336,-96,-448,-144,384,-256,384,1504,1456,1968,1440,736,432
448,48,-400,-272,416,-160,288,1600,1552,2240,1696,944,480
544,224,-336,-416,432,-48,160,1648,1632,2480,1952,1168,640
672,400,-288,-560,480,64,32,1680,1696,2720,2224,1392,784
800,576,-224,-720,512,176,-144,1680,1728,2944,2480,1632,656
912,768,-176,-864,544,304,-320,1664,1728,3168,2736,1872,784
1040,912,-144,-1008,592,384,-496,1648,1696,3344,2960,2080,704
1152,1056,-112,-1136,640,480,-688,1616,1664,3504,3184,2304,576
1280,1200,-96,-1264,688,560,-896,1552,1584,3648,3392,2512,576
1392,1328,-80,-1392,736,624,-1104,1488,1504,3760,3568,2704,416
1520,1456,-80,-1520,800,688,-1328,1424,1376,3840,3728,2880,752
1648,1568,-96,-1632,864,736,-1552,1312,1200,3888,3856,3040,432
1760,1648,-112,-1728,928,768,-1760,1184,992,3872,3936,3184,480
1840,1712,-144,-1792,992,784,-1968,1008,752,3808,3968,3280,352
1888,1744,-160,-1840,1008,800,-2176,752,480,3696,3968,3344,176
1904,1760,-160,-1856,1024,800,-2384,448,192,3552,3936,3408,224
1904,1760,-160,-1856,1024,800,-2608,112,-144,3360,3856,3440,192
1920,1744,-192,-1856,1056,768,-2832,-240,-496,3136,3760,3424,176
1920,1680,-256,-1824,1072,720,-3056,-592,-864,2864,3616,3392,0
1888,1600,-304,-1776,1088,656,-3264,-976,-1248,2576,3424,3328,-48
1840,1472,-368,-1680,1104,544,-3424,-1360,-1664,2224,3184,3200,-336
1776,1312,-480,-1568,1120,416,-3568,-1728,-2064,1856,2928,3056,-272
1696,1136,-576,-1440,1136,272,-3696,-2096,-2464,1456,2624,2880,-368
1616,944,-672,-1296,1136,128,-3792,-2464,-2848,1072,2320,2688,-448
1520,752,-768,-1152,1136,-16,-3872,-2816,-3200,688,2016,2496,-384
1408,560,-848,-1008,1120,-160,-3936,-3168,-3520,320,1712,2288,-208
1296,384,-928,-864,1104,-272,-3984,-3504,-3824,-32,1392,2080,-288
1168,208,-976,-704,1072,-400,-4032,-3824,-4096,-384,1088,1872,-352
1072,32,-1040,-576,1040,-512,-4048,-4112,-4336,-704,800,1664,-384
944,-112,-1072,-432,1008,-592,-4048,-4368,-4528,-1008,512,1440,-560
816,-272,-1104,-288,960,-704,-4016,-4592,-4704,-1280,256,1232,-480
688,-432,-1120,-144,896,-784,-3968,-4768,-4832,-1536,16,1040,-336
560,-544,-1120,-16,832,-832,-3920,-4896,-4912,-1728,-208,864,-368
464,-640,-1120,80,784,-880,-3840,-4992,-4944,-1904,-400,704,-256
368,-736,-1104,160,720,-928,-3760,-5024,-4944,-2032,-560,544,-224
272,-800,-1072,240,672,-944,-3648,-5040,-4896,-2144,-720,400,-240
176,-848,-1040,320,608,-960,-3520,-4992,-4832,-2208,-832,256,-128
96,-896,-1008,384,544,-960,-3392,-4928,-4720,-2256,-928,160,-48
48,-912,-960,416,496,-944,-3248,-4816,-4592,-2256,-992,64,-256
0,-912,-912,432,448,-912,-3088,-4688,-4432,-2240,-1040,-16,16
-32,-912,-880,448,416,-896,-2928,-4528,-4256,-2208,-1072,-80,-144
-80,-896,-816,464,368,-864,-2752,-4336,-4064,-2160,-1088,-144,-384
-112,-864,-768,480,320,-816,-2576,-4144,-3856,-2096,-1104,-192,-144
-160,-848,-704,480,272,-784,-2400,-3920,-3632,-2016,-1088,-224,-128
-192,-832,-640,496,224,-736,-2208,-3712,-3424,-1920,-1072,-256,-464
-224,-800,-592,496,176,-704,-2032,-3488,-3216,-1824,-1056,-288,-208
-256,-784,-544,496,144,-672,-1872,-3296,-3008,-1728,-1024,-304,-208
-272,-752,-496,496,112,-624,-1712,-3088,-2800,-1632,-992,-320,-32
-288,-736,-448,496,64,-592,-1568,-2896,-2608,-1536,-944,-336,-144
-304,-704,-416,496,48,-560,-1424,-2688,-2416,-1440,-912,-336,-336
-320,-688,-368,480,16,-528,-1280,-2496,-2240,-1344,-864,-336,-400
-336,-672,-352,480,0,-512,-1152,-2320,-2064,-1248,-832,-352,-352
-320,-640,-336,464,0,-480,-1024,-2128,-1888,-1152,-784,-336,-160
-320,-608,-304,448,-16,-448,-896,-1952,-1728,-1072,-736,-336,-208
-320,-592,-288,432,-32,-432,-784,-1792,-1584,-992,-704,-336,-304
-336,-592,-272,448,-48,-432,-688,-1648,-1456,-928,-672,-336,-304
-352,-592,-256,464,-64,-416,-608,-1520,-1328,-864,-656,-352,-352
-368,-608,-240,464,-64,-416,-512,-1376,-1216,-800,-608,-352,-208
-352,-592,-256,448,-64,-416,-432,-1248,-1104,-736,-592,-352,-304
-352,-576,-240,448,-64,-416,-352,-1136,-1008,-672,-560,-352,-304
-336,-576,-240,432,-48,-416,-288,-1040,-928,-640,-544,-368,-128
-336,-576,-256,432,-48,-416,-224,-944,-848,-592,-512,-368,-240
-336,-576,-256,432,-48,-416,-176,-880,-784,-560,-512,-384,-96
-320,-576,-256,432,-48,-416,-112,-800,-720,-544,-496,-384,-320
-320,-592,-272,432,-32,-432,-80,-736,-672,-512,-480,-384,-224
-320,-592,-272,432,-32,-432,-32,-672,-624,-480,-464,-400,-48
-320,-592,-272,432,-32,-432,0,-624,-592,-464,-464,-400,-128
-320,-608,-288,448,-16,-448,32,-576,-544,-448,-464,-416,-48
-320,-608,-288,448,-16,-448,48,-544,-512,-432,-464,-416,64
-320,-608,-288,448,-16,-448,80,-512,-480,-416,-448,-432,-176
-320,-608,-288,448,-16,-448,112,-480,-448,-400,-448,-432,-176
-304,-592,-288,432,-16,-432,128,-448,-432,-400,-448,-432,-32
-304,-592,-288,432,-16,-432,144,-416,-400,-384,-448,-448,-48
-320,-592,-288,432,-16,-432,160,-384,-384,-384,-432,-448,-128
-320,-592,-288,448,-16,-432,176,-368,-368,-368,-448,-464,-128
-320,-592,-288,448,-16,-448,176,-352,-352,-368,-448,-464,-144
-320,-608,-288,448,-16,-448,192,-336,-336,-352,-448,-464,112
-320,-608,-288,448,-16,-448,208,-320,-320,-352,-432,-480,16
-320,-608,-304,448,-16,-448,224,-304,-320,-336,-432,-480,-144
-320,-608,-304,448,-16,-464,240,-288,-288,-336,-432,-480,-112
-320,-608,-304,448,0,-464,240,-272,-288,-320,-432,-480,-48
-320,-624,-304,448,-16,-464,240,-256,-272,-320,-432,-480,32
-320,-624,-304,464,-16,-464,256,-256,-256,-320,-432,-496,-96
-336,-624,-304,464,-16,-464,256,-240,-256,-320,-432,-496,-80
-336,-624,-304,464,-16,-464,256,-240,-240,-304,-432,-512,-96
-336,-624,-304,464,-16,-464,272,-224,-224,-304,-432,-512,96
-336,-624,-304,464,-16,-464,272,-224,-224,-304,-432,-512,48
-336,-624,-304,464,-16,-464,272,-208,-224,-288,-432,-512,-112
-336,-624,-304,464,-16,-464,288,-192,-208,-288,-416,-512,0
-320,-624,-304,464,-16,-464,288,-192,-192,-272,-416,-512,208
-320,-608,-304,448,0,-464,304,-176,-192,-272,-416,-512,0
-320,-624,-304,464,0,-480,304,-176,-192,-272,-416,-512,-96
-336,-640,-320,464,-16,-480,304,-176,-176,-272,-416,-512,-16
-336,-640,-320,480,-16,-480,304,-160,-176,-272,-416,-512,-96
-336,-656,-320,480,-16,-480,304,-160,-176,-272,-416,-528,48
-352,-656,-320,496,-16,-496,320,-160,-160,-272,-416,-528,96
-352,-656,-320,496,-16,-496,320,-160,-160,-272,-416,-528,-32
-352,-656,-320,480,-16,-496,320,-144,-160,-256,-416,-512,-176
-336,-640,-304,464,-16,-480,336,-128,-144,-256,-400,-512,80
-336,-640,-320,464,-16,-480,336,-128,-128,-256,-400,-512,96
-336,-640,-320,480,-16,-480,336,-112,-128,-240,-384,-512,-32
-336,-640,-304,480,-16,-480,352,-112,-112,-240,-384,-512,160
-336,-624,-304,464,-16,-464,352,-96,-112,-240,-384,-496,0
-336,-624,-304,464,-16,-464,352,-96,-112,-240,-384,-496,48
-320,-624,-304,464,-16,-480,352,-96,-112,-240,-384,-496,0
-336,-640,-304,464,-16,-480,368,-80,-112,-224,-384,-496,112
-336,-640,-320,480,0,-480,368,-80,-112,-224,-368,-496,208
-336,-656,-320,480,0,-496,368,-80,-112,-224,-368,-496,-16
-336,-640,-320,480,-16,-480,368,-64,-96,-224,-368,-496,48
-320,-640,-320,464,0,-480,368,-64,-96,-208,-352,-480,-16
-320,-624,-304,464,0,-464,368,-48,-80,-208,-352,-496,64
-320,-624,-304,448,0,-464,368,-48,-80,-208,-352,-496,-128
-304,-624,-320,448,0,-464,384,-32,-80,-208,-352,-480,208
-304,-608,-304,448,0,-464,384,-32,-80,-192,-336,-480,-48
-304,-592,-304,432,0,-448,384,-32,-80,-192,-336,-480,224
-304,-608,-304,432,0,-464,384,-16,-80,-192,-336,-480,272
-304,-608,-304,448,0,-464,384,-16,-96,-192,-352,-480,0
-320,-608,-288,448,-16,-448,384,-16,-80,-192,-336,-480,64
-336,-624,-288,464,-16,-464,384,0,-80,-192,-336,-464,32
-336,-624,-288,464,-32,-464,384,0,-80,-176,-320,-464,160
-336,-624,-288,464,-32,-448,384,0,-80,-176,-320,-480,112
-336,-624,-288,464,-16,-464,384,16,-80,-176,-320,-464,112
-320,-608,-288,448,-16,-448,384,16,-80,-176,-320,-480,-192
-320,-592,-288,448,-16,-448,384,16,-80,-176,-320,-464,-32
-320,-592,-288,432,-16,-432,384,16,-64,-160,-320,-464,-32
-320,-592,-272,432,-16,-432,384,32,-64,-160,-304,-464,-48
-320,-576,-272,432,-32,-432,368,32,-64,-160,-304,-448,256
-320,-592,-272,448,-32,-432,368,32,-64,-160,-304,-448,208
-336,-592,-272,448,-32,-432,368,32,-64,-160,-304,-448,32
-336,-592,-272,448,-48,-432,368,48,-64,-160,-304,-448,64
-336,-592,-272,448,-32,-432,368,48,-48,-144,-304,-448,32
-336,-592,-272,448,-32,-432,368,48,-64,-144,-304,-448,208
-336,-592,-272,448,-32,-432,368,48,-48,-144,-304,-448,240
-336,-592,-272,448,-32,-432,384,64,-48,-144,-288,-448,48
-336,-592,-272,448,-32,-432,384,64,-48,-144,-288,-448,96
-336,-592,-272,448,-32,-432,368,64,-48,-144,-288,-448,176
-336,-592,-272,448,-32,-432,368,64,-48,-144,-288,-448,32
-320,-576,-272,432,-32,-432,368,80,-32,-128,-288,-432,80
-304,-560,-272,432,-32,-416,384,96,-32,-128,-272,-432,144
-304,-560,-256,416,-32,-416,384,96,-32,-112,-272,-432,112
-304,-560,-256,416,-32,-416,384,96,-16,-112,-272,-416,208
-304,-560,-256,416,-32,-416,384,112,-16,-112,-272,-416,176
-320,-560,-272,432,-32,-416,368,96,-32,-128,-288,-432,-32
-320,-576,-272,432,-32,-416,384,96,-32,-128,-288,-432,128
-304,-560,-272,416,-32,-416,368,112,-32,-128,-288,-432,176
-304,-560,-272,416,-16,-416,384,112,-32,-112,-272,-416,80
-288,-560,-272,416,-16,-416,384,112,-32,-112,-272,-416,16
-288,-560,-272,416,-16,-416,384,128,-16,-112,-272,-416,0
-288,-560,-272,416,-16,-416,384,128,-16,-112,-272,-416,80
-288,-560,-272,400,-16,-416,384,144,-16,-96,-272,-416,128
-272,-544,-272,384,0,-400,384,144,0,-96,-256,-416,320
-272,-528,-272,384,0,-400,384,144,0,-96,-256,-416,80
-272,-512,-256,384,-16,-384,384,160,0,-80,-256,-400,64
-256,-512,-256,368,-16,-384,384,160,0,-80,-256,-400,128
-256,-512,-256,368,0,-384,384,160,0,-80,-256,-400,16
-256,-512,-256,368,0,-384,384,176,0,-80,-256,-400,144
-240,-496,-256,368,0,-384,384,160,0,-80,-256,-400,320
-240,-496,-256,368,0,-384,384,176,16,-64,-240,-400,96
-240,-496,-256,368,0,-384,400,176,16,-64,-240,-384,112
-240,-496,-256,368,0,-384,400,192,32,-48,-224,-384,80
-240,-496,-256,368,0,-384,400,192,32,-48,-224,-384,-112
-240,-512,-272,368,0,-384,400,208,48,-48,-224,-384,336
-240,-496,-256,352,0,-368,384,208,32,-48,-224,-384,128
-240,-496,-240,352,0,-368,400,208,48,-48,-224,-384,96
-256,-496,-240,352,0,-368,400,208,48,-48,-224,-384,96
-240,-480,-240,352,0,-368,400,224,64,-32,-208,-368,224
-240,-464,-240,336,0,-352,416,224,64,-32,-208,-368,32
-240,-480,-240,352,-16,-352,416,240,64,-16,-192,-368,64
-240,-464,-224,352,-16,-352,400,240,64,-16,-192,-368,80
-240,-480,-224,352,-16,-352,416,240,80,-16,-192,-368,192
-256,-480,-224,352,-16,-352,416,256,96,-16,-192,-352,192
-240,-480,-224,352,-16,-352,400,256,96,-16,-192,-352,0
-240,-464,-224,336,-16,-352,400,256,96,0,-192,-352,96
-240,-464,-224,336,-16,-352,416,272,96,0,-176,-352,80
-240,-464,-224,336,-16,-336,400,272,96,0,-176,-352,272
-240,-448,-224,336,-16,-336,400,272,96,0,-176,-352,144
-224,-448,-224,320,-16,-336,416,288,112,16,-176,-336,80
-224,-448,-208,320,-16,-336,416,288,112,16,-160,-336,-112
-224,-432,-208,320,-16,-320,416,304,128,32,-160,-320,-16
-224,-432,-208,320,-16,-320,416,304,128,32,-144,-320,64
-224,-416,-192,304,-16,-304,416,320,144,32,-144,-320,32
-208,-400,-192,304,-16,-304,416,320,144,48,-144,-320,208
-208,-400,-192,288,-16,-288,416,320,144,48,-144,-320,160
-192,-384,-192,272,-16,-288,416,336,160,48,-128,-304,128
-192,-384,-192,272,-16,-288,416,336,160,64,-128,-304,112
-192,-384,-192,272,0,-288,416,352,176,64,-112,-288,0
-192,-368,-176,272,-16,-272,416,352,160,64,-112,-304,-16
-192,-384,-176,272,-16,-272,416,368,176,80,-112,-288,0
-192,-368,-176,272,-16,-272,416,368,192,80,-96,-288,144
-192,-368,-176,256,-16,-272,416,368,192,80,-96,-288,-32
-192,-352,-160,256,-16,-256,416,384,192,96,-96,-272,128
-192,-352,-160,256,-16,-256,416,400,208,96,-80,-272,0
-192,-352,-160,256,-32,-256,416,400,208,96,-80,-272,0
-192,-336,-144,256,-32,-240,416,416,208,96,-80,-256,112
-192,-336,-128,240,-32,-224,416,416,224,96,-64,-256,256
-176,-320,-128,240,-32,-224,416,432,224,112,-64,-256,-16
-176,-304,-128,224,-32,-224,416,448,240,112,-64,-256,80
-176,-304,-128,224,-32,-224,416,448,240,128,-48,-256,-32
-176,-304,-128,240,-32,-224,416,464,256,128,-48,-240,32
-176,-320,-128,240,-32,-224,416,464,256,128,-48,-256,96
-192,-336,-128,256,-32,-224,416,480,256,128,-48,-256,192
-192,-320,-128,240,-48,-224,416,496,272,128,-32,-240,80
-192,-320,-112,240,-48,-224,400,496,272,128,-48,-240,-176
-192,-304,-112,240,-48,-208,416,512,272,128,-32,-224,-32
-192,-304,-112,224,-48,-192,416,512,288,144,-32,-224,80
-176,-272,-96,224,-48,-192,416,528,304,160,-16,-224,64
-160,-272,-96,208,-48,-192,416,544,304,160,0,-224,64
-176,-272,-96,208,-48,-176,416,560,304,176,0,-208,96
-176,-256,-80,208,-48,-176,416,576,320,176,0,-208,224
-176,-272,-96,208,-48,-176,400,576,336,176,16,-208,96
-176,-256,-80,208,-48,-176,416,592,336,192,16,-192,0
-160,-240,-80,192,-48,-160,416,608,352,192,32,-192,-64
-144,-224,-80,176,-48,-160,416,624,368,208,32,-192,224
-128,-208,-64,160,-32,-128,416,656,384,224,48,-176,0
-128,-192,-64,144,-48,-128,416,656,384,224,48,-176,304
-144,-208,-64,160,-48,-128,416,672,384,240,48,-160,160
-144,-208,-64,160,-48,-128,400,672,400,240,64,-160,16
-128,-192,-48,144,-48,-112,416,704,416,256,80,-144,160
-112,-160,-48,128,-48,-96,416,720,432,272,96,-128,288
-96,-144,-32,112,-32,-80,432,752,448,288,112,-128,-48
-96,-128,-32,96,-32,-80,432,768,448,304,112,-112,32
-96,-112,-32,96,-32,-64,432,784,464,320,128,-96,48
-80,-96,-16,80,-48,-48,432,800,480,320,144,-96,192
-80,-80,-16,64,-48,-48,432,816,496,320,144,-80,96
-80,-80,0,64,-48,-32,432,832,496,336,160,-64,144
-64,-64,0,48,-48,-32,432,864,512,352,176,-64,256
-64,-48,0,48,-48,-16,432,880,528,368,176,-48,80
-64,-48,0,48,-32,-16,432,896,544,384,192,-32,96
-64,-48,16,32,-48,-16,432,912,560,400,208,-32,304
-64,-32,16,32,-48,0,448,944,560,400,224,-16,96
-48,-16,32,32,-48,0,448,960,576,416,240,0,-48
-48,0,48,16,-48,16,448,976,592,432,240,0,144
-48,16,48,0,-48,32,448,1008,608,448,256,16,112
-48,16,64,0,-64,48,448,1024,624,448,272,16,128
-48,32,64,0,-64,48,448,1040,624,464,272,32,272
-48,32,80,0,-64,48,432,1056,640,464,288,48,224
-32,48,80,-16,-64,64,448,1072,656,480,304,48,272
-32,64,80,-32,-64,80,448,1104,672,512,320,64,272
-16,80,96,-48,-64,80,448,1120,688,528,320,80,-112
-16,80,96,-32,-64,80,448,1152,704,528,336,80,32
-16,80,96,-48,-64,96,448,1168,720,544,352,96,144
-16,96,112,-48,-64,96,448,1184,720,560,368,112,256
-16,96,112,-48,-64,96,432,1200,736,560,368,112,240
-16,112,128,-64,-80,128,448,1232,752,576,384,128,256
-16,128,144,-80,-80,128,448,1264,784,592,400,144,176
0,160,144,-96,-80,160,448,1296,800,624,416,160,352
16,192,160,-128,-80,176,448,1328,816,640,448,176,272
32,208,160,-128,-64,176,448,1360,832,656,464,192,128
32,224,176,-144,-80,192,448,1376,848,672,480,208,224
48,240,192,-160,-80,208,448,1408,864,688,496,224,368
48,240,192,-160,-80,208,448,1424,880,704,512,240,64
48,256,192,-176,-80,224,448,1456,896,720,528,240,240
64,272,208,-176,-80,240,448,1488,912,736,544,256,64
64,288,208,-192,-80,256,448,1520,928,752,560,272,256
80,320,224,-208,-80,272,448,1552,944,784,592,288,32
96,336,240,-224,-80,288,464,1568,960,800,608,320,288
96,352,240,-240,-80,304,448,1600,992,832,640,336,224
112,384,256,-256,-80,320,464,1632,1008,848,656,352,320
128,416,272,-288,-80,336,448,1664,1024,880,672,368,144
144,432,272,-304,-80,352,448,1696,1040,896,704,400,240
144,448,288,-320,-80,368,464,1728,1072,928,736,416,256
160,480,304,-336,-80,400,448,1744,1088,944,752,432,48
176,496,320,-352,-80,416,448,1776,1104,960,768,448,240
192,512,320,-368,-64,416,448,1808,1120,992,800,464,208
208,544,320,-384,-64,432,448,1840,1152,1008,816,496,480
208,544,320,-400,-64,432,448,1872,1168,1040,848,512,192
208,560,336,-400,-64,448,448,1888,1184,1056,864,544,96
224,576,352,-416,-64,464,448,1920,1200,1072,896,560,48
224,592,352,-432,-64,480,448,1936,1216,1104,912,576,128
240,624,368,-448,-64,496,448,1968,1248,1120,944,608,112
256,640,368,-464,-64,512,448,2000,1264,1152,960,624,208
256,656,384,-480,-64,512,448,2032,1280,1168,976,640,48
272,672,384,-496,-64,528,432,2048,1296,1184,1008,656,160
288,704,400,-512,-64,560,432,2080,1312,1216,1024,672,368
304,720,400,-544,-48,560,432,2096,1328,1232,1056,688,272
320,736,416,-544,-48,576,416,2128,1344,1248,1072,720,160
336,784,432,-576,-48,608,432,2160,1376,1280,1104,752,96
368,800,432,-608,-32,624,432,2192,1392,1312,1136,768,336
368,800,432,-608,-32,624,416,2208,1408,1328,1152,784,96
352,832,448,-608,-48,640,416,2240,1424,1344,1168,800,272
368,848,464,-624,-48,656,416,2256,1440,1376,1200,832,368
384,880,480,-656,-48,672,416,2272,1456,1392,1216,848,112
384,912,496,-672,-48,704,416,2304,1472,1408,1232,864,384
416,928,512,-688,-48,720,400,2320,1488,1424,1264,880,224
416,960,512,-704,-48,736,400,2352,1504,1456,1280,896,208
432,976,528,-720,-48,752,400,2368,1520,1472,1296,928,128
448,1008,544,-752,-48,768,400,2400,1536,1488,1328,944,480
464,1024,544,-768,-48,784,384,2416,1552,1504,1344,960,288
464,1056,576,-784,-48,816,384,2432,1568,1520,1360,976,272
464,1072,592,-784,-64,832,384,2448,1584,1536,1376,992,160
480,1088,592,-800,-64,848,384,2464,1584,1552,1392,1008,128
480,1104,608,-816,-64,848,384,2480,1600,1568,1424,1040,272
496,1120,608,-832,-64,864,368,2512,1616,1584,1440,1056,368
512,1136,624,-832,-48,880,368,2512,1632,1600,1456,1072,256
512,1168,640,-848,-64,896,352,2528,1632,1600,1472,1072,288
512,1168,640,-864,-64,912,352,2528,1648,1616,1488,1088,240
512,1184,656,-864,-80,928,352,2560,1664,1632,1504,1104,336
528,1216,672,-880,-80,944,352,2576,1664,1648,1520,1120,80
528,1232,672,-896,-80,960,336,2576,1680,1664,1536,1136,240
544,1232,688,-912,-64,960,336,2592,1696,1680,1552,1168,128
544,1264,704,-928,-80,976,320,2608,1696,1696,1568,1168,240
560,1280,704,-944,-80,992,320,2608,1696,1696,1584,1184,272
560,1280,704,-944,-80,992,320,2624,1712,1712,1600,1200,256
560,1296,720,-944,-80,1008,304,2624,1712,1712,1600,1216,96
576,1312,720,-960,-80,1024,304,2640,1728,1728,1616,1232,368
576,1328,720,-960,-80,1024,288,2640,1728,1744,1632,1248,304
576,1328,736,-976,-80,1040,288,2656,1744,1760,1648,1264,160
592,1344,736,-992,-80,1040,288,2656,1744,1776,1664,1280,144
592,1360,736,-992,-80,1056,272,2656,1744,1776,1680,1280,272
608,1376,752,-1008,-80,1072,272,2656,1760,1792,1696,1296,-16
608,1392,768,-1024,-80,1088,256,2672,1760,1808,1696,1312,32
640,1408,752,-1040,-64,1088,256,2672,1760,1824,1712,1328,320
640,1424,768,-1056,-80,1104,256,2672,1760,1824,1728,1344,96
640,1440,784,-1056,-80,1120,240,2672,1760,1824,1744,1344,64
640,1440,784,-1056,-80,1120,224,2656,1760,1840,1744,1360,32
640,1456,784,-1072,-80,1120,224,2656,1760,1840,1744,1360,176
656,1472,784,-1072,-80,1136,224,2672,1776,1856,1760,1376,0
656,1456,784,-1072,-80,1120,208,2656,1776,1856,1776,1392,96
656,1472,784,-1072,-80,1136,208,2656,1776,1856,1776,1392,144
656,1472,784,-1088,-64,1136,208,2640,1776,1872,1776,1392,-16
656,1472,784,-1088,-64,1136,192,2640,1776,1872,1792,1408,16
672,1472,784,-1088,-64,1136,176,2624,1760,1856,1776,1408,64
672,1488,784,-1104,-64,1136,176,2608,1760,1872,1792,1408,64
672,1472,784,-1088,-64,1136,176,2592,1760,1856,1792,1408,0
672,1472,784,-1088,-64,1136,176,2576,1760,1872,1792,1408,272
656,1472,800,-1088,-64,1136,160,2560,1760,1856,1776,1392,48
640,1456,800,-1072,-80,1136,160,2528,1744,1856,1776,1408,16
640,1456,800,-1072,-80,1120,160,2512,1744,1856,1776,1392,0
640,1456,784,-1056,-80,1120,160,2496,1744,1840,1776,1392,240
624,1440,784,-1056,-80,1120,160,2480,1744,1840,1776,1392,-96
624,1440,784,-1040,-80,1104,160,2448,1728,1824,1760,1376,-96
640,1424,768,-1040,-80,1104,160,2416,1712,1824,1760,1376,-80
640,1408,752,-1040,-64,1088,160,2384,1712,1808,1744,1360,144
624,1392,752,-1024,-64,1088,160,2352,1696,1792,1728,1360,32
608,1376,752,-1008,-80,1072,160,2320,1680,1792,1712,1344,48
608,1360,736,-992,-80,1056,160,2288,1680,1776,1696,1328,96
592,1360,736,-992,-80,1056,176,2256,1680,1760,1696,1328,240
592,1344,736,-992,-80,1040,176,2224,1664,1744,1680,1312,224
592,1328,720,-976,-64,1024,176,2192,1648,1744,1664,1296,-32
576,1312,720,-960,-80,1008,176,2160,1632,1712,1648,1280,-48
560,1280,704,-928,-80,992,192,2112,1616,1696,1616,1264,-64
544,1248,688,-912,-80,976,176,2064,1600,1664,1584,1232,-144
528,1232,688,-896,-80,960,176,2016,1568,1648,1568,1216,0
512,1200,672,-880,-80,944,192,1968,1552,1616,1536,1200,16
512,1184,656,-864,-80,912,192,1936,1536,1600,1520,1168,-32
496,1136,624,-832,-64,880,208,1888,1520,1568,1488,1152,192
496,1120,608,-816,-64,864,208,1840,1488,1552,1472,1120,48
480,1088,592,-800,-64,832,208,1792,1472,1520,1440,1104,-112
464,1056,576,-768,-64,816,208,1744,1440,1488,1392,1072,-144
432,1024,576,-752,-64,800,224,1696,1408,1456,1376,1040,96
416,976,560,-720,-80,768,224,1648,1376,1424,1328,1008,48
400,944,544,-688,-80,752,224,1584,1360,1392,1296,976,48
384,928,528,-672,-64,720,224,1536,1328,1360,1264,944,32
384,896,496,-656,-64,704,240,1504,1312,1328,1232,928,-48
368,864,480,-624,-64,672,240,1440,1280,1280,1200,880,-48
336,816,464,-592,-80,640,240,1392,1248,1248,1168,848,32
288,752,448,-544,-80,608,240,1328,1216,1216,1120,816,-32
272,720,432,-512,-80,576,240,1280,1184,1168,1088,784,32
256,672,416,-480,-80,544,240,1232,1152,1136,1056,736,80
240,640,384,-464,-80,512,240,1184,1120,1104,1024,704,112
