1429614074057,82,-0.0329209,-0.136237,0.0121588,8
1429614074069,82,0.00228719,-0.162994,0.0119473,4
1429614074110,82,0.0388619,-0.181747,0.0114309,0
1429614074152,82,0.072435,-0.176581,0.00981709,0
1429614074164,82,0.0753649,-0.112858,0.00484501,0
1429614074207,82,0.0618945,0.0178652,-0.00312676,0
1429614074218,82,0.0337357,0.200069,-0.0132785,0
1429614074260,82,-0.018813,0.392529,-0.0244638,0
1429614074272,82,-0.0573374,0.510347,-0.0310552,0
1429614074313,82,-0.0855385,0.521813,-0.0315541,0
1429614074325,82,-0.0889518,0.430739,-0.0254368,0
1429614074366,82,-0.0730316,0.280162,-0.0152749,38
1429614074378,82,-0.046268,0.135497,-0.00510079,38
1429614074420,82,-0.0316971,0.0334171,0.00176634,74
1429614074435,82,-0.029329,-0.0224792,0.00514916,76
1429614074478,83,-0.0477254,-0.0358976,0.00452766,70
1429614074504,83,-0.0815879,-0.0408043,0.00230038,56
1429614074534,83,-0.106041,-0.0370437,-0.000329756,42
1429614074576,83,-0.106661,-0.032503,-0.0019171,32
1429614074602,83,-0.0644326,-0.0201883,-0.0016978,26
1429614074643,83,0.000553833,-0.0158046,0.00046251,21
1429614074670,83,0.0666506,-0.0383292,0.00474353,13
1429614074712,83,0.11413,-0.0612652,0.00818451,2
1429614074734,83,0.122846,-0.0860514,0.0099722,0
1429614074776,83,0.0967413,-0.101067,0.0094789,0
1429614074802,83,0.0557141,-0.10726,0.0077854,0
1429614074843,83,0.00241724,-0.0943601,0.00424751,0
1429614074870,83,-0.0449724,-0.0715521,0.000504026,0
1429614074911,83,-0.0741586,-0.0322935,-0.00312297,0
1429614074934,83,-0.079764,-0.016748,-0.00384458,0
1429614074970,83,-0.0514365,-0.0281342,-0.000766553,0
1429614075011,83,0.00138842,-0.0768635,0.00611976,0
1429614075034,83,0.0600107,-0.130923,0.0136469,44
1429614075072,83,0.107852,-0.165231,0.0191018,77
1429614075102,83,0.119947,-0.142115,0.0184353,44
1429614075221,83,0.0890737,-0.079388,0.0123011,42
1429614075262,83,0.0416446,-0.00917651,0.0043666,40
1429614075273,83,-0.00216278,0.0373788,-0.00199933,40
1429614075315,83,-0.0191466,0.0635847,-0.0052667,40
1429614075328,83,-0.0220956,0.0791551,-0.00687348,39
1429614075342,83,-0.0163561,0.0925607,-0.00770592,38
1429614075354,83,-0.0265345,0.101977,-0.00930841,36
1429614075396,83,-0.037422,0.124013,-0.0115604,32
1429614075407,83,-0.0525221,0.135296,-0.0134165,30
1429614075449,83,-0.068164,0.152186,-0.0154934,26
1429614075470,83,-0.046489,0.115206,-0.0115062,22
1429614075502,83,-0.00886288,0.0446581,-0.00397055,18
1429614075534,83,0.0354332,-0.0514044,0.0058148,14
1429614075575,83,0.053987,-0.132086,0.0127974,16
1429614075617,83,0.0369501,-0.168807,0.0142034,40
1429614075658,83,-0.00466937,-0.161037,0.0108082,57
1429614075701,83,-0.0464541,-0.124573,0.00536724,62
1429614075742,83,-0.065743,-0.0836052,0.0011662,58
1429614075784,83,-0.0595249,-0.0535669,-0.000478842,49
1429614075826,83,-0.0363003,-0.0364881,-9.51866e-06,46
1429614075868,83,-0.000242594,-0.0167618,0.00116409,45
1429614075909,83,0.0272133,0.00534023,0.00156449,45
1429614075951,83,0.0419986,0.0173232,0.00182205,42
1429614075993,83,0.038486,0.0370094,0.000169162,40
1429614076035,83,0.0318077,0.0439483,-0.000784368,35
1429614076076,83,0.0240082,0.044132,-0.0013555,31
1429614076088,83,0.0191411,0.0439236,-0.00170208,29
1429614076100,83,0.0118799,0.0421045,-0.00211592,29
1429614076142,83,-0.00209002,0.0403866,-0.00302153,25
1429614076184,83,-0.00488949,0.0246486,-0.00212252,40
1429614076225,83,-0.00368717,0.00550827,-0.000674511,53
1429614076267,83,0.00145817,0.00205099,-7.62125e-05,63
1429614076308,83,-0.00608968,0.00520674,-0.000857938,61
1429614076350,83,-0.0299203,0.000901137,-0.00227553,56
1429614076392,83,-0.0711574,-0.00108259,-0.00508911,47
1429614076433,83,-0.115012,-0.0203539,-0.00690429,43
1429614076475,83,-0.15441,-0.0240383,-0.00944282,40
1429614076517,83,-0.152868,-0.0254057,-0.00927278,38
1429614076558,83,-0.11405,-0.0179426,-0.0069991,32
1429614076600,83,-0.0411436,-0.00556075,-0.00260549,29
1429614076641,83,0.0348295,0.000374054,0.00250568,24
1429614076683,83,0.0898693,0.0132734,0.00558785,22
1429614076725,83,0.117695,0.0259288,0.00671312,20
1429614076736,83,0.142327,0.027986,0.0084347,19
1429614076748,83,0.150358,0.0334204,0.00861564,19
1429614076790,83,0.143241,0.0272044,0.0086158,32
1429614076831,83,0.11358,0.0321997,0.0060305,49
1429614076873,83,0.0805685,0.0286766,0.00386068,71
1429614076915,83,0.046227,0.0190532,0.00203189,73
1429614076956,83,0.0208177,0.00441105,0.00123472,68
1429614076998,83,0.024789,-0.0118709,0.00273103,63
1429614077040,83,0.0633428,-0.0445816,0.0080358,57
1429614077082,83,0.115316,-0.0784054,0.014471,55
1429614077127,83,0.116478,-0.0808747,0.0147412,52
1429614077139,83,0.0551452,-0.0516378,0.00804263,51
1429614077180,83,-0.0792631,0.0157132,-0.00714403,48
1429614077222,83,-0.206278,0.0891074,-0.022456,43
1429614077264,83,-0.316466,0.16586,-0.0367977,40
1429614077305,83,-0.353223,0.198245,-0.0425595,37
1429614077347,83,-0.319263,0.19273,-0.0399297,36
1429614077388,83,-0.233629,0.148213,-0.0300237,34
1429614077430,83,-0.123155,0.0719922,-0.0155863,33
1429614077472,83,-0.021086,-0.0181784,-0.000214273,37
1429614077514,83,0.0458674,-0.0762022,0.0100832,48
1429614077555,83,0.0753297,-0.0941918,0.0141765,68
1429614077596,83,0.0917548,-0.0666545,0.0133708,73
1429614077638,83,0.114448,-0.0320754,0.0125391,70
1429614077679,84,0.147266,-0.00579777,0.0132434,64
1429614077721,84,0.181861,-0.00118396,0.0160005,52
1429614077763,84,0.192852,-0.0261851,0.0193993,43
1429614077804,84,0.158737,-0.063706,0.0197832,34
1429614077846,84,0.0958375,-0.123249,0.0197078,32
1429614077888,84,0.0328878,-0.176338,0.0189191,29
1429614077929,84,-0.00305473,-0.211696,0.0189208,29
1429614077972,84,0.0147976,-0.232539,0.022659,29
1429614077985,84,0.0582868,-0.216676,0.0251957,29
1429614078026,84,0.0958994,-0.167246,0.0241169,29
1429614078068,84,0.103009,-0.0903138,0.0177047,30
1429614078109,84,0.0701611,-0.0132204,0.00766056,30
1429614078151,84,0.0304975,0.0368833,-0.0005344,29
1429614078163,84,-0.00870831,0.0628074,-0.00644202,29
1429614078205,84,-0.0278865,0.0607531,-0.0080022,28
1429614078246,84,-0.0195029,0.043922,-0.00573662,28
1429614078288,84,0.0110168,0.0181455,-0.000649741,27
1429614078330,84,0.0394979,0.00353382,0.00328013,27
1429614078372,84,0.0350001,0.0222159,0.0011474,40
1429614078414,84,-0.0178156,0.0759834,-0.00868552,53
1429614078455,84,-0.0970319,0.167939,-0.0244455,63
1429614078497,84,-0.175386,0.262149,-0.0403407,63
1429614078538,84,-0.212717,0.312475,-0.0485871,60
1429614078580,84,-0.20651,0.305101,-0.0472326,55
1429614078622,84,-0.174645,0.229522,-0.0374228,52
1429614078664,84,-0.13156,0.115824,-0.0229653,51
1429614078705,84,-0.0840276,0.00419455,-0.00818393,52
1429614078746,84,-0.0364168,-0.0810617,0.00419022,50
1429614078788,84,0.0103467,-0.114225,0.0116596,48
1429614078830,84,0.0590135,-0.123185,0.0171876,44
1429614078841,84,0.103193,-0.10309,0.0194372,43
1429614078882,84,0.133037,-0.0811969,0.020242,40
1429614078894,84,0.126132,-0.0583635,0.0174445,39
1429614078935,84,0.0939659,-0.0477362,0.0134437,36
1429614078947,84,0.04428,-0.0526617,0.0092319,34
1429614078990,84,-0.0086862,-0.0654723,0.00540708,31
1429614079032,84,-0.0511663,-0.0630416,0.00112468,26
1429614079043,84,-0.0683268,-0.0601437,-0.000783725,25
1429614079085,84,-0.0509654,-0.0478983,-0.000300839,23
1429614079127,84,-0.00495297,-0.0282889,0.0022255,21
1429614079139,84,0.060893,-0.0194103,0.00772626,21
1429614079181,84,0.107225,-0.0160775,0.0119196,21
1429614079192,84,0.117608,-0.00850801,0.0122224,25
1429614079234,84,0.0838051,0.0180226,0.00635692,37
1429614079246,84,0.0118116,0.0657454,-0.00521625,43
1429614079288,84,-0.0711526,0.114907,-0.0179851,56
1429614079302,84,-0.125688,0.136162,-0.0253668,59
1429614079344,84,-0.140731,0.116083,-0.0249283,58
1429614079370,84,-0.117569,0.0591259,-0.0171863,56
1429614079411,84,-0.0864573,-0.00606684,-0.00781823,50
1429614079435,84,-0.049745,-0.056518,0.000668529,48
1429614079470,84,-0.0249474,-0.0514331,0.00259084,44
1429614079502,84,-0.00778388,-0.00923587,0.000143957,42
1429614079534,84,0.00806285,0.0511487,-0.00422736,40
1429614079570,84,0.0309017,0.0914151,-0.00594576,40
1429614079602,84,0.0690781,0.0874392,-0.00180884,38
1429614079634,84,0.112586,0.042377,0.00692003,35
1429614079670,84,0.14065,-0.00779665,0.0146183,32
1429614079702,84,0.141902,-0.0520741,0.0191966,29
1429614079734,84,0.105349,-0.0758565,0.0179527,26
1429614079770,84,0.041848,-0.062011,0.0102243,22
1429614079811,84,-0.00774884,-0.0448197,0.0036547,18
1429614079853,84,-0.0259354,-0.0411974,0.00150685,17
1429614079895,84,-0.00789718,-0.0619158,0.00534328,14
1429614079936,84,0.0142334,-0.090125,0.0103275,13
1429614079977,84,0.0235778,-0.110535,0.013321,12
1429614080019,84,0.0240587,-0.101233,0.0124629,11
1429614080060,84,0.0120574,-0.0705175,0.00826383,19
1429614080102,84,-0.00200618,-0.00899377,0.000698112,31
1429614080144,84,-0.0126833,0.0606617,-0.00734195,46
1429614080186,84,-0.032708,0.119622,-0.0152358,47
1429614080227,84,-0.0626668,0.139515,-0.0202623,44
1429614080269,84,-0.100995,0.111173,-0.0212692,42
1429614080311,84,-0.139585,0.0553405,-0.0194893,40
1429614080352,84,-0.157435,-0.010717,-0.0146748,40
1429614080394,84,-0.153543,-0.0582428,-0.00951226,41
1429614080435,84,-0.122884,-0.0891734,-0.00336532,40
1429614080477,84,-0.0746875,-0.100648,0.00258854,40
1429614080518,84,-0.0227456,-0.104637,0.00818193,39
1429614080560,84,0.0215773,-0.0990077,0.0120393,39
1429614080602,84,0.0614877,-0.0869668,0.0148502,38
1429614080643,84,0.0703511,-0.0508587,0.012061,38
1429614080684,84,0.0735822,-0.0148791,0.00884519,36
1429614080726,84,0.0689869,0.0201105,0.00488693,29
1429614080768,84,0.0640548,0.0507273,0.00132781,23
1429614080810,84,0.0751286,0.0640678,0.00110179,19
1429614080852,84,0.11602,0.0578143,0.00581765,16
1429614080893,84,0.164444,0.0453305,0.0119135,21
1429614080935,84,0.193277,0.0394697,0.0153853,30
1429614080976,84,0.179594,0.0503254,0.0129223,40
1429614081017,84,0.141436,0.0610398,0.00807284,40
1429614081059,84,0.0944429,0.0695229,0.00250774,36
1429614081101,84,0.0560809,0.0549301,0.000116261,29
1429614081142,84,0.0256907,0.0364985,-0.00109738,27
1429614081184,84,-0.00235498,0.0101216,-0.00127364,27
1429614081226,84,-0.0485654,-0.00290059,-0.00465589,28
1429614081268,84,-0.105565,-0.0255106,-0.00823992,27
1429614081314,84,-0.197361,-0.0355219,-0.0166536,24
1429614081325,84,-0.265095,-0.0375073,-0.0234672,24
1429614081367,84,-0.298178,-0.0185543,-0.028745,22
1429614081408,84,-0.277457,0.00737625,-0.0292657,22
1429614081450,84,-0.224702,0.0161552,-0.0248037,22
1429614081492,84,-0.157398,0.00629162,-0.0168386,23
1429614081534,84,-0.0940068,-0.024586,-0.00715877,23
1429614081576,84,-0.0180618,-0.0520571,0.00350338,23
1429614081618,84,0.0559137,-0.0604298,0.0119888,26
1429614081659,84,0.124746,-0.048202,0.0178383,34
1429614081701,84,0.186634,-0.0225575,0.0215588,44
1429614081743,84,0.221323,-0.00107669,0.0229167,45
1429614081785,84,0.216093,-0.00064653,0.0223834,40
1429614081827,84,0.175335,-0.00172557,0.018178,38
1429614081868,84,0.105852,-0.0233835,0.0133345,37
1429614081910,84,0.0118793,-0.0413134,0.00548881,38
1429614081952,84,-0.0597353,-0.0515069,-0.000848768,39
1429614081999,84,-0.096245,-0.040313,-0.00577472,39
1429614082010,84,-0.0765348,-0.00488098,-0.00738306,39
1429614082052,84,-0.0232759,0.0287427,-0.00538117,38
1429614082094,84,0.0416585,0.0629379,-0.00219145,37
1429614082136,84,0.0838148,0.0698851,0.00143683,37
1429614082177,84,0.0910011,0.0565995,0.00355596,38
1429614082219,84,0.0620524,0.0245712,0.00388185,39
1429614082260,84,0.0160187,-0.00439822,0.00211469,39
1429614082302,84,-0.0418531,-0.00341029,-0.00397204,41
1429614082344,84,-0.0783002,0.024787,-0.0105955,47
1429614082385,84,-0.0872712,0.0506585,-0.0142056,54
1429614082427,84,-0.0503193,0.0485273,-0.0101736,52
1429614082469,84,0.0248717,-0.00427532,0.00301977,46
1429614082510,84,0.0827172,-0.086943,0.017673,41
1429614082552,84,0.0868918,-0.135483,0.0230849,40
1429614082593,84,0.0468473,-0.129266,0.0183429,39
1429614082635,84,-0.0182283,-0.0719247,0.00562153,40
1429614082676,84,-0.0762795,0.0301669,-0.0110977,40
1429614082720,84,-0.0898002,0.107647,-0.0206698,40
1429614082732,84,-0.0716945,0.130363,-0.0212994,40
1429614082773,84,-0.0170752,0.0870456,-0.011043,40
1429614082817,84,0.0309575,0.0390296,-0.000850146,39
1429614082832,84,0.0404009,0.0012074,0.00415504,39
1429614082874,84,-0.0019769,-0.0031581,0.000125592,38
1429614082921,84,-0.0776481,0.00623887,-0.00891672,37
1429614082933,84,-0.144293,0.0187355,-0.0173658,37
1429614082979,84,-0.152136,0.020198,-0.0184149,40
1429614082991,84,-0.100333,0.0173466,-0.0125963,41
1429614083032,84,-0.0125167,0.0136064,-0.00280375,48
1429614083074,84,0.0541158,0.0167543,0.00401168,48
1429614083115,84,0.0751018,0.0320724,0.00461046,47
1429614083157,84,0.0580534,0.0357078,0.00240531,41
1429614083198,84,0.0123441,0.0294593,-0.0018395,36
1429614083240,84,-0.01963,0.00426434,-0.00257411,36
1429614083281,84,-0.0298921,-0.023752,-0.000633172,37
1429614083323,84,-0.0197941,-0.0350274,0.00156059,37
1429614083365,84,0.00571363,-0.0268313,0.00331742,36
1429614083407,84,0.0294941,-0.014846,0.00450148,36
1429614083448,84,0.0673715,-0.028077,0.00971014,35
1429614083490,84,0.0853967,-0.0351372,0.0120926,32
1429614083532,84,0.0958233,-0.0499742,0.0145691,31
1429614083544,84,0.0856456,-0.0504737,0.0134696,30
1429614083585,84,0.0841602,-0.0496954,0.0131674,35
1429614083627,84,0.0824049,-0.0403273,0.0119294,45
1429614083669,84,0.0919805,-0.037778,0.0125137,60
1429614083711,84,0.109758,-0.0490231,0.0152425,61
1429614083752,84,0.114472,-0.0586703,0.0164595,53
1429614083793,84,0.0982972,-0.0653633,0.0154846,48
1429614083835,84,0.0519817,-0.0465374,0.00924511,44
1429614083876,84,-0.0137044,-0.00714111,-0.000612717,43
1429614083918,84,-0.0902307,0.0438855,-0.012444,43
1429614083960,84,-0.147041,0.0874048,-0.0216596,42
1429614083971,84,-0.174667,0.108075,-0.0260439,40
1429614084013,84,-0.178683,0.103175,-0.0258792,39
1429614084054,84,-0.168528,0.0939454,-0.0240137,35
1429614084096,84,-0.146926,0.0889085,-0.0215355,33
1429614084138,84,-0.110838,0.0988499,-0.0190875,32
1429614084179,84,-0.0672563,0.10501,-0.0156421,31
1429614084221,84,-0.0175902,0.0936131,-0.0100795,35
1429614084263,84,0.0281686,0.0532099,-0.00226919,47
1429614084305,84,0.0606127,-0.00820231,0.00623319,68
1429614084347,84,0.0890965,-0.089877,0.016346,73
1429614084388,84,0.0950758,-0.146392,0.0220551,70
1429614084430,84,0.0737749,-0.16417,0.0218216,66
1429614084477,84,0.0351491,-0.122598,0.0144528,61
1429614084488,84,-0.0190037,-0.0439876,0.00229277,59
1429614084530,84,-0.0502017,0.0422861,-0.00848549,58
1429614084571,84,-0.0516925,0.0951066,-0.0135007,56
1429614084613,84,-0.0207473,0.103605,-0.0114391,54
1429614084657,84,0.028429,0.0701271,-0.0038421,49
1429614084669,84,0.06472,0.0262731,0.00353388,47
1429614084711,84,0.0758591,-0.0210002,0.00894239,43
1429614084756,84,0.055306,-0.0475893,0.00948944,36
1429614084768,84,0.0251614,-0.0619697,0.00805441,33
1429614084810,84,0.0093644,-0.0617281,0.00659775,26
1429614084851,84,0.0134291,-0.04686,0.00558872,18
1429614084893,84,0.0410847,-0.034686,0.007062,14
1429614084934,84,0.0594257,-0.0188599,0.0072997,10
1429614084976,84,0.0630732,-0.00507689,0.0063878,14
1429614085017,84,0.0382162,0.0213907,0.00157313,30
1429614085059,84,-0.00103556,0.0447072,-0.00428338,57
1429614085100,84,-0.0481611,0.060983,-0.010194,66
1429614085142,84,-0.0705555,0.0527956,-0.0115516,66
1429614085184,84,-0.0827952,0.0153476,-0.00918939,65
1429614085225,84,-0.0901262,-0.0319177,-0.00544393,64
1429614085267,84,-0.101654,-0.0748406,-0.00251045,64
1429614085309,84,-0.1084,-0.092314,-0.00150753,66
1429614085351,84,-0.106335,-0.0719908,-0.00320021,65
1429614085392,84,-0.0694472,-0.0345234,-0.00325467,60
1429614085434,84,-0.016792,-0.00858232,-0.000767595,57
1429614085476,84,0.0310407,0.00293716,0.00262538,54
1429614085517,84,0.0552746,-0.00119427,0.00528524,52
1429614085559,84,0.0481276,0.00744614,0.00379049,50
1429614085601,84,0.0363932,0.0283366,0.000750583,50
1429614085643,84,0.0438049,0.0517029,-0.000737659,48
1429614085686,84,0.0679589,0.0633613,0.000428937,46
1429614085728,84,0.119139,0.060443,0.00549787,42
1429614085769,84,0.164288,0.0518465,0.0105549,39
1429614085811,84,0.200916,0.0387058,0.01534,42
1429614085852,84,0.198637,0.0285961,0.0161605,53
1429614085894,84,0.155645,0.018949,0.0130842,74
1429614085936,84,0.107019,-0.00639578,0.0109983,80
1429614085977,84,0.0572497,-0.031126,0.00865018,77
1429614086018,84,0.0255802,-0.0566981,0.008151,71
1429614086060,84,-0.0204533,-0.0616034,0.00411813,63
1429614086102,84,-0.065805,-0.0522795,-0.00136843,58
1429614086115,84,-0.124421,-0.0308571,-0.00957383,57
1429614086156,84,-0.181476,-0.00949053,-0.0177745,53
1429614086198,84,-0.225786,0.0114347,-0.0247068,50
1429614086244,84,-0.251223,0.0365604,-0.0301305,45
1429614086255,84,-0.24716,0.054918,-0.0318735,43
1429614086296,84,-0.212391,0.0604267,-0.0289661,41
1429614086338,84,-0.153885,0.0494861,-0.0216898,38
1429614086380,84,-0.0749987,0.0178401,-0.01001,36
1429614086422,84,0.0167128,-0.0247908,0.00450488,31
1429614086464,84,0.0889414,-0.0592857,0.0162256,27
1429614086506,84,0.147362,-0.0759404,0.0246781,20
1429614086548,84,0.168976,-0.0708372,0.0267462,16
1429614086560,84,0.165282,-0.0467146,0.02385,14
1429614086605,84,0.140084,-0.0104694,0.0170623,7
1429614086617,84,0.120037,0.00829071,0.0128144,7
1429614086659,84,0.107948,0.00142452,0.0123726,7
1429614086700,84,0.0882447,-0.0287037,0.0137311,21
1429614086742,84,0.0579804,-0.056694,0.0136099,46
1429614086783,84,0.0133765,-0.0518335,0.00778805,53
1429614086825,84,-0.0418451,-0.000599375,-0.00494566,53
1429614086867,84,-0.0921366,0.068453,-0.0193989,51
1429614086909,84,-0.13,0.133015,-0.0318335,48
1429614086921,84,-0.143633,0.14759,-0.035418,48
1429614086962,84,-0.13221,0.113311,-0.029926,50
1429614087004,84,-0.104772,0.0501498,-0.0188636,52
1429614087045,84,-0.0714395,-0.0228686,-0.00593648,51
1429614087087,84,-0.0443336,-0.0829934,0.00473568,48
1429614087129,84,-0.0251197,-0.12276,0.0120211,40
1429614087141,84,0.00980689,-0.151261,0.0199718,39
1429614087183,84,0.035301,-0.141599,0.0218631,34
1429614087194,84,0.0445651,-0.117557,0.0201265,32
1429614087236,84,0.0304626,-0.0557325,0.0106412,28
1429614087248,84,0.00903736,-0.00199466,0.00136654,27
1429614087289,84,-0.0123445,0.0379549,-0.00625037,24
1429614087331,84,-0.0209692,0.0547475,-0.00942126,21
1429614087343,84,-0.0128859,0.0661312,-0.00980129,20
1429614087385,84,0.0281011,0.059254,-0.00388756,18
1429614087397,84,0.0861711,0.052768,0.00417187,17
1429614087438,84,0.132266,0.0518352,0.0100446,16
1429614087480,84,0.141739,0.0665229,0.00937902,13
1429614087492,84,0.116068,0.074861,0.00515849,11
1429614087533,84,0.0830125,0.0553299,0.0034836,11
1429614087545,84,0.0463726,0.0222409,0.0030377,15
1429614087586,84,0.0271443,-0.0202793,0.00601274,28
1429614087602,84,0.00365244,-0.0288835,0.00412532,37
1429614087643,84,-0.0309804,-0.000618301,-0.00384867,56
1429614087670,84,-0.074761,0.0423433,-0.0148584,59
1429614087711,84,-0.122178,0.074909,-0.0249775,57
1429614087734,84,-0.132404,0.0508089,-0.0234298,55
1429614087775,84,-0.124748,0.0151066,-0.0177342,53
1429614087802,84,-0.0963636,-0.0319689,-0.00817925,54
1429614087837,84,-0.0652925,-0.0639583,-0.000169936,55
1429614087879,84,-0.0382709,-0.0677342,0.00373193,54
1429614087902,84,-0.0192709,-0.0544326,0.00444922,53
1429614087944,84,-0.0111013,-0.0396675,0.00361631,46
1429614087970,84,-0.013568,-0.027505,0.00176085,43
1429614088011,84,-0.0163529,-0.0209564,0.000579331,35
1429614088037,84,-0.00435219,-0.0224981,0.00227764,31
1429614088079,84,0.0206069,-0.0310185,0.00647611,22
1429614088102,84,0.0576744,-0.0429671,0.0126009,19
1429614088143,84,0.0953796,-0.0588939,0.0193446,12
1429614088170,84,0.113609,-0.0645967,0.0223483,8
1429614088212,84,0.110062,-0.0499949,0.0200614,0
1429614088237,84,0.0927763,-0.0249364,0.0148536,0
1429614088279,84,0.0586727,0.0364677,0.00278317,0
1429614088320,84,0.0288264,0.0886607,-0.00753083,0
1429614088362,84,0.022463,0.125108,-0.0129075,0
1429614088403,84,0.0328548,0.121197,-0.0111439,0
1429614088445,84,0.0521374,0.086778,-0.00438141,23
1429614088486,84,0.0448408,0.0534335,-0.0010797,37
1429614088528,84,-0.00970137,0.041954,-0.00647653,40
1429614088570,84,-0.0887669,0.0571592,-0.018176,40
1429614088611,84,-0.166219,0.086595,-0.0311272,38
1429614088654,84,-0.202542,0.0946987,-0.0363275,38
1429614088696,84,-0.164797,0.0483352,-0.0259527,40
1429614088737,84,-0.077431,-0.029986,-0.00572257,41
1429614088779,84,0.0151341,-0.0957303,0.0131437,40
1429614088821,84,0.0666111,-0.117537,0.0215142,40
1429614088862,84,0.064102,-0.101348,0.0191453,36
1429614088903,84,0.0243466,-0.0699609,0.010773,34
1429614088945,84,-0.0199358,-0.0493365,0.00330773,31
1429614088987,84,-0.0438003,-0.0483457,0.000504616,30
1429614089029,84,-0.0312654,-0.0633715,0.00350565,29
1429614089070,84,0.011115,-0.06423,0.00807722,28
1429614089112,84,0.0657126,-0.0426748,0.0114385,26
1429614089154,84,0.108902,-0.0080316,0.012169,28
1429614089196,84,0.123469,0.0353095,0.00902506,47
1429614089238,84,0.11644,0.0409974,0.00770367,65
1429614089280,84,0.0935317,0.0336574,0.00603727,77
1429614089323,84,0.0525999,0.0261441,0.00263754,74
1429614089366,84,0.00367236,0.04433,-0.00400942,65
1429614089407,84,-0.0425468,0.0758114,-0.0116338,59
1429614089450,84,-0.0875424,0.113779,-0.0195545,55
1429614089492,84,-0.0996232,0.116971,-0.0210318,54
1429614089540,84,-0.0866554,0.0789596,-0.0160743,53
1429614089553,84,-0.031773,-0.000912536,-0.00301161,52
1429614089596,84,0.0312438,-0.0748073,0.0103494,48
1429614089642,84,0.0598994,-0.100727,0.0156545,46
1429614089654,84,0.0364019,-0.0574947,0.00912434,44
1429614089695,84,-0.0173918,0.0147075,-0.00313257,40
1429614089737,84,-0.0805176,0.0826539,-0.0159141,38
1429614089779,84,-0.122267,0.110971,-0.0227056,36
1429614089821,84,-0.135526,0.0896798,-0.0219214,36
1429614089863,84,-0.107977,0.0260771,-0.0130964,34
1429614089907,84,-0.0518488,-0.0440846,-0.000758147,34
1429614089919,84,0.0274184,-0.101438,0.0126403,35
1429614089960,84,0.0843894,-0.116024,0.01964,46
1429614090001,84,0.102313,-0.0999233,0.0198775,76
1429614090043,84,0.08312,-0.0619938,0.0142531,89
1429614090085,84,0.0475084,-0.0265215,0.00726598,87
1429614090127,84,0.0248632,-0.0184262,0.00427593,80
1429614090169,84,0.0048676,-0.0356742,0.00402866,71
1429614090210,84,-0.0120289,-0.0634819,0.00514708,65
1429614090252,84,-0.035776,-0.0758202,0.00402411,60
1429614090296,84,-0.052337,-0.0622596,0.00100366,56
1429614090308,84,-0.0599586,-0.0196431,-0.00410598,56
1429614090349,84,-0.0500196,0.0352316,-0.00872899,49
1429614090391,84,-0.026007,0.0772802,-0.0106472,43
1429614090432,84,0.0169197,0.0995748,-0.00855165,35
1429614090474,84,0.0585205,0.0993705,-0.00424565,28
1429614090516,84,0.0829652,0.0808446,0.00022153,18
1429614090557,84,0.093065,0.0406799,0.00549466,12
1429614090599,84,0.0829404,-0.00485135,0.00922254,4
1429614090640,84,0.0714149,-0.0588778,0.0138035,0
1429614090682,84,0.0550721,-0.0916303,0.0155701,0
1429614090724,84,0.03668,-0.0892742,0.0133774,0
1429614090766,84,0.0262901,-0.0376839,0.00674167,24
1429614090778,84,0.0314729,0.0203717,0.00117207,24
1429614090820,84,0.0513066,0.05621,-0.000517346,43
1429614090832,84,0.0697621,0.0546601,0.00158713,43
1429614090873,84,0.0701601,0.0239225,0.00485083,41
1429614090915,84,0.0466428,-0.0166684,0.00663202,37
1429614090957,84,-0.0110207,-0.0369644,0.00270386,36
1429614090998,84,-0.0631542,-0.0315522,-0.00328584,36
1429614091040,84,-0.0997597,-0.000797427,-0.0102682,40
1429614091093,84,-0.11709,0.0416269,-0.0163918,44
1429614091108,84,-0.116273,0.0791255,-0.0200162,45
1429614091121,84,-0.093113,0.077559,-0.0174885,45
1429614091165,84,-0.0591363,0.0510143,-0.0111864,43
1429614091177,84,-0.0202692,0.00178426,-0.00222733,43
1429614091219,84,0.0135557,-0.0606779,0.00752004,41
1429614091260,84,0.0330578,-0.0968897,0.0131076,40
1429614091302,84,0.0339348,-0.0994462,0.0134155,40
1429614091347,84,0.0230731,-0.0695111,0.00929823,39
1429614091359,84,0.00792662,-0.0271022,0.00351374,39
1429614091400,84,0.0110393,0.00344426,0.000763354,35
1429614091442,84,0.0066401,0.0300791,-0.00234116,35
1429614091484,84,-0.00344293,0.0433636,-0.00466878,54
1429614091525,84,-0.0284178,0.0457404,-0.00737661,75
1429614091567,84,-0.0647544,0.0334286,-0.00974627,91
1429614091615,84,-0.0842567,0.00910314,-0.00925194,88
1429614091627,84,-0.0761677,-0.0281082,-0.00477607,85
1429614091669,84,-0.0274822,-0.0590722,0.00313528,75
1429614091682,84,0.0319304,-0.066186,0.00971926,75
1429614091723,84,0.0764133,-0.0416752,0.0116874,66
1429614091765,84,0.0842407,0.0131969,0.00700661,62
1429614091806,84,0.0389029,0.0693393,-0.00300187,58
1429614091848,84,-0.0427695,0.112618,-0.0151902,53
1429614091860,84,-0.123491,0.107672,-0.0225169,51
1429614091902,84,-0.167109,0.0480402,-0.0210053,42
1429614091914,84,-0.137455,-0.046018,-0.00894593,42
1429614091955,84,-0.0656591,-0.124496,0.00572421,34
1429614091966,84,0.0326393,-0.177625,0.0205797,31
1429614092007,84,0.110595,-0.176479,0.0281278,26
1429614092019,84,0.13581,-0.118467,0.0249045,23
1429614092061,84,0.133774,-0.0315324,0.0162626,19
1429614092072,84,0.113478,0.0676895,0.00451213,17
1429614092114,84,0.0939374,0.146642,-0.00519462,15
1429614092137,84,0.0806366,0.189335,-0.0107004,14
1429614092179,84,0.0646427,0.188628,-0.0121601,15
1429614092202,84,0.0585983,0.135718,-0.00755833,27
1429614092243,84,0.0534809,0.0446328,0.000866021,46
1429614092270,84,0.0576782,-0.0764625,0.0131664,64
1429614092312,84,0.0649181,-0.180342,0.0240629,72
1429614092337,84,0.0474362,-0.212609,0.0253709,70
1429614092379,84,0.0404983,-0.206631,0.0244368,65
1429614092402,84,-0.00365358,-0.124764,0.0119009,58
1429614092443,84,-0.0577887,-0.0272917,-0.00300725,53
1429614092470,84,-0.12503,0.0781385,-0.019958,50
1429614092512,84,-0.170372,0.140158,-0.0306184,49
1429614092537,84,-0.19322,0.159896,-0.0348028,48
1429614092579,84,-0.185769,0.148772,-0.0329391,45
1429614092620,84,-0.145825,0.118499,-0.026134,39
1429614092662,84,-0.103218,0.108077,-0.0207668,35
1429614092703,84,-0.0473759,0.096646,-0.0141927,29
1429614092749,84,0.0179276,0.07146,-0.00527868,27
1429614092761,84,0.0788378,0.0323495,0.00458681,26
1429614092803,84,0.109795,-0.0171133,0.0125182,24
1429614092844,84,0.110522,-0.0616292,0.0170467,23
1429614092886,84,0.0763422,-0.0789115,0.0153894,24
1429614092927,84,0.0206655,-0.0550615,0.00747226,34
1429614092969,84,-0.0335036,-0.00427895,-0.00286455,57
1429614093010,84,-0.0495128,0.0314301,-0.00794029,64
1429614093052,84,-0.0155942,0.0312504,-0.00458681,52
1429614093093,84,0.0584315,-0.0271457,0.00841786,40
1429614093136,84,0.112145,-0.095103,0.0203156,29
1429614093150,84,0.124043,-0.159422,0.0279799,29
1429614093191,84,0.0848219,-0.170201,0.025186,29
1429614093233,84,0.026445,-0.112464,0.0136798,34
1429614093274,84,-0.0186553,-0.0191772,5.05415e-05,40
1429614093316,84,-0.0426444,0.0850449,-0.0125713,43
1429614093358,84,-0.0453668,0.141709,-0.0184833,43
1429614093400,84,-0.0443815,0.150215,-0.0191912,41
1429614093441,84,-0.0415347,0.114934,-0.0154186,40
1429614093483,84,-0.0417564,0.0671919,-0.010705,41
1429614093525,84,-0.034482,0.0108025,-0.00446624,41
1429614093567,84,-0.0143311,-0.0328166,0.00182299,40
1429614093608,84,0.0142821,-0.0469257,0.00601419,44
1429614093650,84,0.0441587,-0.0435756,0.00861963,57
1429614093691,84,0.0693321,-0.0449745,0.0112595,85
1429614093733,84,0.0773813,-0.0485844,0.0123928,93
1429614093775,84,0.0655449,-0.0415478,0.0104979,87
1429614093816,84,0.0333234,-0.0303826,0.00624822,78
1429614093858,84,0.00619926,-0.0167357,0.00224925,68
1429614093899,84,-0.0180776,-0.00865662,-0.000925809,63
1429614093941,84,-0.0389405,-0.00414893,-0.0034187,59
1429614093982,84,-0.0475436,-0.00887652,-0.00381993,55
1429614094024,84,-0.0506945,-0.00459583,-0.00456891,48
1429614094065,84,-0.0497716,0.0341256,-0.00827459,42
1429614094107,84,-0.04983,0.0925866,-0.0140556,37
1429614094149,84,-0.0406535,0.150701,-0.0189165,34
1429614094190,84,-0.0170986,0.172533,-0.01876,31
1429614094232,84,0.0106378,0.159552,-0.0147008,31
1429614094273,84,0.0636762,0.0938444,-0.00299047,31
1429614094315,84,0.0947994,0.00262289,0.00917355,31
1429614094357,84,0.0943607,-0.0777029,0.0171378,47
1429614094398,84,0.0566259,-0.118024,0.0174189,69
1429614094440,84,-0.0083032,-0.0977998,0.00890774,94
1429614094481,84,-0.0640976,-0.0442763,-0.00197164,94
1429614094523,84,-0.0993954,0.0155211,-0.0114017,84
1429614094564,84,-0.113491,0.0357988,-0.0148052,75
1429614094606,84,-0.108127,0.0081738,-0.011501,65
1429614094650,84,-0.0980082,-0.0504001,-0.0046935,61
1429614094661,84,-0.0817147,-0.113362,0.00311632,60
1429614094703,84,-0.0292604,-0.167796,0.0136689,56
1429614094744,84,0.0239429,-0.186672,0.0207828,48
1429614094786,84,0.0739046,-0.162382,0.0233118,43
1429614094828,84,0.0808739,-0.0960809,0.0174724,37
1429614094840,84,0.0644956,-0.0087248,0.00723442,35
1429614094881,84,0.0193588,0.0821877,-0.00618936,32
1429614094923,84,-0.0226251,0.149603,-0.0169339,27
1429614094935,84,-0.0335837,0.165556,-0.0195965,27
1429614094976,84,0.00119309,0.124972,-0.012218,22
1429614095018,84,0.0694562,0.0517398,0.0017479,19
1429614095060,84,0.123443,-0.0137246,0.0135262,21
1429614095072,84,0.13601,-0.0473259,0.0181102,27
1429614095114,84,0.111346,-0.0485962,0.0158454,46
1429614095156,84,0.0630176,-0.0256547,0.00879823,73
1429614095168,84,0.0272806,-0.000477706,0.00276116,73
1429614095210,84,-0.00512426,0.0223471,-0.00273938,73
1429614095252,85,-0.0256192,0.0347018,-0.00601843,67
1429614095295,85,-0.0350676,0.0248802,-0.00601968,59
1429614095306,85,-0.0491628,0.0211482,-0.00703864,57
1429614095348,85,-0.0724415,0.0205936,-0.00931542,56
1429614095390,85,-0.102947,0.0170964,-0.0120572,57
1429614095432,85,-0.125002,0.00626668,-0.0132203,56
1429614095480,85,-0.126155,-0.00657119,-0.0120608,51
1429614095491,85,-0.0983927,-0.0154127,-0.00837157,48
1429614095532,85,-0.0583729,-0.00804793,-0.00508103,44
1429614095573,85,-0.0185911,-0.00623384,-0.00125757,38
1429614095615,85,0.00860837,0.00295448,0.000575081,34
1429614095657,85,0.0186872,0.0203665,-0.000170522,27
1429614095669,85,0.00760547,0.0602615,-0.00534778,27
1429614095711,85,-0.00626431,0.0938486,-0.0101883,18
1429614095752,85,-0.0089303,0.10092,-0.0112247,14
1429614095795,85,-0.000510079,0.0751324,-0.00770815,28
1429614095806,85,0.0240797,0.0108484,0.00135249,28
1429614095848,85,0.0476527,-0.0603582,0.0110087,49
1429614095860,85,0.0753563,-0.127638,0.0206982,53
1429614095901,85,0.0918556,-0.163792,0.0260324,52
1429614095913,85,0.0936175,-0.171089,0.026974,50
1429614095955,85,0.0913935,-0.150399,0.0246232,43
1429614095966,85,0.0692597,-0.114065,0.0186302,40
1429614095978,85,0.0345298,-0.0807024,0.0117083,38
1429614096001,85,-0.00416926,-0.0538624,0.00503539,36
1429614096043,85,-0.0308964,-0.0468503,0.00161688,33
1429614096069,85,-0.0339034,-0.0588929,0.00254442,34
1429614096111,85,-0.0348646,-0.0653419,0.00310294,33
1429614096137,85,-0.0413877,-0.046564,0.000526603,32
1429614096179,85,-0.0709197,0.000804849,-0.00730706,28
1429614096201,85,-0.134187,0.0810338,-0.0217656,27
1429614096243,85,-0.178786,0.140431,-0.0325046,23
1429614096269,85,-0.177758,0.163052,-0.0348464,22
1429614096311,85,-0.105394,0.149898,-0.0261451,21
1429614096337,85,-0.0170213,0.136647,-0.0157197,21
1429614096379,85,0.0554426,0.137305,-0.00837281,23
1429614096401,85,0.0887362,0.153219,-0.00660371,23
1429614096443,85,0.0845009,0.174288,-0.00916747,22
1429614096469,85,0.0738787,0.167687,-0.00956394,23
1429614096511,85,0.0937049,0.116712,-0.00235651,41
1429614096537,85,0.155879,0.0360178,0.0122844,52
1429614096579,85,0.215577,-0.0353991,0.0256088,83
1429614096603,85,0.227334,-0.0906302,0.0325803,87
1429614096637,85,0.153191,-0.114428,0.0273929,84
1429614096670,85,0.00980724,-0.105272,0.0117139,76
1429614096703,85,-0.142693,-0.0931903,-0.00505078,66
1429614096737,85,-0.246145,-0.0875253,-0.0162314,60
1429614096779,85,-0.268607,-0.0790618,-0.0193745,54
1429614096820,85,-0.224541,-0.0588161,-0.0168942,52
1429614096862,85,-0.153037,-0.0136931,-0.0141456,47
1429614096904,85,-0.0914571,0.0373474,-0.0129848,43
1429614096946,85,-0.0296652,0.0506013,-0.0080975,34
1429614096987,85,0.0268662,0.0123953,0.00145697,26
1429614097029,85,0.0847676,-0.0614769,0.0146322,14
1429614097070,85,0.144172,-0.146391,0.0290328,9
1429614097112,85,0.19239,-0.207563,0.0398767,3
1429614097159,85,0.22163,-0.213341,0.0431053,0
1429614097170,85,0.210729,-0.155201,0.0359772,0
1429614097212,85,0.184245,-0.0613994,0.0239982,0
1429614097254,85,0.140164,0.0366929,0.00999393,13
1429614097295,85,0.117175,0.0894899,0.00266184,44
1429614097337,85,0.106422,0.081805,0.00235384,54
1429614097380,85,0.0755083,0.0355957,0.00378824,51
1429614097423,85,-0.013699,0.00899839,-0.00212234,45
1429614097465,85,-0.145763,0.0201862,-0.0153734,40
1429614097507,85,-0.276887,0.0676324,-0.0315809,40
1429614097549,85,-0.354364,0.136214,-0.0443067,39
1429614097590,85,-0.350197,0.178057,-0.0472434,37
1429614097632,85,-0.301848,0.182601,-0.0428063,31
1429614097674,85,-0.222691,0.146181,-0.0322129,27
1429614097715,85,-0.130054,0.0739135,-0.0177236,21
1429614097756,85,-0.042074,0.00102092,-0.00371083,18
1429614097800,85,0.0325861,-0.0520841,0.00723712,12
1429614097812,85,0.0829515,-0.0562409,0.0117596,10
1429614097853,85,0.119067,-0.0349359,0.0129506,6
1429614097895,85,0.144121,-0.00519519,0.0124588,0
1429614097936,85,0.181868,-0.00531108,0.0155726,5
1429614097978,85,0.212092,-0.0346152,0.0203851,34
1429614098020,85,0.216486,-0.0734855,0.0238916,57
1429614098061,85,0.201295,-0.109098,0.0256896,67
1429614098103,85,0.143828,-0.0949754,0.0196181,61
1429614098146,85,0.0615368,-0.0407569,0.00837218,48
1429614098158,85,-0.0259116,0.0272475,-0.00433721,48
1429614098199,85,-0.0876096,0.0657835,-0.012513,39
1429614098240,85,-0.0961898,0.0518956,-0.0120821,36
1429614098282,85,-0.0795576,0.0108921,-0.00733517,33
1429614098324,85,-0.0556335,-0.026524,-0.00235002,30
1429614098366,85,-0.0450366,-0.0458445,6.46102e-05,26
1429614098408,85,-0.0558858,-0.0400725,-0.00127098,24
1429614098450,85,-0.0693374,-0.0364946,-0.00262509,21
1429614098491,85,-0.0733382,-0.0430345,-0.00241302,19
1429614098533,85,-0.0452113,-0.0568028,0.00092291,19
1429614098575,85,-0.00838456,-0.0527697,0.00350106,19
1429614098617,85,0.028515,-0.0157536,0.00347108,28
1429614098658,85,0.0476516,0.030606,0.00133837,45
1429614098700,85,0.0574749,0.074779,-0.00135372,75
1429614098741,85,0.0374758,0.1092,-0.00558957,81
1429614098784,85,0.00693034,0.109331,-0.00801099,72
1429614098825,85,-0.0351089,0.0985884,-0.0104524,63
1429614098867,85,-0.0810425,0.092839,-0.0135728,51
1429614098909,85,-0.122453,0.0972278,-0.0171648,47
1429614098950,85,-0.15024,0.0953163,-0.0192458,44
1429614098992,85,-0.157748,0.0769848,-0.0184298,41
1429614099033,85,-0.126508,0.0313983,-0.0124346,36
1429614099075,85,-0.0491063,-0.0374086,-0.000927819,34
1429614099117,85,0.0393853,-0.0992012,0.0110104,33
1429614099158,85,0.113071,-0.138293,0.0200667,32
1429614099201,85,0.147143,-0.129906,0.0221062,31
1429614099217,85,0.155219,-0.0935297,0.019939,32
1429614099229,85,0.140831,-0.0473625,0.0151134,32
1429614099270,85,0.131831,-0.0218911,0.0124142,45
1429614099312,85,0.109791,-0.0124956,0.00988413,62
1429614099357,85,0.0737017,-0.00794657,0.00659646,79
1429614099369,85,0.0343352,-0.0101199,0.00360478,79
1429614099410,85,2.93353e-05,-0.00803605,0.000656833,74
1429614099451,85,-0.0292892,-0.000850995,-0.00230527,61
1429614099494,85,-0.0505124,0.00910512,-0.00483837,51
1429614099506,85,-0.0634357,0.00963222,-0.00593578,46
1429614099551,85,-0.069493,-0.0028097,-0.00543079,35
1429614099564,85,-0.0644979,-0.0189168,-0.0037124,33
1429614099578,85,-0.0483624,-0.0303617,-0.00146651,33
1429614099620,85,-0.0188348,-0.0375423,0.00152305,26
1429614099661,85,0.01978,-0.0326404,0.00425958,21
1429614099703,85,0.0673288,-0.0354719,0.00836674,16
1429614099744,85,0.103301,-0.0329932,0.0110547,15
1429614099756,85,0.126124,-0.0331953,0.012913,14
1429614099797,85,0.121082,-0.0299783,0.0122618,13
1429614099808,85,0.095885,-0.00569804,0.00820346,13
1429614099850,85,0.0490492,0.0355268,0.00108803,15
1429614099862,85,0.00901063,0.0580957,-0.00395063,15
1429614099904,85,-0.00296787,0.037206,-0.00323742,39
1429614099915,85,0.00152461,-0.0166646,0.00146429,39
1429614099957,85,-0.00103136,-0.0666423,0.00526331,71
1429614099969,85,-0.0201805,-0.113883,0.00758698,77
1429614100011,85,-0.059348,-0.0924482,0.00266566,82
1429614100037,85,-0.101462,-0.0368028,-0.00522311,82
1429614100080,85,-0.135503,0.0448501,-0.0145709,80
1429614100102,85,-0.164851,0.0952869,-0.0211514,78
1429614100143,85,-0.178142,0.123669,-0.0245817,76
1429614100169,85,-0.195672,0.145205,-0.0276174,75
1429614100211,85,-0.190537,0.164391,-0.0287837,74
1429614100237,85,-0.155008,0.175364,-0.0268395,72
1429614100279,85,-0.083215,0.154116,-0.0193068,54
1429614100302,85,0.0174616,0.0906971,-0.00598897,51
1429614100343,85,0.115891,0.0112381,0.00861381,49
1429614100369,85,0.136861,-0.0315428,0.0138212,47
1429614100410,85,0.0907802,-0.0263076,0.00961719,45
1429614100437,85,0.0144451,0.0138326,5.13686e-05,43
1429614100478,85,-0.0339621,0.040446,-0.00614969,41
1429614100501,85,-0.025618,0.0186002,-0.0036661,43
1429614100543,85,0.0363426,-0.0438888,0.0066617,50
1429614100569,85,0.115577,-0.121961,0.0197784,60
1429614100611,85,0.169606,-0.161531,0.0275829,68
1429614100637,85,0.171128,-0.149297,0.026742,70
1429614100679,85,0.143688,-0.110874,0.0212948,69
1429614100701,85,0.100906,-0.0683734,0.0141478,66
1429614100742,85,0.0629591,-0.0315299,0.00787642,63
1429614100769,85,0.058371,-0.00914382,0.00562454,60
1429614100811,85,0.0476519,0.0113104,0.00300697,57
1429614100837,85,0.0574797,0.010042,0.00393326,55
1429614100879,85,0.0704047,0.0040807,0.00546315,54
1429614100902,85,0.098164,-0.0166954,0.00945406,52
1429614100943,85,0.131681,-0.0380204,0.0139154,49
1429614100969,85,0.13632,-0.0590965,0.0160174,46
1429614101010,85,0.0741241,-0.0516612,0.0102534,43
1429614101052,85,-0.0490907,-0.00606282,-0.00348647,41
1429614101093,85,-0.190319,0.0518092,-0.0195741,40
1429614101135,85,-0.290495,0.105437,-0.0318819,38
1429614101177,85,-0.324281,0.145507,-0.0375439,36
1429614101219,85,-0.300881,0.164911,-0.0369911,41
1429614101260,85,-0.231003,0.151603,-0.0303027,49
1429614101302,85,-0.124146,0.0945402,-0.0172868,59
1429614101343,85,-0.0159375,0.0203102,-0.00285381,60
1429614101385,85,0.0954883,-0.058991,0.0121503,70
1429614101431,85,0.15835,-0.121258,0.0220205,63
1429614101443,85,0.152323,-0.143737,0.0232563,60
1429614101487,85,0.070242,-0.104339,0.0136278,53
1429614101498,85,-0.0419168,-0.0504163,0.000666191,53
1429614101540,85,-0.148932,-0.00707317,-0.0110768,49
1429614101581,85,-0.205428,-0.00114344,-0.0159371,45
1429614101627,85,-0.21349,-0.0192162,-0.015141,37
1429614101639,85,-0.175199,-0.0527973,-0.0095788,34
1429614101680,85,-0.119412,-0.0502596,-0.00538463,29
1429614101722,85,-0.0524555,-0.0138521,-0.00300181,23
1429614101764,85,0.0155964,0.0474745,-0.00247376,20
1429614101805,85,0.100095,0.0907286,0.000725029,18
1429614101847,85,0.180569,0.101491,0.00612955,17
1429614101888,85,0.260914,0.0593069,0.015666,14
1429614101931,85,0.31345,-0.00800089,0.0250167,11
1429614101973,85,0.317096,-0.0620274,0.0294509,13
1429614102015,85,0.276115,-0.0769624,0.0274963,26
1429614102056,85,0.197143,-0.0402047,0.0184794,52
1429614102098,85,0.108781,0.0294834,0.0061695,59
1429614102140,85,0.0510687,0.0935197,-0.00331412,53
1429614102182,85,0.0123199,0.125033,-0.00878847,47
1429614102224,85,-0.0281393,0.113725,-0.0110567,40
1429614102266,85,-0.0880946,0.0707109,-0.0123424,39
1429614102308,85,-0.158688,0.0131882,-0.0133443,39
1429614102349,85,-0.220325,-0.0491736,-0.0133219,37
1429614102390,85,-0.24021,-0.0932396,-0.0114141,32
1429614102432,85,-0.204056,-0.112775,-0.00710499,30
1429614102474,85,-0.148241,-0.103317,-0.00349258,27
1429614102515,85,-0.0942375,-0.0779064,-0.00127623,26
1429614102557,85,-0.0694259,-0.0392356,-0.00235365,26
1429614102599,85,-0.0674105,0.00135479,-0.00536539,27
1429614102640,85,-0.079984,0.0339034,-0.00888578,26
1429614102682,85,-0.06127,0.0556112,-0.00910142,29
1429614102724,85,-0.011475,0.0753144,-0.00673851,47
1429614102765,85,0.0865754,0.102969,-0.00126821,64
1429614102807,85,0.202127,0.106481,0.00739524,75
1429614102848,85,0.289005,0.0773652,0.0163017,74
1429614102890,85,0.333599,-0.0135727,0.0268831,67
1429614102931,85,0.303301,-0.119275,0.032652,60
1429614102973,85,0.204006,-0.205662,0.0317173,49
1429614103014,85,0.061467,-0.209376,0.0209177,43
1429614103056,85,-0.0855954,-0.134051,0.00374551,32
1429614103098,85,-0.183282,-0.0248531,-0.0122828,25
1429614103141,85,-0.21484,0.0741185,-0.0224061,17
1429614103153,85,-0.195433,0.126052,-0.0249587,17
1429614103194,85,-0.159976,0.14169,-0.0233983,16
1429614103236,85,-0.140094,0.127567,-0.0207744,16
1429614103278,85,-0.138791,0.101129,-0.018674,18
1429614103319,85,-0.150562,0.0797946,-0.0179054,18
1429614103361,85,-0.163108,0.076665,-0.0185777,25
1429614103402,85,-0.15673,0.0713315,-0.0176708,40
1429614103444,85,-0.109425,0.0522008,-0.0125133,65
1429614103485,85,-0.0352582,-4.16841e-05,-0.00273252,70
1429614103527,85,0.0454969,-0.0571458,0.00794751,64
1429614103568,85,0.114831,-0.104863,0.0170112,58
1429614103610,85,0.158872,-0.121309,0.0216795,50
1429614103651,85,0.170104,-0.106076,0.021334,48
1429614103693,85,0.160219,-0.0786579,0.0184953,44
1429614103734,85,0.138321,-0.0398276,0.013745,39
1429614103776,85,0.108229,-0.00887769,0.00902614,29
1429614103789,85,0.0879218,-0.012283,0.00777836,29
1429614103832,85,0.0677022,-0.0240401,0.00712095,19
1429614103844,85,0.0471219,-0.0197808,0.00518434,16
1429614103886,85,0.0175843,0.0174739,7.84106e-06,11
1429614103928,85,-0.00893943,0.0550155,-0.00496437,5
1429614103940,85,-0.0423205,0.103765,-0.0112448,3
1429614103981,85,-0.0577535,0.115215,-0.0132965,1
1429614104023,85,-0.0214643,0.055767,-0.00597976,1
1429614104065,85,0.0374402,-0.0299154,0.00519629,21
1429614104107,85,0.109266,-0.116298,0.0174328,50
1429614104118,85,0.146774,-0.139224,0.0220276,50
1429614104160,85,0.146371,-0.111493,0.0198676,59
1429614104172,86,0.109254,-0.0653714,0.0134963,59
1429614104213,86,0.024139,-0.0128941,0.00285308,49
1429614104224,86,-0.0745213,0.00621693,-0.00624973,45
1429614104266,86,-0.169465,0.0108602,-0.0139589,38
1429614104278,86,-0.213624,-0.0105938,-0.0158124,35
1429614104319,86,-0.218311,-0.00825349,-0.0163365,31
1429614104338,86,-0.186121,0.0249309,-0.0164047,30
1429614104381,86,-0.132698,0.0836598,-0.0168156,26
1429614104401,86,-0.0710233,0.135366,-0.0160398,23
1429614104443,86,-0.00217383,0.134339,-0.0106246,15
1429614104469,86,0.0415924,0.0582937,-0.00130597,13
1429614104510,86,0.0272462,-0.0174807,0.00345388,8
1429614104538,86,-0.0181612,-0.109978,0.00714432,7
1429614104580,86,-0.046606,-0.143905,0.00752246,5
1429614104602,86,0.00280734,-0.183996,0.0146157,4
1429614104644,86,0.0968921,-0.197871,0.0230791,0
1429614104669,86,0.163374,-0.173842,0.0263675,0
1429614104711,86,0.167813,-0.0916532,0.0202498,9
1429614104737,86,0.121768,0.0010253,0.00950117,18
1429614104779,86,0.0388049,0.0917674,-0.00416456,46
1429614104803,86,-0.0391039,0.155101,-0.0152288,51
1429614104837,87,-0.074832,0.166621,-0.019023,52
1429614104869,87,-0.064756,0.135255,-0.0158137,46
1429614104902,87,-0.0361887,0.0870525,-0.0097441,37
1429614104945,87,0.00534113,0.0321571,-0.00213014,26
1429614104969,87,0.00439548,0.0172672,-0.001021,24
1429614105010,87,-0.0508647,0.0407046,-0.00725405,23
1429614105037,87,-0.101542,0.0905644,-0.0152518,22
1429614105079,87,-0.139406,0.139813,-0.0220406,15
1429614105104,87,-0.124297,0.168332,-0.0230346,12
1429614105137,87,-0.0619649,0.155889,-0.0171403,8
1429614105170,87,0.0476073,0.103158,-0.00437167,5
1429614105202,87,0.153718,0.0425996,0.00872687,1
1429614105237,87,0.222352,-0.00181366,0.0175759,0
1429614105278,87,0.227475,-0.0132262,0.0188421,0
1429614105320,87,0.184704,-0.0083089,0.0150852,6
1429614105361,87,0.144478,-0.0270764,0.0134412,44
1429614105403,87,0.0859676,-0.0696084,0.0121601,68
1429614105445,87,0.0522789,-0.142146,0.0152316,43
1429614105592,87,0.00350681,-0.197798,0.0157122,43
1429614105633,87,-0.0385204,-0.223864,0.0144464,43
1429614105675,87,-0.0912767,-0.21152,0.00936517,42
1429614105717,87,-0.138293,-0.181916,0.00340738,38
1429614105759,87,-0.195881,-0.126179,-0.00541794,33
1429614105801,87,-0.258395,-0.0612343,-0.0152687,26
1429614105842,87,-0.293757,-0.00524582,-0.0222525,23
1429614105884,87,-0.253991,0.0185042,-0.0209912,23
1429614105928,87,-0.170703,0.0143908,-0.0142453,48
1429614105970,87,-0.0744566,0.0152839,-0.00686252,75
1429614106011,87,0.0251485,0.0361807,-0.000838256,95
1429614106053,87,0.0552238,0.0885275,-0.00251144,91
1429614106095,87,0.0670987,0.144043,-0.00577086,77
1429614106137,87,0.069153,0.17607,-0.00796711,70
1429614106178,87,0.0816299,0.166544,-0.0062643,63
1429614106220,87,0.104159,0.0994,0.000350288,60
1429614106264,87,0.147393,0.0215633,0.00920699,55
1429614106306,87,0.178878,-0.0239395,0.0147201,50
1429614106348,87,0.196042,-0.0456501,0.0175971,42
1429614106395,87,0.180624,-0.0199691,0.0145248,37
1429614106407,87,0.133687,0.0360603,0.0070241,37
1429614106448,87,0.0563909,0.124774,-0.00486526,34
1429614106491,87,-0.000867355,0.164467,-0.011798,42
1429614106532,87,-0.0351655,0.147893,-0.0129968,72
1429614106577,87,-0.0472272,0.0844947,-0.00926813,88
1429614106589,87,-0.0350835,-0.00135492,-0.00236064,91
1429614106631,87,-0.0208264,-0.0816692,0.00425002,85
1429614106673,87,0.0196035,-0.168009,0.0131333,76
1429614106715,87,0.0285836,-0.215091,0.0169429,66
1429614106757,87,0.00596304,-0.227228,0.0161976,63
1429614106799,87,-0.0401272,-0.195697,0.0107925,62
1429614106841,87,-0.111271,-0.115099,0.000265404,59
1429614106883,87,-0.16385,-0.0186536,-0.00996745,51
1429614106924,87,-0.208613,0.0591819,-0.0183416,45
1429614106966,87,-0.210674,0.100616,-0.0211696,37
1429614107007,87,-0.17049,0.0831201,-0.0172415,29
1429614107050,87,-0.0963916,0.0368138,-0.00903702,24
1429614107092,87,-0.0198392,-0.00790523,-0.000807531,36
1429614107134,87,0.0717424,-0.0304048,0.00691829,62
1429614107175,87,0.129121,-0.0133255,0.00959123,69
1429614107217,87,0.142985,-0.000204802,0.00970152,62
1429614107258,87,0.100717,0.0165526,0.00571066,54
1429614107300,87,0.0483271,0.0354436,0.000877526,42
1429614107342,87,0.00645678,0.058031,-0.00351695,36
1429614107383,87,-0.0112531,0.0795641,-0.00621333,30
1429614107425,87,-0.00638168,0.0797135,-0.00593248,26
1429614107467,87,0.00740926,0.0644118,-0.00395568,19
1429614107508,87,0.0137432,0.0327001,-0.00132311,15
1429614107550,87,0.0100577,0.00618246,0.000273066,11
1429614107591,87,0.00538751,0.0140208,-0.000610096,8
1429614107633,87,0.00669074,0.0312209,-0.0017409,2
1429614107674,87,0.0233524,0.0445516,-0.0015121,8
1429614107716,87,0.0495068,0.0313801,0.00130545,38
1429614107758,87,0.0614037,0.00400134,0.00413859,54
1429614107800,87,0.0577949,-0.0302931,0.00637869,53
1429614107811,87,0.0381347,-0.0464631,0.00614111,53
1429614107853,87,0.0318522,-0.0633392,0.0069848,39
1429614107895,87,0.0357052,-0.0717884,0.00791903,28
1429614107936,87,0.0364098,-0.0738499,0.00812117,17
1429614107951,87,0.0379859,-0.0722112,0.00814765,15
1429614107963,87,0.0383993,-0.0681363,0.00792405,15
1429614108004,87,0.0204154,-0.0614385,0.00611448,7
1429614108015,87,-0.0185734,-0.0413599,0.00170187,4
1429614108056,87,-0.0681265,0.00123232,-0.00515529,0
1429614108068,87,-0.099777,0.0449524,-0.0107661,0
1429614108110,87,-0.111239,0.0794568,-0.0141205,0
1429614108122,87,-0.0704624,0.0735725,-0.0106897,0
1429614108164,87,-0.0203409,0.0347394,-0.00407688,0
1429614108176,87,0.0280756,-0.0288836,0.00422085,0
1429614108219,87,0.0490648,-0.101624,0.0112323,0
1429614108237,87,0.0320476,-0.143154,0.0130417,0
1429614108278,87,0.0219292,-0.143451,0.0123406,0
1429614108301,87,0.0346474,-0.0947527,0.00963919,0
1429614108342,87,0.0753661,-0.0301579,0.00788919,13
1429614108369,87,0.109571,0.0362137,0.00547418,39
1429614108401,87,0.112969,0.0875468,0.00189324,53
1429614108438,87,0.0527284,0.112989,-0.0044867,51
1429614108469,87,-0.0339328,0.106929,-0.0105072,41
1429614108512,87,-0.129738,0.0800908,-0.0156262,31
1429614108538,87,-0.178083,0.0358076,-0.015943,27
1429614108569,87,-0.174094,-0.00278413,-0.0127727,28
1429614108611,87,-0.109222,-0.0231644,-0.00641534,32
1429614108637,87,-0.029446,-0.0194987,-0.000741133,33
1429614108679,87,0.0301623,-0.000231351,0.00225686,30
1429614108721,87,0.0629553,0.0144647,0.00360208,23
1429614108738,87,0.0458288,0.0179455,0.00206395,20
1429614108780,87,0.0189482,-0.00295767,0.00162191,13
1429614108801,87,6.18536e-05,-0.0313652,0.00232641,7
1429614108842,87,0.0177648,-0.0684756,0.00642046,1
1429614108868,87,0.0391052,-0.0845599,0.0092016,0
1429614108910,87,0.0588642,-0.0796815,0.0103412,0
1429614108937,87,0.0387138,-0.0428101,0.0060609,6
1429614108978,87,0.0208178,-0.000623362,0.00159686,33
1429614109001,87,-0.012132,0.0496357,-0.00455099,62
1429614109042,87,-0.027726,0.0519894,-0.00590188,75
1429614109069,87,-0.0305782,0.0262902,-0.00419374,71
1429614109110,87,-0.0103171,-0.0310869,0.00153179,60
1429614109137,87,0.0101221,-0.0794276,0.00656939,49
1429614109169,87,0.0460812,-0.11147,0.0116041,42
1429614109202,87,0.0785517,-0.107961,0.0137518,42
1429614109237,87,0.100322,-0.0822974,0.0135074,44
1429614109269,87,0.0827297,-0.0317014,0.00843215,45
1429614109300,87,0.0347641,0.0218061,0.000959754,45
1429614109337,87,-0.0179955,0.0683464,-0.00640716,45
1429614109369,87,-0.05791,0.108046,-0.0122933,46
1429614109400,87,-0.0659584,0.135738,-0.0149392,46
1429614109437,87,-0.0604622,0.143293,-0.0151299,42
1429614109469,87,-0.0349094,0.120481,-0.0115843,40
1429614109510,87,-0.00497208,0.0842984,-0.00666656,36
1429614109552,87,0.0369164,0.0379853,-8.09905e-05,49
1429614109593,87,0.0666447,0.0118073,0.00412899,73
1429614109635,87,0.0877484,0.000698739,0.00662025,101
1429614109677,87,0.0898353,0.0169566,0.00556942,100
1429614109719,88,0.0709144,0.0408697,0.0023163,82
1429614109761,88,0.0353584,0.070402,-0.00270901,70
1429614109803,88,-0.00966154,0.0750399,-0.00660743,59
1429614109844,88,-0.0238433,0.04746,-0.00560356,56
1429614109886,88,-0.0149805,-0.00185249,-0.00103693,52
1429614109928,88,-0.00037304,-0.0632651,0.00501044,48
1429614109969,88,-0.0132017,-0.11184,0.00789672,41
1429614110011,88,-0.0612826,-0.135225,0.00595433,38
1429614110053,88,-0.135964,-0.120428,-0.00125433,33
1429614110095,88,-0.198358,-0.0801004,-0.00960064,29
1429614110137,88,-0.215233,-0.029925,-0.015109,34
1429614110179,88,-0.192628,0.0206097,-0.0173903,54
1429614110220,88,-0.13401,0.0573283,-0.0156237,86
1429614110262,88,-0.0531911,0.0665134,-0.0098255,91
1429614110304,90,0.0393352,0.0522199,-0.00106029,79
1429614110346,90,0.111327,0.02992,0.00669687,68
1429614110388,90,0.16376,0.00480095,0.0131147,57
1429614110430,90,0.154891,-0.00958605,0.0135674,54
1429614110471,90,0.0995816,-0.0106442,0.0090649,53
1429614110513,90,0.027221,-0.00928773,0.00299938,49
1429614110555,90,-0.0239641,-0.00778995,-0.001324,42
1429614110596,90,-0.0359348,-0.0131725,-0.0018587,38
1429614110638,90,-0.0224424,-0.0310364,0.000703806,31
1429614110679,90,-0.00646046,-0.042656,0.00295818,28
1429614110721,90,-0.0188164,-0.0473889,0.0023461,27
1429614110763,90,-0.0526316,-0.0183924,-0.00280555,39
1429614110805,90,-0.0613064,0.0312736,-0.00760802,68
1429614110846,90,-0.0244079,0.0821875,-0.00879522,80
1429614110888,92,0.0769671,0.101898,-0.00207013,74
1429614110929,92,0.188581,0.080017,0.00906242,66
1429614110971,92,0.25191,0.0284041,0.0187432,57
1429614111012,92,0.231109,-0.0311677,0.022133,54
1429614111055,92,0.129914,-0.0689709,0.0168595,53
1429614111097,92,-0.00226165,-0.0745852,0.00615362,51
1429614111139,92,-0.124049,-0.0492592,-0.00638695,45
1429614111180,92,-0.184129,-0.0228855,-0.0138914,41
1429614111222,92,-0.179379,0.00197229,-0.0156714,35
1429614111263,92,-0.143417,0.0183719,-0.0140205,32
1429614111308,92,-0.103157,0.0277557,-0.0113901,29
1429614111319,92,-0.0814268,0.0324197,-0.00994329,29
1429614111361,92,-0.0725201,0.0433911,-0.0101135,31
1429614111403,92,-0.0708571,0.0475398,-0.010358,43
1429614111444,92,-0.0549443,0.0394942,-0.00828917,67
1429614111486,92,-0.0120168,0.0119769,-0.00211655,70
1429614111528,94,0.0508251,-0.020415,0.00628435,55
1429614111570,94,0.109714,-0.0549934,0.0145864,40
1429614111611,94,0.140031,-0.0781303,0.0193345,28
1429614111654,94,0.11655,-0.0760873,0.0170574,27
1429614111666,94,0.0408109,-0.0395079,0.00708587,27
1429614111708,94,-0.0540308,0.0130389,-0.00591314,28
1429614111750,94,-0.130208,0.0708097,-0.0175789,26
1429614111762,94,-0.147014,0.0928524,-0.0209768,24
1429614111804,94,-0.101023,0.0737353,-0.0152699,20
1429614111845,94,-0.0391429,0.0304634,-0.0060535,11
1429614111857,94,0.00905897,-0.0115278,0.00178782,7
1429614111898,94,0.0197157,-0.0274247,0.00408511,1
1429614111940,94,0.0118604,-0.00672944,0.00160318,0
1429614111982,94,0.00342829,0.0301009,-0.00229816,0
1429614112023,94,0.0145115,0.0587952,-0.0038194,0
1429614112065,94,0.0367898,0.0736971,-0.00316495,20
1429614112078,94,0.0664627,0.068462,-0.000170322,33
1429614112119,94,0.101732,0.0237132,0.00673792,50
1429614112162,94,0.108937,-0.0156227,0.0106699,52
1429614112173,94,0.118692,-0.0702074,0.016338,52
1429614112215,94,0.10181,-0.0985678,0.0173174,43
1429614112227,94,0.069175,-0.103167,0.0149437,40
1429614112269,94,0.00721175,-0.0755672,0.00718498,37
1429614112310,94,-0.0739389,-0.0132248,-0.00523441,34
1429614112322,94,-0.111206,0.0341612,-0.01261,34
1429614112364,94,-0.0979928,0.0519558,-0.0130324,32
1429614112405,94,-0.0302947,0.0289125,-0.0051621,27
1429614112447,94,0.0317994,-0.00677826,0.00336257,19
1429614112458,94,0.0745468,-0.0322615,0.00934295,16
1429614112500,94,0.0610809,-0.0214613,0.00719454,12
1429614112512,94,0.0054945,0.0130398,-0.000657587,10
1429614112553,94,-0.0462601,0.0353239,-0.00714193,8
1429614112566,94,-0.0895441,0.0420517,-0.0114813,7
1429614112607,94,-0.0993404,0.0241485,-0.0107958,5
1429614112618,94,-0.0736392,0.00854395,-0.00713883,5
1429614112660,94,-0.0310362,0.0093091,-0.00347904,23
1429614112673,94,0.0509752,0.00263638,0.00417393,23
1429614112701,94,0.133911,-0.0278708,0.0139491,43
1429614112743,94,0.188404,-0.0909204,0.0240687,62
1429614112769,95,0.188174,-0.164383,0.0304023,62
1429614112811,95,0.116888,-0.209661,0.0281227,52
1429614112837,95,0.012374,-0.205515,0.0187724,48
1429614112878,95,-0.0919289,-0.144252,0.00450425,42
1429614112900,95,-0.151269,-0.0457557,-0.00908124,41
1429614112943,95,-0.16891,0.0566012,-0.0193801,41
1429614112968,95,-0.138758,0.126687,-0.0228463,42
1429614113010,95,-0.0847546,0.15661,-0.0207848,45
1429614113037,95,-0.0410327,0.154453,-0.0167984,46
1429614113078,95,-0.0284978,0.134403,-0.0139963,47
1429614113101,95,-0.0416239,0.112405,-0.0132295,47
1429614113143,95,-0.0526366,0.086538,-0.0119832,45
1429614113168,95,-0.0380646,0.0625836,-0.0086278,45
1429614113200,95,-0.0044959,0.0392259,-0.00373092,43
1429614113238,95,0.0544035,0.0153935,0.00332226,44
1429614113270,95,0.131244,-0.0138345,0.0123672,54
1429614113302,95,0.20815,-0.0558919,0.0226087,71
1429614113338,95,0.250752,-0.10066,0.0301835,87
1429614113369,95,0.245693,-0.118313,0.0313004,92
1429614113402,95,0.203175,-0.10616,0.0267678,86
1429614113437,95,0.1408,-0.0652852,0.0179367,75
1429614113470,95,0.0626535,-0.0122425,0.00655471,65
1429614113501,95,0.00356856,0.0300827,-0.00233805,58
1429614113537,95,-0.053132,0.0442849,-0.00866335,54
1429614113570,95,-0.0930675,0.0382286,-0.011745,50
1429614113601,95,-0.136976,0.0362355,-0.0155523,45
1429614113637,95,-0.163293,0.039243,-0.0182874,39
1429614113670,95,-0.196459,0.0464487,-0.0220758,32
1429614113700,95,-0.210501,0.0418794,-0.0231305,27
1429614113742,95,-0.199437,0.0222267,-0.0204403,23
1429614113784,95,-0.13821,-0.0209659,-0.0109563,19
1429614113826,95,-0.0222564,-0.0731429,0.00480829,13
1429614113871,95,0.0936623,-0.114123,0.0198318,14
1429614113882,95,0.161376,-0.128176,0.0279226,19
1429614113924,95,0.143532,-0.0982502,0.0234421,35
1429614113966,95,0.101937,-0.0641475,0.0164087,57
1429614114007,95,-0.00469739,-0.0062601,0.000152505,58
1429614114048,95,-0.120054,0.0531745,-0.0170916,46
1429614114090,95,-0.181205,0.0763042,-0.0258608,38
1429614114132,95,-0.177028,0.0744733,-0.0253272,32
1429614114173,95,-0.0685636,0.0274078,-0.00985719,32
1429614114214,95,0.0552717,-0.00902644,0.00663131,32
1429614114256,95,0.137353,-0.0191673,0.0162522,29
1429614114298,95,0.140924,0.00823803,0.0138709,24
1429614114339,95,0.0867083,0.0561985,0.0032077,19
1429614114382,95,0.000809015,0.111401,-0.0116348,10
1429614114424,95,-0.0713303,0.147395,-0.0230852,4
1429614114466,95,-0.110821,0.152744,-0.0278126,0
1429614114508,95,-0.11537,0.130173,-0.0257564,8
1429614114550,95,-0.077097,0.0655365,-0.0150759,37
1429614114591,95,-0.00418854,-0.0291297,0.0026451,53
1429614114633,97,0.0615399,-0.115828,0.0187922,54
1429614114685,97,0.101626,-0.160547,0.0278086,41
1429614114698,97,0.102768,-0.150142,0.0268974,37
1429614114740,97,0.0547677,-0.0878689,0.0151348,32
1429614114782,97,-0.00546071,-0.00973299,0.000452186,31
1429614114829,97,-0.0362004,0.0481768,-0.00895891,31
1429614114840,97,-0.0325254,0.0637698,-0.0102443,31
1429614114882,97,-0.0271531,0.0508271,-0.00828782,29
1429614114924,97,-0.0203794,0.0242912,-0.00474438,26
1429614114965,97,-0.0367384,0.0133105,-0.00530812,24
1429614115007,97,-0.0438021,0.0102308,-0.00573727,24
1429614115048,97,-0.0448013,0.0152947,-0.00634934,25
1429614115090,97,-0.0306494,0.0162864,-0.00493061,32
1429614115132,97,-0.00711645,-0.000841869,-0.000655263,64
1429614115175,97,0.0282713,-0.037879,0.00692719,87
1429614115217,97,0.0796464,-0.0945888,0.0183219,100
1429614115258,97,0.114966,-0.14459,0.0272327,94
1429614115300,97,0.12116,-0.164067,0.0299537,74
1429614115341,97,0.0911643,-0.144139,0.0248144,62
1429614115383,97,0.0381148,-0.0865247,0.0131838,52
1429614115425,97,-0.0315153,-0.00452319,-0.00285627,49
1429614115466,97,-0.0890696,0.07596,-0.0175176,45
1429614115508,97,-0.129983,0.138373,-0.0284887,40
1429614115550,97,-0.141483,0.169534,-0.0330654,27
1429614115562,97,-0.117266,0.161491,-0.0298401,27
1429614115604,97,-0.0721062,0.127748,-0.0214601,7
1429614115645,97,-0.033941,0.0953548,-0.0138209,0
1429614115686,97,-0.007702,0.0669781,-0.00800354,0
1429614115728,97,0.0106472,0.0435974,-0.00353269,0
1429614115770,97,0.0393605,0.0118457,0.00296065,9
1429614115783,97,0.0751934,-0.0244116,0.0107069,13
1429614115794,97,0.118791,-0.0643086,0.0197335,13
1429614115836,97,0.144233,-0.0926616,0.0255531,11
1429614115877,97,0.133796,-0.101681,0.0254293,5
1429614115919,97,0.093097,-0.0853595,0.0192727,0
1429614115960,97,0.0361876,-0.0540511,0.00976079,0
1429614116002,97,-0.0105181,-0.0270354,0.0017938,5
1429614116043,97,-0.0432986,-0.00559763,-0.00408101,7
1429614116085,97,-0.045448,-0.000478747,-0.00488344,5
1429614116131,97,-0.0223162,-0.00878252,-0.00147911,3
1429614116143,97,0.00767248,-0.0123487,0.00218266,3
1429614116185,97,0.0275726,0.00176804,0.0028111,3
1429614116227,97,0.0310828,0.0306115,4.86399e-05,6
1429614116272,97,0.0154607,0.0639907,-0.00527723,13
1429614116286,97,-0.00501125,0.0730552,-0.00851307,16
1429614116330,97,-0.0127316,0.0515405,-0.00703718,32
1429614116342,97,-0.00554289,0.00911305,-0.00160746,44
1429614116383,97,0.00884598,-0.0184234,0.00298217,89
1429614116425,97,0.020344,-0.0203014,0.00443786,107
1429614116467,97,0.0151604,-0.000894026,0.00175538,109
1429614116509,97,0.000325402,0.0194047,-0.00208863,104
1429614116550,97,-0.0220644,0.0276268,-0.00543006,66
1429614116593,97,-0.0385485,0.0177157,-0.00615422,62
1429614116605,97,-0.0449034,-0.00029264,-0.00487343,61
1429614116646,97,-0.0489111,-0.0189551,-0.00326997,58
1429614116688,97,-0.0454167,-0.0302368,-0.00166212,53
1429614116730,97,-0.0401574,-0.028433,-0.00128534,48
1429614116772,97,-0.0290705,-0.00686587,-0.00242277,41
1429614116783,97,-0.0129508,0.00913286,-0.00241743,40
1429614116824,97,-0.000588275,0.023551,-0.00262869,36
1429614116866,97,0.0164877,0.0112633,0.000572021,30
1429614116878,97,0.0188086,-0.0159036,0.00380178,30
1429614116920,97,0.0201805,-0.0503623,0.0077544,26
1429614116961,97,0.0141634,-0.0656002,0.00878967,25
1429614116973,97,0.00507262,-0.0444671,0.00545678,24
1429614117014,97,0.00654552,0.0106796,-0.000454757,23
1429614117056,97,0.0114816,0.0706281,-0.00651051,29
1429614117067,97,0.0380551,0.104969,-0.00738497,35
1429614117109,97,0.0707768,0.097514,-0.00296125,48
1429614117120,97,0.0941653,0.0547279,0.00438323,54
1429614117162,97,0.0826584,0.0118773,0.00785279,61
1429614117174,97,0.0219107,-0.0119183,0.00375068,62
1429614117217,97,-0.0682754,-0.00637302,-0.00685333,60
1429614117237,97,-0.144717,0.00673918,-0.0168074,56
1429614117279,97,-0.193465,0.0169671,-0.0232653,52
1429614117300,97,-0.184266,0.00648703,-0.0210822,49
1429614117342,97,-0.140404,-0.0189558,-0.0133732,47
1429614117369,97,-0.0621998,-0.0587565,-0.000380858,45
1429614117410,97,0.00901746,-0.0927666,0.0112097,43
1429614117436,97,0.063559,-0.116913,0.0199138,40
1429614117478,97,0.0810463,-0.118123,0.0219276,38
1429614117505,97,0.078559,-0.0987431,0.0195145,36
1429614117546,97,0.0641652,-0.0667321,0.0144341,34
1429614117569,97,0.050953,-0.0281769,0.00870799,33
1429614117610,97,0.0492873,0.00776519,0.00456507,32
1429614117636,97,0.0615084,0.0332482,0.00310407,31
1429614117685,97,0.0784388,0.057701,0.00226362,30
1429614117705,97,0.0920381,0.0684657,0.00257013,30
1429614117746,97,0.103617,0.0627482,0.00445559,28
1429614117768,97,0.120691,0.0328079,0.00961574,25
1429614117810,97,0.129292,-0.00146894,0.014297,22
1429614117836,97,0.113318,-0.022863,0.0148972,18
1429614117878,97,0.0725104,-0.0217141,0.010332,14
1429614117905,97,0.0109943,0.00550365,0.000603006,13
1429614117946,97,-0.0580707,0.0466723,-0.0114458,24
1429614117988,97,-0.117883,0.0792542,-0.0215525,50
1429614118030,97,-0.16502,0.0991937,-0.0286769,60
1429614118075,97,-0.186933,0.0923838,-0.0302724,59
1429614118087,97,-0.201751,0.0636591,-0.028656,57
1429614118129,97,-0.212467,0.0245716,-0.0253644,52
1429614118175,97,-0.204184,-0.0165197,-0.0200218,46
1429614118186,97,-0.175514,-0.051076,-0.0132017,44
1429614118229,97,-0.126614,-0.0649489,-0.00649,43
1429614118270,97,-0.0507645,-0.0727843,0.00230933,42
1429614118313,97,0.0320719,-0.0825486,0.0120078,40
1429614118354,97,0.111927,-0.0898123,0.0210283,36
1429614118396,97,0.160941,-0.0773385,0.0246337,33
1429614118438,97,0.1809,-0.0468461,0.0234793,29
1429614118480,97,0.176546,0.00513,0.017535,28
1429614118521,97,0.15012,0.0578513,0.00934915,28
1429614118563,97,0.110564,0.0829698,0.00278151,29
1429614118605,97,0.0945702,0.0619289,0.00327966,30
1429614118647,97,0.0962373,0.0146653,0.00812014,29
1429614118688,97,0.107924,-0.0373742,0.0143718,27
1429614118730,97,0.133572,-0.0849881,0.0216514,30
1429614118772,97,0.104541,-0.0901408,0.0190504,48
1429614118814,97,0.0375359,-0.0699813,0.0104543,63
1429614118855,97,-0.0775158,-0.0297828,-0.00459982,67
1429614118897,97,-0.168383,-0.00832775,-0.0154111,62
1429614118939,97,-0.241739,-0.00204107,-0.0228824,53
1429614118980,97,-0.255225,-0.00091504,-0.0240668,48
1429614119022,97,-0.218873,0.000514313,-0.0206765,45
1429614119063,97,-0.153796,0.0150919,-0.0158269,44
1429614119105,97,-0.0706782,0.0337269,-0.00977134,41
1429614119146,97,-0.0186218,0.0712155,-0.00830672,38
1429614119188,97,0.0257787,0.0900055,-0.00594441,32
1429614119229,97,0.056125,0.0901841,-0.00313316,29
1429614119274,97,0.0919114,0.0622868,0.00271124,27
1429614119286,97,0.128098,0.0286711,0.00900122,27
1429614119328,97,0.164887,-0.025189,0.0172817,26
1429614119370,97,0.178748,-0.0717391,0.0226897,26
1429614119413,97,0.156291,-0.09672,0.0227883,24
1429614119425,97,0.0857765,-0.083717,0.0151985,23
1429614119466,97,0.00610354,-0.0360549,0.00376101,22
1429614119508,97,-0.0636565,0.0151564,-0.00700644,31
1429614119549,97,-0.0949522,0.0457326,-0.0124778,46
1429614119597,97,-0.102888,0.0492877,-0.0134191,65
1429614119610,97,-0.0916579,0.0245644,-0.0102385,67
1429614119622,97,-0.0860921,-0.00916203,-0.00679052,66
1429614119664,97,-0.0985325,-0.027197,-0.0062902,62
1429614119710,97,-0.137611,-0.00940082,-0.0112788,54
1429614119722,97,-0.172682,0.0373506,-0.0184594,51
1429614119763,97,-0.182218,0.0911261,-0.0240806,47
1429614119804,97,-0.151887,0.126726,-0.0245286,45
1429614119846,97,-0.0848058,0.122076,-0.0182817,43
1429614119887,97,-0.00507799,0.0853,-0.00799656,40
1429614119929,97,0.0617492,0.0377924,0.00211871,32
1429614119971,97,0.111847,-0.0106554,0.0109044,24
1429614120013,97,0.13583,-0.0452967,0.0161914,14
1429614120054,97,0.146667,-0.0642424,0.0189344,10
1429614120100,97,0.148173,-0.0735524,0.0200662,8
1429614120111,97,0.143706,-0.0701424,0.0194292,8
1429614120153,97,0.123854,-0.0551542,0.0162706,10
1429614120196,97,0.0989283,-0.0433054,0.0130027,12
1429614120208,97,0.0702371,-0.0408956,0.0101932,13
1429614120250,97,0.0561588,-0.0587955,0.010619,24
1429614120292,97,0.0580544,-0.0847347,0.0132922,52
1429614120334,97,0.062642,-0.093153,0.0145728,67
1429614120375,97,0.0570426,-0.0745246,0.0123913,68
1429614120417,97,0.0260047,-0.0174103,0.00410215,64
1429614120459,97,-0.0242323,0.045977,-0.00667949,58
1429614120500,97,-0.07718,0.0908738,-0.016093,56
1429614120542,97,-0.112842,0.103279,-0.0208198,55
1429614120584,97,-0.110747,0.0937257,-0.0197915,54
1429614120626,97,-0.0728889,0.0841049,-0.0152584,49
1429614120667,97,-0.0194849,0.0865882,-0.010332,45
1429614120709,97,0.0241686,0.0995528,-0.00735038,40
1429614120751,97,0.0359203,0.108752,-0.00710431,37
1429614120763,97,0.0211915,0.101187,-0.00777494,35
1429614120805,97,0.00436792,0.062651,-0.00566573,32
1429614120847,97,0.00520198,0.00443134,7.57438e-05,29
1429614120889,97,0.0228896,-0.0533455,0.00738167,27
1429614120932,97,0.0504474,-0.0962335,0.0141939,27
1429614120944,97,0.0707221,-0.108834,0.0173231,32
1429614120956,97,0.0764524,-0.100889,0.0171345,32
1429614120997,97,0.0565886,-0.0732312,0.0124782,53
1429614121039,97,0.0152168,-0.0376794,0.00507234,65
1429614121081,97,-0.0269705,-0.0166911,-0.000985291,69
1429614121122,97,-0.0582588,-0.0146418,-0.00417192,66
1429614121164,97,-0.0771082,-0.0238842,-0.00508783,61
1429614121175,97,-0.0981684,-0.0215508,-0.00726509,59
1429614121216,97,-0.108053,-0.0264402,-0.00779027,56
1429614121258,97,-0.109534,-0.0152253,-0.00895108,54
1429614121299,97,-0.0833818,-0.0214229,-0.00592433,52
1429614121341,97,-0.0497078,-0.000286309,-0.00467255,49
1429614121353,97,-0.0180656,0.0258592,-0.00414333,47
1429614121394,97,0.0100804,0.0406032,-0.0028912,41
1429614121436,97,0.0199345,0.0372684,-0.00163861,39
1429614121448,97,0.0201926,0.0138724,0.000600171,38
1429614121489,97,0.0111427,-0.00304823,0.00134433,37
1429614121531,97,0.00488835,-0.00680481,0.00110778,34
1429614121543,97,0.0118245,0.0152271,-0.000319949,34
1429614121584,97,0.038685,0.0241936,0.00137708,32
1429614121596,97,0.0718282,0.0389046,0.00310245,31
1429614121638,97,0.0913557,0.0400711,0.00481806,30
1429614121650,97,0.0970456,0.0246441,0.0067986,32
1429614121691,97,0.0902881,-0.00472017,0.00893124,40
1429614121705,97,0.0653223,-0.0364402,0.00952427,46
1429614121746,97,0.0329439,-0.0626178,0.00895504,64
1429614121768,97,-0.00985608,-0.063932,0.00504535,66
1429614121810,97,-0.0502598,-0.0594982,0.000866717,62
1429614121836,97,-0.0821584,-0.0384555,-0.00408301,59
1429614121878,97,-0.0997198,-0.00315315,-0.00899936,49
1429614121904,97,-0.0812257,0.0273777,-0.0101547,45
1429614121946,97,-0.0623106,0.0520213,-0.0106677,37
1429614121968,97,-0.0601314,0.0577297,-0.011016,35
1429614122009,97,-0.0897963,0.0485867,-0.0129594,32
1429614122036,97,-0.140636,0.0346196,-0.0164139,28
1429614122078,97,-0.174641,0.021197,-0.0183879,21
1429614122105,97,-0.174394,0.0198211,-0.018218,19
1429614122146,97,-0.123892,0.0253052,-0.0139849,15
1429614122168,97,-0.045035,0.031853,-0.00718631,14
1429614122210,97,0.0654828,0.0226013,0.00401398,12
1429614122252,97,0.169859,-0.0103415,0.0168742,13
1429614122294,97,0.250405,-0.0606473,0.0291463,15
1429614122335,97,0.275155,-0.0972108,0.0346535,15
1429614122378,97,0.253463,-0.132536,0.0361163,14
1429614122419,97,0.189856,-0.15069,0.0319474,22
1429614122460,97,0.129267,-0.148715,0.0261358,46
1429614122502,97,0.082568,-0.119238,0.0190476,60
1429614122544,97,0.0615355,-0.0529624,0.0108293,61
1429614122585,97,0.0287026,0.0494973,-0.00194914,56
1429614122627,97,-0.0181442,0.15017,-0.0157149,49
1429614122668,97,-0.0807154,0.185018,-0.0249115,46
1429614122710,97,-0.13177,0.149805,-0.026236,46
1429614122751,97,-0.158356,0.042696,-0.0187827,46
1429614122797,97,-0.158633,-0.0730678,-0.0079615,42
1429614122809,97,-0.134287,-0.145115,0.00100201,42
1429614122856,97,-0.0829828,-0.155499,0.00674464,38
1429614122871,97,-0.0346562,-0.115495,0.00751977,36
1429614122886,97,-0.0013469,-0.0473351,0.00426692,34
1429614122928,97,0.0235126,0.00963078,0.001293,30
1429614122969,97,0.0178397,0.0570893,-0.00363923,28
1429614123011,97,0.0252264,0.0723123,-0.00438872,26
1429614123052,97,0.00674894,0.0922454,-0.00794659,25
1429614123094,97,-0.00898386,0.109208,-0.010984,26
1429614123136,97,-0.0230534,0.139046,-0.0150124,40
1429614123181,97,-0.00734301,0.146526,-0.0142708,59
1429614123193,97,0.0220188,0.130261,-0.0100051,59
1429614123239,97,0.0594652,0.094562,-0.0032339,60
1429614123256,97,0.0785572,0.0567026,0.00200926,58
1429614123268,97,0.0849671,0.0148108,0.00645301,54
1429614123309,97,0.0846539,-0.0262389,0.0102142,48
1429614123351,97,0.076498,-0.0440227,0.0110496,41
1429614123393,97,0.0588236,-0.04637,0.00964832,40
1429614123435,97,0.0140466,-0.0343992,0.00446067,40
1429614123477,97,-0.059559,-0.010865,-0.00448059,39
1429614123519,97,-0.14441,0.0195245,-0.0150334,36
1429614123562,97,-0.221656,0.0409072,-0.0240869,34
1429614123604,97,-0.248165,0.0470223,-0.0270223,33
1429614123647,97,-0.195251,0.0146701,-0.019306,31
1429614123690,97,-0.0901458,-0.0379678,-0.00480482,30
1429614123732,97,-0.00801546,-0.0808096,0.00668504,33
1429614123774,97,0.0421235,-0.106631,0.0137104,41
1429614123820,97,0.0462191,-0.102022,0.0136481,57
1429614123832,97,0.0390635,-0.0782066,0.0108302,59
1429614123844,97,0.0405286,-0.0428482,0.00770251,59
1429614123885,97,0.0566907,-0.0084928,0.006026,54
1429614123927,97,0.0747204,0.00942594,0.00605612,49
1429614123969,97,0.0725371,0.0108888,0.00572246,41
1429614124011,97,0.0683002,-0.00644155,0.00695812,40
1429614124052,97,0.0652878,-0.0183676,0.00777712,39
1429614124094,97,0.0599693,-0.0264668,0.00806305,39
1429614124135,97,0.0582662,-0.0224477,0.00751349,36
1429614124177,97,0.0602417,-0.0178499,0.00725588,33
1429614124218,97,0.0768268,-0.019861,0.00896591,28
1429614124260,97,0.102103,-0.039087,0.0130961,26
1429614124302,97,0.124103,-0.0610868,0.0171283,23
1429614124343,97,0.132951,-0.0741852,0.0191202,23
1429614124388,97,0.112067,-0.0565528,0.0154961,37
1429614124399,97,0.0665649,-0.0135711,0.00732858,44
1429614124442,97,0.0183731,0.0344518,-0.00146931,60
1429614124486,97,-0.0173054,0.0776986,-0.00861609,67
1429614124497,97,-0.0335589,0.0984477,-0.0119321,66
1429614124540,97,-0.0525561,0.0992985,-0.01367,62
1429614124554,97,-0.0875483,0.0905783,-0.0159723,59
1429614124601,97,-0.134324,0.0873872,-0.0197398,51
1429614124613,97,-0.1521,0.0726711,-0.0199642,51
1429614124654,97,-0.127735,0.0406938,-0.0148853,47
1429614124696,97,-0.0591126,-0.00617002,-0.00464611,46
1429614124737,97,0.0134858,-0.0587982,0.00631661,45
1429614124778,97,0.0334321,-0.0946217,0.0111549,43
1429614124820,97,0.0132693,-0.11149,0.0108623,39
1429614124862,97,-0.0307547,-0.10137,0.00614187,36
1429614124903,97,-0.0550934,-0.0818451,0.00234698,33
1429614124945,97,-0.0348173,-0.058857,0.00212504,32
1429614124986,97,0.015413,-0.0300039,0.00402836,30
1429614125028,97,0.0596675,-0.00493674,0.00578644,34
1429614125069,97,0.0672295,0.0369482,0.00271538,51
1429614125111,97,0.0445484,0.0945808,-0.00450844,62
1429614125152,97,-0.0150475,0.154706,-0.0153585,63
1429614125194,98,-0.0710399,0.191177,-0.0237894,57
1429614125236,98,-0.113529,0.185406,-0.0272027,48
1429614125278,98,-0.129804,0.144584,-0.0249674,43
1429614125320,98,-0.144391,0.082307,-0.0206927,40
1429614125362,98,-0.16714,0.0382193,-0.0187269,40
1429614125404,98,-0.191179,0.0195416,-0.0192145,37
1429614125450,98,-0.192109,0.0216684,-0.0194797,34
1429614125462,98,-0.157515,0.0350518,-0.017491,32
1429614125503,98,-0.0565508,0.030311,-0.00791433,29
1429614125515,98,0.078068,-0.000931779,0.00722205,29
1429614125558,98,0.198615,-0.0417639,0.0219553,26
1429614125569,98,0.268641,-0.0591979,0.0298452,25
1429614125612,98,0.267609,-0.0633343,0.0302639,23
1429614125623,98,0.224041,-0.0510395,0.0251277,22
1429614125665,98,0.172078,-0.0513092,0.0204449,19
1429614125677,98,0.130946,-0.0615109,0.0176016,17
1429614125718,98,0.10515,-0.0723502,0.016173,17
1429614125737,98,0.0966638,-0.10289,0.0182707,22
1429614125778,98,0.0907473,-0.14582,0.0216844,38
1429614125805,98,0.0567327,-0.183036,0.0219982,54
1429614125846,98,0.0117221,-0.202372,0.0196977,62
1429614125868,98,-0.0524239,-0.172478,0.0109912,61
1429614125911,98,-0.115551,-0.109743,-0.000535527,58
1429614125936,98,-0.160707,-0.0320581,-0.0118365,54
1429614125978,98,-0.172217,0.032038,-0.0188185,50
1429614126004,98,-0.161493,0.0762272,-0.0219017,47
1429614126046,98,-0.128072,0.0972218,-0.0207936,45
1429614126068,98,-0.0971914,0.112563,-0.0193245,43
1429614126110,98,-0.0662403,0.114769,-0.016728,40
1429614126136,98,-0.0470489,0.115097,-0.0149734,37
1429614126178,98,-0.0442513,0.118377,-0.0149886,32
1429614126205,98,-0.0421667,0.129641,-0.0157526,28
1429614126246,98,-0.0296299,0.123102,-0.0140257,24
1429614126268,98,-0.00613285,0.0921223,-0.00900709,23
1429614126310,98,0.0156944,0.0472105,-0.00287246,23
1429614126336,98,0.0242692,0.0035875,0.00187605,23
1429614126378,98,0.0238749,-0.0316934,0.00502495,24
1429614126420,98,0.0160389,-0.0500029,0.00593141,26
1429614126464,98,0.0253378,-0.0665205,0.00821707,34
1429614126477,98,0.0589807,-0.0888981,0.0132209,40
1429614126519,98,0.0916274,-0.111798,0.0180741,62
1429614126561,98,0.118877,-0.136873,0.0227215,67
1429614126603,98,0.126661,-0.135468,0.0231325,63
1429614126645,98,0.115399,-0.100522,0.0189581,58
1429614126689,98,0.0921487,-0.047024,0.0121947,51
1429614126700,98,0.0588958,0.00163781,0.00501407,51
1429614126742,98,0.013985,0.031689,-0.00154763,47
1429614126783,98,-0.0427317,0.0488267,-0.00798242,45
1429614126825,98,-0.112753,0.0657953,-0.0154783,40
1429614126866,98,-0.147703,0.0773664,-0.0194854,35
1429614126908,98,-0.125019,0.0733613,-0.0171578,29
1429614126949,98,-0.0437375,0.0424695,-0.00747211,25
1429614126991,98,0.0493283,0.0138937,0.00304979,22
1429614127033,98,0.108527,-0.0132611,0.0104754,20
1429614127075,98,0.116028,-0.0257186,0.0121857,21
1429614127116,98,0.0757992,-0.025583,0.00866567,29
1429614127158,98,0.0376991,-0.0307176,0.00584602,50
1429614127200,98,0.0183354,-0.0492418,0.00576628,61
1429614127242,98,0.0301484,-0.0818862,0.00955415,61
1429614127283,97,0.0591615,-0.110736,0.0145206,56
1429614127325,97,0.0555554,-0.109991,0.0141315,48
1429614127366,97,0.0195637,-0.0708676,0.00772063,44
1429614127408,97,-0.0386352,0.00386774,-0.00361471,42
1429614127449,97,-0.0859116,0.0790207,-0.0140177,40
1429614127491,97,-0.102278,0.121309,-0.0190315,34
1429614127532,97,-0.0800083,0.115192,-0.0166407,27
1429614127574,97,-0.0434898,0.0752745,-0.010129,19
1429614127615,97,-0.00750853,0.0143759,-0.00187391,16
1429614127657,97,-0.0123955,-0.0218637,0.000812416,14
1429614127698,97,-0.0435786,-0.034403,-0.000790555,13
1429614127740,97,-0.0667766,-0.0292344,-0.00323456,18
1429614127784,97,-0.0849071,0.00936776,-0.00807802,34
1429614127799,97,-0.0722127,0.0572695,-0.0111105,43
1429614127811,97,-0.0194731,0.0933856,-0.0097378,52
1429614127852,97,0.0909451,0.0867582,0.000364979,65
1429614127897,97,0.176501,0.0804753,0.00834257,64
1429614127909,97,0.176384,0.0983729,0.00676533,61
1429614127950,97,0.0517573,0.141129,-0.00780012,55
1429614127992,97,-0.159941,0.20864,-0.032086,45
1429614128034,97,-0.355777,0.238084,-0.0520573,42
1429614128080,97,-0.453889,0.21189,-0.0584903,40
1429614128092,97,-0.396844,0.109152,-0.0449737,40
1429614128136,97,-0.234333,-0.0239213,-0.018796,38
1429614128149,97,-0.0333727,-0.153614,0.0108344,36
1429614128191,97,0.134575,-0.240617,0.0341222,30
1429614128237,97,0.238001,-0.27068,0.0467079,26
1429614128249,97,0.27343,-0.244946,0.0478609,24
1429614128290,97,0.263477,-0.194758,0.0428548,21
1429614128332,97,0.221075,-0.130844,0.0330981,20
1429614128374,97,0.171726,-0.087679,0.0247065,19
1429614128415,97,0.128852,-0.0694638,0.0190779,28
1429614128458,97,0.0997678,-0.0672785,0.0162109,56
1429614128500,97,0.0750661,-0.0701097,0.0142423,75
1429614128542,97,0.0606872,-0.0685533,0.0128247,81
1429614128585,97,0.0345068,-0.0480271,0.00824652,77
1429614128627,97,0.0133207,-0.019219,0.00328585,62
1429614128669,97,-0.0042892,0.0127247,-0.00173362,50
1429614128710,97,-0.0185169,0.0441979,-0.00642175,40
1429614128752,97,-0.0537569,0.0812519,-0.0138435,38
1429614128793,97,-0.0692069,0.0913346,-0.0166748,30
1429614128835,97,-0.0730844,0.0790251,-0.0159119,22
1429614128877,97,-0.0562241,0.0521425,-0.0113983,7
1429614128918,97,-0.0337718,0.0284929,-0.00658974,0
1429614128960,97,-0.0194248,0.0249793,-0.00472788,0
1429614128972,97,-0.0224087,0.0467462,-0.00738542,0
1429614129013,97,-0.0225924,0.0740265,-0.0103901,0
1429614129055,97,-0.0221884,0.103436,-0.0135376,0
1429614129097,97,-0.0197077,0.121929,-0.0152855,16
1429614129109,97,-0.00171795,0.120071,-0.0131571,31
1429614129150,97,0.0206427,0.0991069,-0.00846413,58
1429614129192,97,0.0564508,0.0486154,0.000849557,70
1429614129233,96,0.0804177,-0.00869493,0.00963805,66
1429614129275,96,0.0934858,-0.059436,0.0165316,56
1429614129317,96,0.0836467,-0.0980315,0.01966,50
1429614129358,96,0.0598584,-0.109624,0.0183282,46
1429614129400,96,0.017376,-0.103629,0.0131023,46
1429614129444,96,-0.0252142,-0.071798,0.00502652,45
1429614129456,96,-0.0597303,-0.0380382,-0.00234283,45
1429614129500,96,-0.0776417,-0.0155217,-0.00670155,38
1429614129512,96,-0.0735157,-0.0102378,-0.00679766,35
1429614129553,96,-0.0374732,-0.0366789,-8.5398e-05,29
1429614129598,96,0.00750249,-0.0633813,0.00762648,21
1429614129611,96,0.0435024,-0.078647,0.0131734,20
1429614129653,96,0.0380145,-0.0593224,0.0104674,17
1429614129695,96,0.00558617,-0.014757,0.00218606,19
1429614129706,96,-0.0366041,0.0404558,-0.00825538,19
1429614129748,96,-0.0645953,0.0854618,-0.0160475,45
1429614129759,96,-0.0588917,0.0961358,-0.0166105,57
1429614129800,96,-0.0305359,0.0691472,-0.0106901,75
1429614129812,96,0.0173047,0.0181915,-9.48868e-05,79
1429614129853,96,0.0434647,-0.0234705,0.00717302,77
1429614129868,95,0.0585028,-0.0449542,0.0111355,75
1429614129910,95,0.0446794,-0.035961,0.00868035,65
1429614129936,95,0.0296162,-0.0134035,0.00464777,62
1429614129978,95,0.00132985,0.024805,-0.00253131,54
1429614130004,95,-0.0243296,0.0545553,-0.00850269,53
1429614130046,95,-0.0634727,0.079584,-0.0153551,49
1429614130069,95,-0.0896021,0.0779154,-0.0179725,48
1429614130104,95,-0.0996107,0.046123,-0.0156464,43
1429614130136,95,-0.0836668,0.00367514,-0.00933377,38
1429614130178,95,-0.0470803,-0.0497097,0.00028342,29
1429614130204,95,-0.00564837,-0.0803918,0.00796687,26
1429614130246,95,0.0397847,-0.0987342,0.0147654,18
1429614130269,95,0.079526,-0.0949536,0.0185501,16
1429614130304,95,0.0991134,-0.0841898,0.0195173,14
1429614130336,95,0.0959548,-0.0714279,0.0178494,12
1429614130371,95,0.0615128,-0.0552253,0.0124541,12
1429614130405,95,0.00201414,-0.0265194,0.00303961,21
1429614130436,95,-0.0608081,0.0118372,-0.00775133,40
1429614130470,95,-0.104093,0.0637493,-0.0178391,59
1429614130504,95,-0.103938,0.102761,-0.0220216,68
1429614130538,95,-0.0683349,0.122577,-0.020301,65
1429614130571,94,-0.0125289,0.117138,-0.0137732,58
1429614130604,94,0.0337826,0.0956628,-0.00655859,53
1429614130646,94,0.0541187,0.0636854,-0.00101392,50
1429614130687,94,0.0360628,0.0289668,0.000751155,50
1429614130728,94,-0.00205712,0.00998185,-0.00126755,47
1429614130770,94,-0.0385746,-0.00131825,-0.00392105,42
1429614130812,94,-0.0631721,-0.00535251,-0.00605743,36
1429614130853,94,-0.0575653,-0.0220981,-0.00372233,33
1429614130895,94,-0.0357064,-0.0348258,-9.21883e-05,28
1429614130937,94,0.00327008,-0.054072,0.00599746,24
1429614130978,94,0.0382568,-0.0537626,0.00958101,17
1429614131020,94,0.056449,-0.0417627,0.0102183,12
1429614131061,94,0.0506456,-0.0135959,0.00665165,12
1429614131104,94,0.0396617,0.0106382,0.00300376,28
1429614131146,94,0.0314987,0.0301987,0.00013443,56
1429614131188,94,0.0360962,0.0330928,0.000307622,63
1429614131230,93,0.059886,0.0103553,0.00508473,57
1429614131272,93,0.0780785,-0.0193566,0.00995577,51
1429614131313,93,0.0848612,-0.0435158,0.0130883,44
1429614131355,93,0.0692775,-0.0599864,0.0132093,42
1429614131396,93,0.0307801,-0.048713,0.00809033,41
1429614131438,93,-0.00495533,-0.0250855,0.0020518,38
1429614131480,93,-0.0443922,0.02176,-0.00669602,31
1429614131522,93,-0.0671313,0.0577225,-0.0126486,27
1429614131564,93,-0.0721484,0.0735722,-0.014744,21
1429614131605,93,-0.0618452,0.0606892,-0.0123733,19
1429614131647,93,-0.0377238,0.0159089,-0.00543128,17
1429614131689,93,-0.0149002,-0.0289874,0.00142514,16
1429614131735,93,0.0177467,-0.0641188,0.00830169,25
1429614131747,93,0.0439109,-0.068142,0.0113829,34
1429614131788,93,0.0775852,-0.0382827,0.0117415,56
1429614131830,93,0.0967628,0.00138126,0.00967598,79
1429614131872,93,0.115503,0.0201607,0.0097098,77
1429614131913,93,0.0975564,0.00885194,0.00904934,66
1429614131955,93,0.0531025,-0.0222629,0.00769222,58
1429614131997,93,-0.0181476,-0.0480338,0.00304761,51
1429614132038,93,-0.0944406,-0.0613169,-0.00339762,49
1429614132080,93,-0.170922,-0.0353489,-0.0138337,46
1429614132122,93,-0.218031,-0.000902889,-0.0222982,42
1429614132164,93,-0.226088,0.0468811,-0.0278924,35
1429614132206,93,-0.181473,0.0711255,-0.0259394,31
1429614132247,93,-0.119006,0.0885701,-0.0211443,28
1429614132289,93,-0.038153,0.0745773,-0.0115027,26
1429614132331,93,0.0413357,0.0336706,0.000786726,27
1429614132373,93,0.103108,-0.0110637,0.0117173,38
1429614132415,93,0.131651,-0.0344666,0.0170636,64
1429614132456,93,0.134293,-0.0264189,0.0165197,74
1429614132498,93,0.11194,0.00933938,0.0105325,69
1429614132540,93,0.0741909,0.0540748,0.00205757,62
1429614132581,93,0.0452901,0.0664125,-0.00217413,52
1429614132623,93,0.0111629,0.0583101,-0.00482622,48
1429614132665,93,-0.0236323,0.0260976,-0.00508683,47
1429614132707,93,-0.0589177,-0.0106631,-0.00494154,46
1429614132748,93,-0.0629972,-0.0499602,-0.00133916,41
1429614132790,93,-0.0340948,-0.0708814,0.00377059,39
1429614132832,93,0.0146655,-0.0673032,0.00839946,34
1429614132874,93,0.0516395,-0.0349797,0.00887076,32
1429614132915,93,0.0823708,-0.00519628,0.00899446,29
1429614132957,93,0.062359,0.026573,0.00366884,30
1429614132968,93,0.0351949,0.0354429,-2.34195e-05,35
1429614133010,93,-0.0128645,0.0353533,-0.00495578,48
1429614133051,93,-0.0550867,0.0323078,-0.00897286,69
1429614133093,93,-0.0715991,0.0284514,-0.0102751,72
1429614133135,93,-0.0647651,0.024034,-0.0091126,65
1429614133177,93,-0.0383554,0.0111816,-0.00505566,58
1429614133218,93,0.00636766,-0.0199651,0.00269209,51
1429614133260,93,0.0480869,-0.0618972,0.0112607,49
1429614133302,93,0.0728965,-0.0871178,0.0163676,47
1429614133343,93,0.0678629,-0.0783509,0.0149249,45
1429614133385,93,0.0420794,-0.0397339,0.00830683,40
1429614133396,93,0.0172307,-0.00415251,0.00217372,40
1429614133438,93,0.0140703,0.012946,0.000113081,36
1429614133450,93,0.0393753,0.000359007,0.00396739,34
1429614133491,93,0.0759204,-0.0342115,0.0112343,32
1429614133533,93,0.0938347,-0.0732187,0.0171333,30
1429614133575,93,0.0718052,-0.0825418,0.0158204,31
1429614133587,93,0.00514505,-0.0566432,0.00635384,34
1429614133628,93,-0.0776012,-0.00357458,-0.00763891,45
1429614133640,93,-0.142261,0.0602611,-0.0209138,52
1429614133682,93,-0.160206,0.108877,-0.027839,65
1429614133723,93,-0.130719,0.125863,-0.0265894,70
1429614133735,93,-0.0800682,0.109496,-0.0196847,69
1429614133776,93,-0.0410108,0.0771371,-0.0122553,64
1429614133788,93,-0.0214872,0.0329317,-0.00566001,62
1429614133829,93,-0.00735878,-0.0188472,0.00120012,57
1429614133841,93,0.0136778,-0.0564774,0.00732653,55
1429614133882,93,0.0433058,-0.0778967,0.0126915,52
1429614133928,93,0.0720475,-0.0864622,0.0167069,49
1429614133939,93,0.0937848,-0.0941641,0.0199259,48
1429614133981,93,0.0859491,-0.0854873,0.0181768,44
1429614134004,93,0.0316112,-0.0439121,0.00797868,40
1429614134046,93,-0.0299903,0.00166294,-0.00336286,35
1429614134068,93,-0.0907255,0.0444224,-0.0143258,30
1429614134110,93,-0.128788,0.0666407,-0.0207077,26
1429614134136,93,-0.123885,0.068505,-0.0203883,23
1429614134177,93,-0.0877171,0.0521587,-0.014829,20
1429614134204,93,-0.0349888,0.035516,-0.00745895,18
1429614134246,93,0.0108881,0.0244237,-0.00142886,21
1429614134268,93,0.0454432,0.0231014,0.00235136,32
1429614134309,93,0.0808811,0.0143163,0.00701755,45
1429614134336,93,0.111433,-0.00199051,0.0119659,53
1429614134377,93,0.141259,-0.032877,0.0184398,54
1429614134404,93,0.151351,-0.0575108,0.0221396,52
1429614134445,93,0.134156,-0.0714897,0.0218799,50
1429614134468,93,0.0753689,-0.0500493,0.0133057,47
1429614134512,93,0.00394046,-0.0265918,0.00326213,46
1429614134536,93,-0.0634122,0.0142632,-0.00830051,45
1429614134578,93,-0.0952721,0.0479529,-0.0153461,44
1429614134604,93,-0.0997724,0.0846028,-0.0197132,42
1429614134645,93,-0.0865249,0.112943,-0.0213058,39
1429614134669,93,-0.0752682,0.127891,-0.0216332,36
1429614134710,93,-0.0626736,0.110234,-0.0184081,32
1429614134736,93,-0.0354851,0.0549512,-0.00964016,28
1429614134777,93,-0.00472576,-0.0238823,0.00204005,24
1429614134804,93,0.0302849,-0.0990819,0.0137699,20
1429614134846,93,0.0558066,-0.145689,0.021414,15
1429614134887,93,0.0616986,-0.143691,0.0217918,10
1429614134928,93,0.0531926,-0.10934,0.0172327,14
1429614134970,93,0.0385804,-0.0711755,0.0116478,37
1429614135015,93,0.0239832,-0.0479002,0.00763179,49
1429614135027,93,0.0157193,-0.0446858,0.00641975,52
1429614135069,92,0.00250682,-0.0420471,0.0047323,51
1429614135110,92,-0.012216,-0.0394113,0.00290106,47
1429614135152,92,-0.0298685,-0.0210658,-0.000938761,42
1429614135195,92,-0.0402699,0.00386226,-0.00473456,40
1429614135238,92,-0.0426798,0.037651,-0.00863381,40
1429614135280,92,-0.0399021,0.0790621,-0.0128214,39
1429614135321,92,-0.0330555,0.114019,-0.0158969,35
1429614135362,92,-0.0277178,0.139258,-0.0180415,33
1429614135404,92,-0.0393161,0.144469,-0.019884,29
1429614135446,92,-0.0531253,0.126017,-0.0194147,28
1429614135488,92,-0.0690324,0.0959481,-0.0178216,26
1429614135529,92,-0.0782783,0.0504347,-0.013912,25
1429614135571,92,-0.0537801,-0.00371361,-0.00541577,28
1429614135612,92,-0.0229301,-0.0587323,0.00387451,40
1429614135654,92,0.0167693,-0.093744,0.0119298,60
1429614135695,92,0.0487542,-0.10217,0.0162905,64
1429614135737,92,0.0575805,-0.0688057,0.0135666,60
1429614135778,92,0.0598906,-0.0208398,0.00863903,56
1429614135820,92,0.0553631,0.0270117,0.00302051,50
1429614135862,92,0.0620996,0.0508324,0.00118953,48
1429614135904,92,0.0581409,0.0446715,0.00141277,45
1429614135945,92,0.0438,0.0180183,0.00268191,42
1429614135988,92,0.0258051,-0.0228771,0.00503846,36
1429614135999,92,0.00856977,-0.0544847,0.00646435,36
1429614136041,92,-0.00520879,-0.0671883,0.00630326,29
1429614136083,92,-0.00870673,-0.0511836,0.00427857,25
1429614136125,92,-0.00375016,-0.0178255,0.00140513,18
1429614136166,92,0.00605876,0.00989242,-0.000379098,15
1429614136208,92,0.0363619,0.0126366,0.00235239,15
1429614136250,92,0.0612422,-0.0013923,0.00619255,27
1429614136292,92,0.0721432,-0.0163249,0.00871834,51
1429614136338,92,0.0571584,-0.0225499,0.00785354,61
1429614136349,92,0.0354501,-0.0124232,0.00470832,61
1429614136391,92,0.0270725,-0.0084172,0.00349977,59
1429614136433,91,0.0360559,-0.0165482,0.00519241,56
1429614136474,91,0.0439941,-0.033865,0.00769201,52
1429614136516,91,0.0464333,-0.0570743,0.0102624,51
1429614136558,91,0.0233511,-0.0705127,0.00934334,40
1429614136668,91,-0.032486,-0.054937,0.00223902,40
1429614136710,91,-0.106518,-0.004075,-0.0101972,36
1429614136752,91,-0.1661,0.0540385,-0.0220427,33
1429614136793,91,-0.189231,0.108461,-0.0297982,29
1429614136835,91,-0.157362,0.131406,-0.0289648,27
1429614136877,91,-0.0937615,0.124758,-0.0219639,24
1429614136918,91,-0.0416967,0.118511,-0.0160468,28
1429614136960,91,-0.0068589,0.100288,-0.0107581,46
1429614137001,91,0.0120026,0.0718534,-0.00603155,59
1429614137043,91,0.032127,0.0275525,0.000462376,61
1429614137084,91,0.0548887,-0.029636,0.00855284,58
1429614137126,91,0.0816795,-0.0772896,0.0160642,51
1429614137173,91,0.0929283,-0.117102,0.0213079,45
1429614137215,91,0.0837866,-0.145002,0.0233093,43
1429614137257,91,0.0453744,-0.139887,0.0188529,41
1429614137299,91,-0.01295,-0.104479,0.00932076,39
1429614137340,91,-0.076811,-0.0371807,-0.00403537,35
1429614137381,91,-0.124797,0.0305647,-0.0158533,32
1429614137423,91,-0.148128,0.0886677,-0.0241061,30
1429614137464,91,-0.145758,0.116494,-0.0265953,26
1429614137506,91,-0.0981669,0.106505,-0.0207851,24
1429614137548,91,-0.0287846,0.0616203,-0.00916718,22
1429614137590,91,0.0683818,-0.00777511,0.00771516,20
1429614137631,91,0.139601,-0.0790684,0.0221024,16
1429614137672,91,0.188166,-0.1354,0.0327564,22
1429614137714,91,0.196169,-0.141431,0.0339499,44
1429614137727,91,0.171545,-0.119018,0.0291839,52
1429614137768,91,0.131794,-0.0867041,0.0219522,61
1429614137815,91,0.116452,-0.0764476,0.0194346,58
1429614137827,91,0.116837,-0.0946986,0.0214083,56
1429614137869,91,0.113163,-0.0969706,0.0211846,51
1429614137910,91,0.0763485,-0.0762248,0.0154395,44
1429614137952,91,0.00124043,-0.0302456,0.0031943,42
1429614137964,91,-0.111059,0.0524174,-0.0165348,41
1429614138005,91,-0.220838,0.125819,-0.0350133,40
1429614138017,91,-0.288335,0.16712,-0.0462216,39
1429614138058,91,-0.286666,0.18165,-0.0474704,34
1429614138099,91,-0.221412,0.165193,-0.0392659,30
1429614138141,91,-0.130904,0.151846,-0.0286406,27
1429614138153,91,-0.0572868,0.146801,-0.020629,25
1429614138195,91,-0.0212912,0.143808,-0.0166541,22
1429614138207,91,-0.00920391,0.112881,-0.0123238,22
1429614138249,91,-0.00170486,0.0627296,-0.00647242,19
1429614138261,91,0.0326807,-0.017794,0.00507006,19
1429614138302,91,0.0902952,-0.107021,0.0198549,17
1429614138314,91,0.145107,-0.169036,0.031548,16
1429614138355,91,0.164509,-0.180573,0.0345782,15
1429614138368,91,0.150064,-0.165399,0.0316756,17
1429614138409,91,0.110467,-0.130494,0.024199,38
1429614138436,91,0.0667863,-0.100098,0.0167696,46
1429614138478,91,0.0314887,-0.0852576,0.0117695,62
1429614138504,91,0.00137563,-0.0543512,0.00560594,62
1429614138545,91,-0.0159238,-0.0197189,0.000382768,54
1429614138569,91,-0.0290081,0.0321783,-0.00616988,50
1429614138610,91,-0.0397848,0.0882949,-0.012897,41
1429614138636,91,-0.0524807,0.138529,-0.019175,40
1429614138677,91,-0.0534092,0.152423,-0.0206816,38
1429614138704,91,-0.0508937,0.142637,-0.0193525,37
1429614138747,91,-0.0325259,0.0835501,-0.0116468,31
1429614138770,91,-0.0190827,0.0163821,-0.00354818,29
1429614138804,91,-0.00463649,-0.0430248,0.00383757,24
1429614138845,91,0.0107211,-0.0772047,0.00879372,17
1429614138869,91,0.0218487,-0.0803586,0.0102198,16
1429614138911,91,0.0232308,-0.0477706,0.00708586,13
1429614138937,91,0.0194735,-0.00623223,0.00256947,12
1429614138969,91,0.0133899,0.0299128,-0.00165124,12
1429614139004,91,0.00260921,0.0503719,-0.00476468,15
1429614139037,91,0.00443031,0.0460699,-0.00415855,30
1429614139069,91,0.00732054,0.0300763,-0.00226693,52
1429614139104,91,-0.00576939,0.0232458,-0.00287877,73
1429614139146,91,-0.0225251,0.0118692,-0.00340914,79
1429614139187,91,-0.0411762,0.0218587,-0.00620584,74
1429614139229,91,-0.0529497,0.019427,-0.00710945,64
1429614139270,91,-0.0382116,0.0141875,-0.00512637,58
1429614139312,91,-0.0109402,0.0145259,-0.00247861,55
1429614139353,91,0.00986094,0.0396139,-0.00285964,54
1429614139398,91,0.0264653,0.0739626,-0.00452677,50
1429614139413,91,0.0300449,0.105223,-0.00709009,48
1429614139428,91,0.0233829,0.0932524,-0.00652844,46
1429614139469,91,0.015524,0.0326189,-0.0015858,41
1429614139511,91,-0.00497142,-0.0379426,0.00301563,37
1429614139552,91,-0.0320486,-0.0942686,0.00563115,34
1429614139594,91,-0.0365074,-0.107879,0.00636173,32
1429614139636,91,-0.00899161,-0.0967877,0.00776748,34
1429614139678,91,0.0124151,-0.0465322,0.00508047,56
1429614139726,91,0.0520042,-0.0216667,0.00628647,74
1429614139738,91,0.0778942,-0.0173187,0.00795683,80
1429614139781,91,0.103106,-0.0419411,0.011937,81
1429614139829,92,0.118243,-0.0762876,0.0157482,66
1429614139841,92,0.118006,-0.0960265,0.0170535,66
1429614139883,92,0.0691841,-0.0783079,0.0115192,48
1429614139925,92,-0.0105694,-0.0346081,0.00184554,40
1429614139967,92,-0.107521,0.0204329,-0.00964102,35
1429614140009,92,-0.174961,0.0530878,-0.0169681,33
1429614140050,92,-0.19402,0.0699316,-0.0192916,27
1429614140092,92,-0.168839,0.0795589,-0.0178491,23
1429614140133,92,-0.105604,0.0898802,-0.013889,18
1429614140175,92,-0.0250414,0.0905584,-0.00815466,16
1429614140217,92,0.0386544,0.0868714,-0.00336445,13
1429614140258,92,0.0907124,0.0732389,0.00120973,12
1429614140299,92,0.0974875,0.0504642,0.00323234,20
1429614140342,92,0.0836552,0.0128228,0.00482885,38
1429614140383,92,0.0731958,-0.0385259,0.00758734,65
1429614140425,92,0.0728078,-0.0890184,0.0109256,69
1429614140466,92,0.0916386,-0.1294,0.0149042,62
1429614140508,92,0.0968294,-0.125716,0.0149112,55
1429614140551,92,0.0713864,-0.0915182,0.0108841,47
1429614140593,92,0.0313158,-0.0524196,0.00560607,43
1429614140636,92,-0.0156644,-0.0280982,0.000830664,41
1429614140678,92,-0.0428191,-0.0345981,-0.000552834,39
1429614140721,92,-0.0483332,-0.0451835,-0.000213185,33
1429614140764,92,-0.0654365,-0.0254872,-0.0026933,27
1429614140806,92,-0.0987732,0.0305854,-0.00875082,24
1429614140847,92,-0.155361,0.119913,-0.018596,20
1429614140889,92,-0.171592,0.188072,-0.0243493,17
1429614140930,92,-0.160186,0.194518,-0.0241111,13
1429614140972,92,-0.0924717,0.136139,-0.0155682,18
1429614141015,92,0.0010262,0.0342544,-0.0022695,45
1429614141027,92,0.0848259,-0.0532559,0.00944,45
1429614141068,92,0.120535,-0.101802,0.0152348,69
1429614141111,92,0.132621,-0.107442,0.0165249,69
1429614141124,92,0.104495,-0.0706268,0.0120503,67
1429614141166,92,0.081588,-0.0230267,0.00720089,57
1429614141210,92,0.0623144,0.0200983,0.00290731,52
1429614141222,92,0.0511885,0.0252899,0.00179113,49
1429614141264,92,0.0484087,0.00130264,0.00326027,45
1429614141306,92,0.0325469,-0.0181188,0.00348782,43
1429614141348,92,0.0218746,-0.0511472,0.0050692,37
1429614141390,92,0.0173394,-0.068397,0.0059532,32
1429614141431,92,0.00522672,-0.0635638,0.00477559,27
1429614141474,92,-0.0227698,-0.0270727,0.000298943,22
1429614141486,92,-0.04654,0.0188865,-0.00454743,20
1429614141528,92,-0.0703606,0.0636816,-0.0092922,18
1429614141570,92,-0.067434,0.0725987,-0.00973846,14
1429614141612,92,-0.0620325,0.0666246,-0.00887928,13
