1429698053986,76,-0.145801,0.0706859,0.0388074,28
1429698054069,76,-0.1067,0.24247,0.142208,23
1429698054153,76,-0.0595091,0.410265,0.288826,24
1429698054194,76,0.017448,0.49832,0.376781,24
1429698054236,76,0.107188,0.44996,0.315822,25
1429698054277,76,0.181919,0.267832,0.0961707,36
1429698054360,76,0.204982,0.0395584,-0.185362,69
1429698054401,76,0.167057,-0.121598,-0.367936,69
1429698054442,76,0.0865815,-0.127005,-0.324207,65
1429698054578,76,-0.00177289,0.00863312,-0.0607669,50
1429698054661,76,-0.0500073,0.160035,0.266712,47
1429698054744,76,-0.0387083,0.198772,0.459123,32
1429698054786,76,0.0161892,0.0634534,0.371833,25
1429698054797,76,0.0862212,-0.170375,0.0711684,25
1429698054840,76,0.136884,-0.378228,-0.281631,19
1429698054852,76,0.152164,-0.443138,-0.48964,17
1429698054934,76,0.129007,-0.335462,-0.450482,4
1429698054976,76,0.0793063,-0.106437,-0.204432,1
1429698055029,76,0.016068,0.125657,0.0916947,16
1429698055125,76,-0.0507468,0.259655,0.2762,63
1429698055136,76,-0.109093,0.242624,0.239433,63
1429698055178,76,-0.150783,0.108254,0.0175791,60
1429698055231,76,-0.167727,-0.0589831,-0.255808,51
1429698055272,76,-0.1591,-0.17909,-0.439295,44
1429698055283,76,-0.136441,-0.19525,-0.421603,44
1429698055335,76,-0.107328,-0.117974,-0.220508,44
1429698055432,76,-0.086165,0.00238432,0.0747073,40
1429698055501,76,-0.0689418,0.0969207,0.314024,28
1429698055542,76,-0.0519309,0.129742,0.407645,24
1429698055587,76,-0.0199962,0.0974585,0.329817,19
1429698055599,76,0.0265732,0.0387098,0.159085,18
1429698055640,76,0.0794007,-0.00116878,0.00200705,15
1429698055764,76,0.124156,0.00713703,-0.0528459,9
1429698055806,76,0.146641,0.0542401,0.00670746,26
1429698055847,76,0.139866,0.105704,0.123067,47
1429698055889,76,0.106794,0.123597,0.214062,70
1429698055972,77,0.0601388,0.0893857,0.218651,57
1429698056015,77,0.0118658,0.0157253,0.13405,49
1429698056058,77,-0.0244416,-0.0735093,-0.00979838,43
1429698056100,77,-0.0412783,-0.139986,-0.144077,43
1429698056143,77,-0.0442305,-0.168917,-0.235732,44
1429698056184,77,-0.0358869,-0.157059,-0.261636,40
1429698056226,77,-0.025605,-0.118648,-0.232456,34
1429698056308,77,-0.0151011,-0.0678818,-0.161869,15
1429698056349,77,-0.00942787,-0.0186624,-0.0736459,12
1429698056391,77,-0.00981797,0.0203464,0.00823907,9
1429698056473,77,-0.0148658,0.0472445,0.0674025,4
1429698056515,77,-0.0267916,0.0523797,0.0714371,6
1429698056556,77,-0.0360831,0.0390347,0.0315941,7
1429698056601,77,-0.0402028,0.0161309,-0.0287577,2
1429698056613,77,-0.0391293,-0.0197276,-0.108353,2
1429698056656,77,-0.0186617,-0.0236153,-0.102136,20
1429698056740,77,0.0155984,-0.00621245,-0.0378523,80
1429698056823,77,0.0635067,0.0468712,0.0978405,66
1429698056864,77,0.107354,0.104004,0.2156,55
1429698056906,77,0.127241,0.135782,0.251715,44
1429698056989,77,0.113614,0.125915,0.197525,44
1429698057030,77,0.0633506,0.0789767,0.0783447,43
1429698057072,77,-0.0053075,0.029927,-0.0208621,36
1429698057114,77,-0.0731749,0.00461423,-0.0513601,28
1429698057155,77,-0.1206,0.00752167,-0.0156746,17
1429698057197,77,-0.144792,0.011398,0.0316626,13
1429698057239,77,-0.147708,-0.0165757,0.0263206,10
1429698057282,77,-0.136627,-0.0881688,-0.0577763,8
1429698057323,77,-0.111568,-0.181006,-0.185061,6
1429698057365,77,-0.0745397,-0.246705,-0.286475,5
1429698057406,77,-0.025835,-0.239428,-0.299612,4
1429698057448,77,0.0248669,-0.148707,-0.207626,2
1429698057490,77,0.0722101,-0.00104793,-0.0396067,9
1429698057532,77,0.118167,0.165331,0.164678,30
1429698057543,77,0.156087,0.266777,0.306306,43
1429698057588,77,0.185676,0.287108,0.360398,73
1429698057602,77,0.199131,0.22298,0.313585,73
1429698057644,77,0.172386,0.0792862,0.156094,73
1429698057686,77,0.102811,-0.0916331,-0.0515832,66
1429698057728,77,0.00176639,-0.239223,-0.244122,54
1429698057770,77,-0.0980547,-0.311483,-0.350088,41
1429698057816,77,-0.155451,-0.268205,-0.316065,40
1429698057828,77,-0.155293,-0.134475,-0.162401,40
1429698057869,77,-0.100277,0.0602854,0.0668983,40
1429698057911,77,-0.0209644,0.258522,0.294453,36
1429698057956,77,0.0369515,0.372199,0.409184,29
1429698057968,77,0.0513321,0.370164,0.377611,29
1429698058010,77,0.0194284,0.247438,0.205051,20
1429698058051,77,-0.0342886,0.0547725,-0.0344951,13
1429698058092,77,-0.0775307,-0.131838,-0.242928,5
1429698058134,77,-0.0881861,-0.245915,-0.344467,3
1429698058175,77,-0.0592458,-0.247185,-0.305623,2
1429698058217,77,-0.00641085,-0.144312,-0.152189,0
1429698058258,77,0.0392503,-0.00493462,0.0272978,0
1429698058312,77,0.054365,0.0945917,0.140692,25
1429698058353,77,0.0356224,0.0991938,0.131398,50
1429698058395,77,-0.00280277,-0.00961737,-0.00838592,73
1429698058406,77,-0.0359932,-0.179542,-0.207326,73
1429698058459,77,-0.0452999,-0.354811,-0.393495,67
1429698058500,77,-0.0289246,-0.448869,-0.475348,61
1429698058512,77,3.96336e-05,-0.412223,-0.407096,58
1429698058553,77,0.0216515,-0.23549,-0.190086,52
1429698058565,77,0.025363,0.042224,0.124356,51
1429698058606,77,0.0146221,0.342392,0.448263,48
1429698058627,77,-0.000249749,0.573841,0.686586,48
1429698058669,77,-0.00292169,0.670714,0.773545,46
1429698058691,77,0.00938381,0.605202,0.68651,42
1429698058759,77,0.0291069,0.40445,0.458029,31
1429698058800,77,0.0414596,0.144839,0.168935,25
1429698058827,77,0.039322,-0.0950637,-0.0974617,20
1429698058868,77,0.0243824,-0.252148,-0.279669,17
1429698058891,77,0.00451881,-0.295519,-0.348162,14
1429698058932,77,-0.00298162,-0.258443,-0.339334,11
1429698059027,77,0.00354503,-0.194042,-0.299988,17
1429698059091,77,0.0228929,-0.152856,-0.273719,64
1429698059132,77,0.0433189,-0.147619,-0.266904,78
1429698059159,77,0.0524808,-0.153532,-0.253468,76
1429698059201,77,0.0429041,-0.129277,-0.194768,70
1429698059227,77,0.0152688,-0.0591439,-0.0829925,63
1429698059268,77,-0.0243951,0.0318191,0.0475179,55
1429698059332,77,-0.0624356,0.0995962,0.145121,45
1429698059432,77,-0.0879461,0.10532,0.166085,35
1429698059459,77,-0.0965084,0.0518976,0.113291,31
1429698059501,77,-0.0854535,-0.0213814,0.0312667,26
1429698059527,77,-0.0632202,-0.0699402,-0.0308929,22
1429698059559,77,-0.0377794,-0.0553656,-0.0325994,19
1429698059627,77,-0.015986,0.0179666,0.0239019,16
1429698059659,77,-0.000433968,0.0946927,0.0861773,16
1429698059691,77,0.00989452,0.138723,0.116985,14
1429698059733,77,0.0148666,0.131099,0.101769,12
1429698059780,77,0.0196764,0.0874876,0.0567704,9
1429698059797,77,0.0242605,0.0469451,0.0247848,10
1429698059827,77,0.0297294,0.0351981,0.0296401,27
1429698059912,77,0.035024,0.051766,0.0690286,83
1429698059953,77,0.046341,0.0718271,0.111693,84
1429698059995,77,0.062049,0.0610325,0.118278,72
1429698060036,77,0.0764352,0.00872536,0.0744605,61
1429698060077,77,0.0795723,-0.0788836,-0.0157817,47
1429698060119,77,0.0621729,-0.18096,-0.129655,44
1429698060201,77,0.0210173,-0.265924,-0.231357,40
1429698060244,77,-0.0332181,-0.305885,-0.286595,32
1429698060327,77,-0.0806685,-0.274999,-0.266762,13
1429698060411,77,-0.100975,-0.173271,-0.176175,5
1429698060452,77,-0.0852627,-0.0243011,-0.0372022,2
1429698060535,77,-0.0431523,0.114874,0.0916499,4
1429698060660,77,0.0013088,0.189726,0.154861,13
1429698060702,77,0.0268377,0.175035,0.130375,28
1429698060743,77,0.0210579,0.0961904,0.0449865,60
1429698060785,77,-0.00476132,0.0143711,-0.0397357,73
1429698060826,77,-0.0294245,0.00926916,-0.043857,70
1429698060868,77,-0.0285326,0.0932331,0.0407098,61
1429698060910,77,0.00780688,0.242356,0.192301,42
1429698060952,77,0.0623341,0.377868,0.332365,35
1429698060994,77,0.104958,0.430713,0.394583,38
1429698061035,77,0.104465,0.349407,0.328259,43
1429698061076,77,0.0540956,0.15943,0.161254,42
1429698061118,77,-0.0217015,-0.0802962,-0.0472177,39
1429698061200,77,-0.0893629,-0.299073,-0.233353,28
1429698061242,77,-0.112477,-0.449473,-0.356702,20
1429698061288,77,-0.0848098,-0.512117,-0.40803,14
1429698061299,77,-0.0242089,-0.492554,-0.397211,14
1429698061341,77,0.0346811,-0.407022,-0.337088,17
1429698061382,77,0.0606551,-0.278631,-0.241985,22
1429698061423,77,0.0401627,-0.131757,-0.1272,22
1429698061465,77,-0.0166489,0.0100978,-0.011577,19
1429698061506,77,-0.0845862,0.126285,0.0871131,17
1429698061548,77,-0.135802,0.191207,0.136744,32
1429698061560,77,-0.145698,0.213591,0.147398,32
1429698061602,77,-0.107727,0.2169,0.14127,59
1429698061643,77,-0.0321113,0.207375,0.125625,70
1429698061684,77,0.0630518,0.212591,0.135692,67
1429698061726,77,0.150075,0.222846,0.157816,60
1429698061767,77,0.202309,0.230291,0.187347,50
1429698061809,77,0.209879,0.219327,0.205859,47
1429698061851,77,0.176214,0.177181,0.198862,46
1429698061864,77,0.114933,0.101768,0.162396,45
1429698061906,77,0.04913,0.007527,0.105197,41
1429698061948,77,-0.00967753,-0.077247,0.046581,34
1429698061989,77,-0.0598592,-0.141778,-0.0107053,28
1429698062031,77,-0.104431,-0.177278,-0.0628647,21
1429698062072,77,-0.141175,-0.194025,-0.11668,18
1429698062114,77,-0.164558,-0.192764,-0.165741,16
1429698062155,77,-0.166124,-0.199296,-0.222679,15
1429698062197,77,-0.129926,-0.198906,-0.258656,14
1429698062238,77,-0.0561348,-0.182228,-0.260609,11
1429698062280,77,0.043601,-0.136345,-0.222076,7
1429698062321,77,0.146426,-0.0545847,-0.145501,5
1429698062367,77,0.224764,0.042479,-0.0572756,11
1429698062378,77,0.257352,0.142196,0.0338575,11
1429698062420,77,0.233425,0.219323,0.112721,48
1429698062461,77,0.147301,0.240057,0.15444,75
1429698062502,77,0.00705258,0.174403,0.129807,86
1429698062514,77,-0.165171,0.0224309,0.028711,83
1429698062555,77,-0.33129,-0.169754,-0.117627,73
1429698062567,77,-0.436853,-0.329351,-0.246881,66
1429698062619,77,-0.434575,-0.370107,-0.274018,46
1429698062660,77,-0.309259,-0.249802,-0.151953,40
1429698062671,77,-0.0910647,-0.00245593,0.0931812,39
1429698062712,77,0.15224,0.266778,0.358448,40
1429698062727,77,0.34155,0.456596,0.539769,41
1429698062768,77,0.416678,0.500721,0.563921,40
1429698062791,77,0.369667,0.40759,0.434956,38
1429698062832,77,0.242618,0.247703,0.231714,28
1429698062859,77,0.0999155,0.094067,0.0349483,24
1429698062900,77,-0.00772684,-0.00814263,-0.0944377,15
1429698062927,77,-0.0608887,-0.048004,-0.137816,13
1429698062968,77,-0.0712374,-0.059317,-0.13258,10
1429698063010,77,-0.0624851,-0.0795062,-0.131127,9
1429698063051,77,-0.0611631,-0.13193,-0.170045,8
1429698063104,77,-0.0721354,-0.207741,-0.245396,10
1429698063127,77,-0.0898988,-0.267095,-0.309892,11
1429698063169,77,-0.09971,-0.271265,-0.311755,35
1429698063232,77,-0.086605,-0.207451,-0.231271,85
1429698063259,77,-0.0498555,-0.101981,-0.0973675,89
1429698063368,77,-0.00214593,-0.0012167,0.0309677,54
1429698063390,77,0.037883,0.0491359,0.0943499,48
1429698063431,77,0.0559924,0.0425235,0.0837995,40
1429698063500,77,0.0480205,-0.0116827,0.0145521,45
1429698063527,77,0.0272142,-0.0600914,-0.0475534,45
1429698063559,77,0.00552449,-0.0658886,-0.0560626,42
1429698063592,77,-0.00414646,-0.0166117,7.61334e-05,36
1429698063627,77,-0.00323088,0.0623592,0.0871463,29
1429698063659,77,0.00305348,0.133363,0.158441,22
1429698063692,77,0.00325519,0.160852,0.175058,17
1429698063759,77,-0.00458892,0.137999,0.135088,10
1429698063827,77,-0.0203908,0.08325,0.0671428,9
1429698063894,77,-0.032317,0.0237869,0.00855927,34
1429698063927,77,-0.0318749,-0.0140092,-0.0126095,62
1429698063968,77,-0.0165611,-0.022612,0.000240357,90
1429698064009,78,0.00721904,-0.0140584,0.0214719,87
1429698064051,78,0.0297171,-0.00501425,0.025837,72
1429698064092,78,0.0387605,-0.00896879,0.00256693,59
1429698064134,78,0.0327664,-0.0201909,-0.0299257,48
1429698064176,78,0.0173595,-0.0226286,-0.0407046,47
1429698064218,78,0.0048362,-0.00341615,-0.0105731,48
1429698064261,78,0.00345496,0.0348236,0.0508192,44
1429698064304,78,0.0132133,0.0717007,0.107258,33
1429698064345,78,0.0251853,0.0879371,0.124867,25
1429698064386,78,0.0248177,0.0598079,0.0716929,16
1429698064428,78,0.00764605,0.000987331,-0.0280043,12
1429698064485,78,-0.0241569,-0.0749945,-0.147638,9
1429698064526,78,-0.0594303,-0.137383,-0.238533,10
1429698064567,78,-0.0825778,-0.165003,-0.269562,20
1429698064653,78,-0.0856934,-0.151415,-0.232315,80
1429698064665,78,-0.0692872,-0.110512,-0.150708,80
1429698064710,78,-0.0443509,-0.0583027,-0.0495179,86
1429698064763,79,-0.0222939,-0.0116194,0.0423533,73
1429698064805,79,-0.0094162,0.0213978,0.104639,54
1429698064849,79,-0.00415671,0.0397735,0.128667,45
1429698064860,79,0.000617437,0.0468916,0.113271,43
1429698064902,79,0.0102674,0.0473189,0.0708599,42
1429698064946,79,0.0287831,0.0487566,0.0263739,42
1429698064957,79,0.054902,0.0556304,0.00260372,41
1429698064998,79,0.0817266,0.0667437,0.00707802,38
1429698065043,79,0.102612,0.0751942,0.0292772,28
1429698065055,79,0.11251,0.0776801,0.0578882,25
1429698065097,79,0.108124,0.0700104,0.0773553,19
1429698065140,79,0.0905653,0.0569594,0.0888371,13
1429698065181,79,0.060539,0.0430083,0.0997285,10
1429698065222,79,0.0251148,0.0351809,0.123585,8
1429698065264,79,-0.0100147,0.0334361,0.157692,10
1429698065305,79,-0.0368678,0.0331336,0.185524,38
1429698065346,79,-0.0557747,0.0231019,0.175033,65
1429698065387,79,-0.0683207,-0.0044585,0.102767,89
1429698065429,79,-0.079509,-0.0487548,-0.03026,87
1429698065470,80,-0.0930303,-0.0987968,-0.192364,77
1429698065512,80,-0.105628,-0.137655,-0.332384,69
1429698065553,80,-0.111049,-0.152188,-0.404282,60
1429698065595,80,-0.10202,-0.137994,-0.388595,58
1429698065637,80,-0.0742241,-0.102222,-0.296943,55
1429698065685,80,-0.0307346,-0.0603382,-0.167265,48
1429698065697,80,0.0182718,-0.024804,-0.0402384,48
1429698065738,80,0.060988,0.000411041,0.0574857,38
1429698065780,80,0.0853173,0.0183013,0.117847,33
1429698065821,80,0.0884433,0.0367339,0.150937,28
1429698065863,80,0.0728822,0.0597252,0.170756,24
1429698065904,80,0.045317,0.0841305,0.183639,23
1429698065946,80,0.0174431,0.106302,0.193618,24
1429698065987,80,-0.00315283,0.1197,0.192126,22
1429698066030,80,-0.0115634,0.119675,0.173495,26
1429698066042,80,-0.00872669,0.105998,0.134122,32
1429698066083,80,0.00175312,0.0796258,0.0800909,51
1429698066124,80,0.0138325,0.0438827,0.0214652,74
1429698066169,80,0.0224708,0.00407445,-0.029013,77
1429698066181,80,0.0213355,-0.0398658,-0.068358,76
1429698066224,80,0.00749479,-0.0850361,-0.0973927,72
1429698066237,80,-0.0176619,-0.125888,-0.119156,71
1429698066280,80,-0.0459823,-0.155202,-0.136501,68
1429698066291,80,-0.0631912,-0.161679,-0.141565,67
1429698066333,80,-0.0588157,-0.139887,-0.129276,66
1429698066374,80,-0.0294478,-0.0863087,-0.0887728,63
1429698066416,80,0.01835,-0.0173959,-0.0358398,56
1429698066457,80,0.0690839,0.0568564,0.0291582,41
1429698066498,80,0.104459,0.125289,0.100611,34
1429698066539,80,0.109433,0.16385,0.144144,28
1429698066551,80,0.0797905,0.162655,0.142641,28
1429698066592,80,0.0285759,0.124442,0.0968162,23
1429698066604,80,-0.0267712,0.0516563,0.00121935,23
1429698066647,80,-0.0607204,-0.022427,-0.0932485,23
1429698066658,80,-0.0654647,-0.0774894,-0.156757,23
1429698066700,80,-0.0446689,-0.0962605,-0.161911,22
1429698066741,80,-0.0183433,-0.0828059,-0.11635,17
1429698066784,80,-0.00665755,-0.0513305,-0.0460948,13
1429698066795,80,-0.0230962,-0.0270806,0.00568492,11
1429698066837,80,-0.0659576,-0.0237057,0.0146566,9
1429698066878,80,-0.117452,-0.0429092,-0.0195965,30
1429698066890,80,-0.148895,-0.0701189,-0.0675116,43
1429698066932,80,-0.140776,-0.0861503,-0.0915607,71
1429698066944,80,-0.0877575,-0.0722886,-0.0597247,81
1429698066985,80,-0.00119384,-0.0182921,0.0400109,86
1429698067027,80,0.0911032,0.0644998,0.181239,79
1429698067068,80,0.162054,0.154115,0.320166,70
1429698067080,80,0.194977,0.217977,0.402443,66
1429698067121,80,0.190746,0.235904,0.39891,59
1429698067163,80,0.158466,0.199661,0.304828,57
1429698067174,80,0.113684,0.123535,0.151472,58
1429698067216,80,0.0654007,0.0310728,-0.0183954,59
1429698067257,80,0.0166103,-0.0546323,-0.167079,57
1429698067268,80,-0.0277803,-0.113688,-0.264719,57
1429698067327,80,-0.0659543,-0.142877,-0.309073,48
1429698067368,80,-0.0885642,-0.143393,-0.303428,42
1429698067391,80,-0.0952635,-0.126913,-0.267235,37
1429698067432,80,-0.0830096,-0.0994808,-0.20928,31
1429698067459,80,-0.0573791,-0.0679631,-0.141756,23
1429698067501,80,-0.0285378,-0.0351361,-0.0703606,17
1429698067527,80,-0.00732305,-0.00701066,-0.00708697,13
1429698067559,80,-0.00580879,0.00550582,0.0280683,12
1429698067600,80,-0.0279286,-0.00571293,0.0221866,12
1429698067627,80,-0.070147,-0.0405558,-0.0238569,11
1429698067668,80,-0.120545,-0.0923913,-0.098003,13
1429698067690,80,-0.158677,-0.138514,-0.163894,28
1429698067732,80,-0.158899,-0.149905,-0.176198,52
1429698067758,80,-0.107854,-0.106795,-0.106339,77
1429698067799,80,-0.00970457,-0.00692284,0.0465833,87
1429698067826,80,0.114322,0.130342,0.253552,83
1429698067868,80,0.223825,0.251884,0.431563,73
1429698067891,80,0.285864,0.322215,0.527283,60
1429698067933,80,0.286484,0.319602,0.509529,48
1429698067960,80,0.230083,0.24892,0.385723,41
1429698067992,80,0.143119,0.142763,0.208306,40
1429698068027,80,0.0566928,0.0421537,0.040868,41
1429698068059,80,-0.00552759,-0.0184404,-0.0654268,42
1429698068091,80,-0.0423086,-0.0352428,-0.102456,41
1429698068127,80,-0.0648056,-0.0254788,-0.0965473,36
1429698068168,80,-0.0942722,-0.0349896,-0.114514,30
1429698068209,80,-0.141786,-0.0892891,-0.197296,21
1429698068253,80,-0.202631,-0.19201,-0.350566,17
1429698068312,80,-0.256744,-0.309866,-0.523516,13
1429698068336,80,-0.270831,-0.386681,-0.628233,12
1429698068353,80,-0.228722,-0.376711,-0.593057,12
1429698068370,80,-0.130672,-0.262587,-0.393098,12
1429698068394,80,-0.000790423,-0.0687011,-0.0697625,10
1429698068430,80,0.122708,0.143719,0.274151,9
1429698068459,80,0.208046,0.313797,0.544995,17
1429698068500,80,0.239526,0.395484,0.674389,39
1429698068542,80,0.223247,0.38069,0.649591,78
1429698068583,80,0.175488,0.285706,0.499523,88
1429698068624,80,0.115625,0.150138,0.278829,79
1429698068667,80,0.057282,0.0126569,0.0442017,68
1429698068679,80,0.00362794,-0.10039,-0.163953,63
1429698068721,80,-0.045003,-0.175425,-0.317971,53
1429698068762,80,-0.0872619,-0.209567,-0.402126,46
1429698068805,80,-0.121268,-0.210951,-0.419555,48
1429698068849,80,-0.135783,-0.18251,-0.370228,47
1429698068861,80,-0.124837,-0.130912,-0.268717,45
1429698068902,80,-0.0872982,-0.0622026,-0.132201,40
1429698068944,80,-0.0307413,0.0140601,0.0149617,27
1429698068986,80,0.0279982,0.0824442,0.1413,19
1429698069028,80,0.0746396,0.130409,0.226072,13
1429698069070,80,0.0965192,0.147897,0.254727,11
1429698069112,80,0.0917765,0.13452,0.230291,8
1429698069153,80,0.0687349,0.10031,0.173891,7
1429698069195,80,0.0392848,0.0609015,0.112073,6
1429698069236,80,0.0170134,0.0299791,0.0684447,15
1429698069278,80,0.00750304,0.0135671,0.0504968,54
1429698069320,80,0.00741333,0.00725564,0.0462933,82
1429698069363,80,0.00836467,0.00281653,0.0370879,93
1429698069404,80,0.00247001,-0.00704312,0.00742897,87
1429698069446,80,-0.0162751,-0.0262304,-0.0474588,75
1429698069488,80,-0.0440615,-0.0507818,-0.112928,68
1429698069530,80,-0.0733619,-0.0737568,-0.168108,62
1429698069574,80,-0.0931678,-0.0895459,-0.192036,61
1429698069585,80,-0.0937846,-0.0934514,-0.175261,60
1429698069627,80,-0.0745322,-0.087566,-0.125064,54
1429698069668,80,-0.0422589,-0.0736038,-0.0594281,48
1429698069709,80,-0.00620522,-0.05311,0.0039273,41
1429698069753,80,0.0244464,-0.0268241,0.0526259,33
1429698069766,80,0.0441199,0.00268705,0.0792039,30
1429698069808,80,0.050024,0.031144,0.0835615,25
1429698069849,80,0.0435072,0.0537628,0.070843,20
1429698069893,80,0.0280011,0.0647477,0.0473375,18
1429698069904,80,0.00903574,0.0628021,0.022076,17
1429698069946,80,-0.00699683,0.0523116,0.00270561,14
1429698069987,80,-0.0139885,0.0402351,-0.00479776,13
1429698070029,80,-0.0103416,0.0295667,-0.00111661,33
1429698070040,80,0.000326544,0.0202079,0.00676552,33
1429698070082,80,0.0104185,0.00663034,0.00816371,69
1429698070123,80,0.0159085,-0.011572,0.000550046,81
1429698070164,80,0.0200593,-0.0286458,-0.00761653,75
1429698070206,80,0.0274817,-0.0342666,0.000240923,65
1429698070248,80,0.0405245,-0.0236867,0.0310839,52
1429698070289,80,0.0576,0.00342466,0.0815306,48
1429698070330,80,0.0714705,0.0396853,0.13655,49
1429698070372,80,0.072374,0.0712276,0.16902,49
1429698070413,80,0.0529904,0.0846048,0.155321,41
1429698070454,80,0.0257241,0.0794033,0.100592,33
1429698070496,80,0.00125528,0.0595156,0.0213862,21
1429698070538,80,-0.0146243,0.0277765,-0.0656655,15
1429698070555,80,-0.0204358,-0.00893938,-0.138742,13
1429698070566,80,-0.0228277,-0.0440331,-0.185052,11
1429698070608,80,-0.0306552,-0.0754752,-0.206996,9
1429698070649,80,-0.0501845,-0.102708,-0.215163,6
1429698070690,80,-0.0809686,-0.127076,-0.221128,5
1429698070732,80,-0.116655,-0.14753,-0.226535,5
1429698070773,80,-0.147091,-0.159546,-0.221718,5
1429698070815,80,-0.15873,-0.153329,-0.185136,8
1429698070856,80,-0.143556,-0.11751,-0.0987466,27
1429698070898,80,-0.0989349,-0.0503312,0.0361802,70
1429698070939,80,-0.0367573,0.0363439,0.191332,90
1429698070951,80,0.032401,0.125718,0.330182,92
1429698070992,80,0.0859757,0.185479,0.399617,87
1429698071004,80,0.116633,0.199693,0.379598,83
1429698071045,80,0.125221,0.170109,0.285749,72
1429698071056,80,0.118192,0.105534,0.145424,66
1429698071097,80,0.113374,0.0391384,0.0203832,50
1429698071109,80,0.120411,-0.00101583,-0.0436079,50
1429698071150,80,0.129585,-0.00649149,-0.0423158,44
1429698071161,80,0.128606,0.0192951,0.00723713,44
1429698071203,80,0.102464,0.0551944,0.0623728,43
1429698071226,80,0.0435731,0.0690838,0.0689276,41
1429698071268,80,-0.0373254,0.0406846,-0.00107518,32
1429698071291,80,-0.110252,-0.0217001,-0.124104,28
1429698071332,80,-0.151423,-0.0973226,-0.25784,17
1429698071359,80,-0.151035,-0.157162,-0.352831,14
1429698071400,80,-0.117635,-0.178759,-0.375688,9
1429698071427,80,-0.0714586,-0.156089,-0.317734,8
1429698071468,80,-0.024161,-0.0918787,-0.187338,7
1429698071532,80,0.0172546,-0.00348404,-0.0139336,8
1429698071559,80,0.0514292,0.0854525,0.160859,8
1429698071600,80,0.0772979,0.149166,0.292749,8
1429698071627,80,0.0820192,0.163856,0.336293,9
1429698071668,80,0.0604096,0.127455,0.282378,33
1429698071690,80,0.0135143,0.0520792,0.147639,46
1429698071731,80,-0.0448934,-0.0368768,-0.0201884,74
1429698071758,80,-0.0999359,-0.116205,-0.175273,89
1429698071800,80,-0.128536,-0.161237,-0.263322,84
1429698071826,80,-0.125435,-0.168493,-0.273777,79
1429698071891,80,-0.0916224,-0.13891,-0.207589,59
1429698071933,80,-0.0315817,-0.0735577,-0.0709053,50
1429698071958,80,0.0444878,0.0228756,0.119132,49
1429698072000,80,0.114672,0.118552,0.296678,48
1429698072027,80,0.159262,0.187997,0.409381,47
1429698072068,80,0.166483,0.206748,0.418503,40
1429698072099,80,0.131719,0.163219,0.305224,36
1429698072127,80,0.0678913,0.0776671,0.114794,28
1429698072168,80,-0.00104001,-0.0136313,-0.0835274,19
1429698072192,80,-0.0456898,-0.0685942,-0.20904,17
1429698072227,80,-0.0510593,-0.0670136,-0.225114,13
1429698072292,80,-0.0223844,-0.0216253,-0.15457,11
1429698072326,80,0.0132991,0.0274479,-0.0709069,11
1429698072368,80,0.0295753,0.0431944,-0.0353652,11
1429698072410,80,0.00900597,0.00769066,-0.0768197,13
1429698072451,80,-0.0460549,-0.0642115,-0.167652,40
1429698072492,80,-0.111917,-0.14226,-0.252662,65
1429698072534,80,-0.164444,-0.189777,-0.272271,86
1429698072576,80,-0.182114,-0.189796,-0.212301,82
1429698072619,80,-0.156239,-0.14994,-0.103238,69
1429698072660,80,-0.0968073,-0.0903608,0.00389625,60
1429698072702,80,-0.0242794,-0.0312126,0.0707094,52
1429698072744,80,0.040064,0.0139269,0.0836254,51
1429698072785,80,0.0862185,0.0550803,0.0810777,51
1429698072796,80,0.111876,0.100705,0.101918,51
1429698072837,80,0.12523,0.156414,0.171263,43
1429698072879,80,0.134042,0.21121,0.265602,36
1429698072962,80,0.141977,0.246958,0.347568,19
1429698073008,80,0.143785,0.244721,0.364821,14
1429698073019,80,0.135183,0.200805,0.306634,13
1429698073062,80,0.108872,0.124486,0.185381,12
1429698073103,80,0.0650461,0.0353583,0.0434163,12
1429698073144,80,0.00730149,-0.0469091,-0.0801684,13
1429698073185,80,-0.0542808,-0.110022,-0.163287,18
1429698073227,80,-0.108316,-0.150394,-0.211685,36
1429698073269,80,-0.146225,-0.172078,-0.241129,78
1429698073311,80,-0.161195,-0.178266,-0.261615,96
1429698073353,80,-0.155525,-0.175329,-0.27992,94
1429698073394,79,-0.134007,-0.161239,-0.275323,87
1429698073436,79,-0.101902,-0.13578,-0.229526,73
1429698073477,79,-0.0661509,-0.0983394,-0.135865,64
1429698073519,79,-0.0333505,-0.0533334,-0.012453,58
1429698073561,79,-0.00950344,-0.0103151,0.100945,56
1429698073602,79,0.00803728,0.026285,0.175456,48
1429698073644,79,0.0202302,0.0520381,0.18851,41
1429698073685,79,0.0348134,0.0683675,0.148109,32
1429698073726,79,0.056393,0.0817875,0.0834649,26
1429698073767,79,0.0830913,0.0939156,0.0277087,21
1429698073809,79,0.109938,0.107591,0.00701763,16
1429698073850,79,0.126508,0.116456,0.0221918,14
1429698073892,79,0.126355,0.117359,0.0615738,14
1429698073933,79,0.107553,0.104855,0.0973261,14
1429698073974,79,0.0778865,0.0836312,0.112962,13
1429698074016,79,0.0456509,0.0599134,0.10028,15
1429698074057,79,0.0175526,0.0380972,0.0641274,28
1429698074098,79,0.00198885,0.0244501,0.0241911,41
1429698074139,79,-0.00547462,0.0106529,-0.0123071,59
1429698074181,79,-0.00969253,-0.00879241,-0.0370944,68
1429698074222,79,-0.020353,-0.0386883,-0.0524764,74
1429698074264,79,-0.0452904,-0.0765801,-0.0618255,72
1429698074305,79,-0.0910873,-0.120204,-0.0789091,63
1429698074347,79,-0.143176,-0.155632,-0.0992687,59
1429698074388,79,-0.189604,-0.179444,-0.128797,52
1429698074429,79,-0.212314,-0.187393,-0.160231,46
1429698074471,79,-0.199194,-0.177084,-0.182124,37
1429698074512,79,-0.142321,-0.142187,-0.174904,32
1429698074554,79,-0.0440658,-0.0747976,-0.119153,26
1429698074596,79,0.0770805,0.0229643,-0.0144107,21
1429698074608,79,0.194382,0.136474,0.11937,20
1429698074649,79,0.279815,0.239491,0.243581,19
1429698074691,79,0.308637,0.299333,0.313443,23
1429698074733,79,0.270756,0.293666,0.299091,24
1429698074774,79,0.17674,0.220886,0.200845,20
1429698074815,79,0.0517607,0.101501,0.0506724,15
1429698074857,79,-0.0690985,-0.0264253,-0.101707,33
1429698074898,79,-0.156147,-0.126064,-0.207442,58
1429698074940,79,-0.194085,-0.174121,-0.239605,88
1429698074981,79,-0.178349,-0.164258,-0.190881,89
1429698075023,79,-0.128642,-0.114112,-0.0889842,80
1429698075065,79,-0.0592488,-0.0478524,0.0288037,74
1429698075106,79,0.00217012,0.00745936,0.123966,66
1429698075147,79,0.0376944,0.0328205,0.167711,64
1429698075190,79,0.0382945,0.0226948,0.151252,61
1429698075202,79,0.0103584,-0.0150832,0.0888902,61
1429698075243,79,-0.0331989,-0.0641781,0.00841827,51
1429698075285,79,-0.0700681,-0.10566,-0.0607663,40
1429698075327,79,-0.0807984,-0.121418,-0.0936413,21
1429698075368,79,-0.0613001,-0.105028,-0.085511,13
1429698075380,79,-0.0109448,-0.0565174,-0.0424841,10
1429698075421,79,0.0447269,0.00853475,0.00654553,5
1429698075434,79,0.0920898,0.0772395,0.0459757,4
1429698075476,79,0.115213,0.132016,0.0610974,3
1429698075487,79,0.122485,0.167701,0.0613085,3
1429698075528,79,0.116932,0.178915,0.0528219,5
1429698075540,79,0.10634,0.166101,0.0400029,4
1429698075581,79,0.0716239,0.123952,0.00822013,1
1429698075594,79,0.000756034,0.0524963,-0.057842,0
1429698075635,79,-0.0971771,-0.041494,-0.159869,0
1429698075658,79,-0.201181,-0.135786,-0.266897,0
1429698075700,79,-0.276726,-0.206155,-0.339064,0
1429698075726,79,-0.288651,-0.22778,-0.32866,1
1429698075767,79,-0.23073,-0.193301,-0.219489,20
1429698075790,79,-0.123365,-0.10834,-0.0282491,46
1429698075831,79,-0.00379457,-0.00688224,0.176326,70
1429698075858,79,0.105761,0.0890181,0.345735,77
1429698075900,79,0.195137,0.156485,0.438679,73
1429698075927,79,0.269736,0.174875,0.429842,66
1429698075968,79,0.337947,0.152182,0.342816,61
1429698075990,79,0.38919,0.0917926,0.200814,54
1429698076031,79,0.403912,0.0229677,0.0549461,46
1429698076058,79,0.359033,-0.0281207,-0.0557697,42
1429698076100,79,0.241132,-0.0440266,-0.111042,40
1429698076126,79,0.0619913,-0.0240051,-0.112087,40
1429698076168,79,-0.145713,0.0156909,-0.080263,38
1429698076231,79,-0.326964,0.0543823,-0.0361941,25
1429698076259,79,-0.43703,0.074196,-0.00195999,20
1429698076301,79,-0.462031,0.0651967,0.00531088,16
1429698076326,79,-0.412885,0.0282797,-0.0240897,13
1429698076368,79,-0.323227,-0.0261964,-0.0875123,11
1429698076391,79,-0.229576,-0.0812033,-0.167161,10
1429698076458,79,-0.154262,-0.130503,-0.252855,8
1429698076500,79,-0.092915,-0.157272,-0.306387,7
1429698076526,79,-0.0304814,-0.161011,-0.309676,6
1429698076558,79,0.0489972,-0.142363,-0.252529,6
1429698076600,79,0.143508,-0.111451,-0.156876,8
1429698076641,79,0.231539,-0.0703907,-0.0397777,32
1429698076686,79,0.287516,-0.0220073,0.0763304,57
1429698076698,79,0.288912,0.0348087,0.178635,69
1429698076739,79,0.229871,0.0950428,0.25607,85
1429698076783,79,0.126222,0.14577,0.295355,84
1429698076795,79,0.011111,0.169445,0.287104,79
1429698076837,79,-0.0809717,0.153418,0.231713,68
1429698076858,79,-0.122654,0.0972051,0.141192,57
1429698076900,79,-0.102969,0.0178623,0.0415302,51
1429698076941,79,-0.0308367,-0.0548428,-0.035233,50
1429698076982,79,0.0709772,-0.0959105,-0.0706669,49
1429698077024,79,0.172878,-0.0898897,-0.0598635,43
1429698077066,79,0.23871,-0.0447722,-0.0218292,38
1429698077108,79,0.242178,0.0176995,0.017376,27
1429698077150,79,0.175426,0.0744749,0.040223,22
1429698077192,79,0.0543043,0.102736,0.034982,16
1429698077275,79,-0.0825223,0.104187,0.0190805,11
1429698077316,79,-0.193955,0.0876055,0.00956424,10
1429698077357,79,-0.253309,0.061112,0.0117223,8
1429698077399,79,-0.250295,0.0336248,0.019304,7
1429698077440,79,-0.202299,0.00749173,0.0167532,16
1429698077482,79,-0.135444,-0.0157313,-0.00574223,57
1429698077524,79,-0.076757,-0.0306462,-0.0393151,86
1429698077565,79,-0.043445,-0.0421156,-0.0782006,94
1429698077614,79,-0.0352831,-0.0499563,-0.103528,79
1429698077627,79,-0.0404195,-0.0632938,-0.116865,73
1429698077668,79,-0.0403619,-0.08532,-0.12073,61
1429698077710,79,-0.0203986,-0.113837,-0.122263,51
1429698077752,79,0.0167041,-0.135099,-0.118074,49
1429698077793,79,0.05582,-0.141542,-0.107317,46
1429698077834,79,0.0780657,-0.11869,-0.0757106,41
1429698077876,79,0.0734969,-0.0690234,-0.0239944,31
1429698077917,79,0.0482334,-0.00735178,0.0328119,23
1429698077959,79,0.0250774,0.0494913,0.0786879,17
1429698078006,79,0.0253736,0.0836866,0.0948647,12
1429698078018,79,0.062123,0.095662,0.0866293,11
1429698078063,79,0.121173,0.0975978,0.0724701,9
1429698078074,79,0.176191,0.100062,0.0704866,9
1429698078116,79,0.2034,0.0992055,0.0775662,9
1429698078157,79,0.190786,0.0926276,0.0885704,10
1429698078199,79,0.142666,0.0759024,0.0928687,11
1429698078240,79,0.0715775,0.0522774,0.0870416,17
1429698078281,79,-0.00487495,0.0318191,0.0756702,56
1429698078322,79,-0.0766025,0.021771,0.0641188,85
1429698078377,79,-0.141896,0.0173335,0.0489383,90
1429698078419,79,-0.198714,0.0084334,0.0251707,76
1429698078460,79,-0.242246,-0.0115658,-0.00877524,62
1429698078501,79,-0.259139,-0.0502626,-0.058833,49
1429698078584,79,-0.241598,-0.0943461,-0.11002,49
1429698078626,79,-0.189076,-0.131485,-0.150907,46
1429698078667,79,-0.110849,-0.148592,-0.168708,36
1429698078708,79,-0.0337341,-0.140726,-0.159171,28
1429698078750,79,0.0295169,-0.113839,-0.127088,21
1429698078791,79,0.067662,-0.0652444,-0.0688786,19
1429698078833,79,0.0866641,-0.00779935,-0.000839453,15
1429698078874,79,0.0987099,0.054908,0.068306,12
1429698078916,79,0.111574,0.107791,0.117231,10
1429698078929,79,0.131405,0.139878,0.134449,10
1429698078970,79,0.149972,0.143925,0.115863,14
1429698079011,79,0.156231,0.125258,0.0765769,16
1429698079053,79,0.140161,0.0961918,0.0384051,34
1429698079094,79,0.0999117,0.0728538,0.022379,61
1429698079135,79,0.0429479,0.051913,0.0212651,98
1429698079177,79,-0.0180192,0.0305585,0.0260094,101
1429698079218,79,-0.0684969,0.000582928,0.0192806,64
1429698079229,79,-0.0953027,-0.0493475,-0.0168555,62
1429698079270,79,-0.0943717,-0.108059,-0.0737149,57
1429698079282,79,-0.0707712,-0.157897,-0.130849,55
1429698079324,79,-0.0380039,-0.177022,-0.157339,52
1429698079336,79,-0.00972393,-0.154638,-0.135958,52
1429698079377,79,0.00154737,-0.0965098,-0.0733322,51
1429698079389,79,-0.00649754,-0.020671,0.00965118,50
1429698079431,79,-0.027316,0.0508073,0.0873011,44
1429698079443,79,-0.0524361,0.0973481,0.131711,44
1429698079484,79,-0.069095,0.109144,0.134404,37
1429698079495,79,-0.0667749,0.0926776,0.108125,37
1429698079537,79,-0.0449692,0.0637374,0.0782477,30
1429698079558,79,-0.00682175,0.0276061,0.0455781,28
1429698079600,79,0.0278707,-0.00788445,0.0145856,25
1429698079626,79,0.0544221,-0.0280281,-0.00486016,24
1429698079667,79,0.0629527,-0.0476432,-0.0455957,23
1429698079690,79,0.0561132,-0.0590136,-0.0961296,23
1429698079731,79,0.0479368,-0.0570794,-0.142688,22
1429698079758,79,0.0540927,-0.0174688,-0.137918,22
1429698079799,79,0.0784347,0.0555549,-0.0691448,22
1429698079826,79,0.105294,0.141336,0.0467553,22
1429698079868,79,0.110439,0.210125,0.170512,43
1429698079921,78,0.0657517,0.212629,0.224465,56
1429698080046,78,-0.034462,0.122853,0.160321,56
1429698080088,78,-0.173051,-0.0624042,-0.0473849,49
1429698080141,78,-0.301275,-0.277323,-0.312787,43
1429698080153,78,-0.359542,-0.429182,-0.507124,42
1429698080194,78,-0.301899,-0.435117,-0.504842,41
1429698080206,78,-0.129414,-0.27484,-0.271111,41
1429698080247,78,0.111471,-0.00400801,0.117525,40
1429698080300,78,0.339085,0.267256,0.503906,34
1429698080312,78,0.476919,0.434033,0.732566,34
1429698080355,78,0.478951,0.441351,0.717702,29
1429698080366,78,0.357429,0.311112,0.490679,28
1429698080407,78,0.161869,0.123049,0.172694,27
1429698080426,78,-0.0381394,-0.0420325,-0.111488,26
1429698080467,78,-0.188276,-0.134204,-0.281477,26
1429698080492,78,-0.267638,-0.14845,-0.32692,27
1429698080559,78,-0.282507,-0.120434,-0.303786,27
1429698080593,78,-0.258992,-0.0952388,-0.280998,27
1429698080626,78,-0.215967,-0.0964278,-0.292631,27
1429698080659,78,-0.164591,-0.114183,-0.310667,27
1429698080702,78,-0.106226,-0.12196,-0.28791,31
1429698080726,78,-0.0444251,-0.0957891,-0.19009,36
1429698080768,78,0.0173875,-0.0313738,-0.0218811,54
1429698080790,78,0.0682063,0.0441996,0.152365,60
1429698080831,78,0.0976216,0.0884302,0.247743,67
1429698080876,78,0.101927,0.076703,0.220605,65
1429698080932,78,0.0868171,0.0230686,0.107999,56
1429698080973,78,0.0637305,-0.0378526,-0.0136077,52
1429698081015,78,0.0515984,-0.0578455,-0.0459931,49
1429698081057,78,0.057277,-0.0214417,0.0356561,47
1429698081099,78,0.0720843,0.0532565,0.184494,44
1429698081141,78,0.0836458,0.112262,0.287204,41
1429698081183,78,0.0776682,0.121481,0.273214,37
1429698081269,78,0.0473151,0.0733764,0.132804,31
1429698081281,78,-0.00441161,-0.00456777,-0.0676351,31
1429698081326,78,-0.0630759,-0.0667357,-0.227304,29
1429698081340,78,-0.105479,-0.0801072,-0.272573,29
1429698081392,78,-0.114437,-0.0336247,-0.182798,27
1429698081405,78,-0.0779127,0.0481361,-0.00655496,26
1429698081446,78,-0.00289109,0.136137,0.184818,25
1429698081488,78,0.0835187,0.183449,0.294911,25
1429698081532,78,0.146259,0.160482,0.268109,24
1429698081544,78,0.155622,0.057741,0.0960327,25
1429698081585,78,0.0995276,-0.0949732,-0.157128,40
1429698081627,78,-0.00328242,-0.235522,-0.377081,52
1429698081673,78,-0.119124,-0.308865,-0.469813,63
1429698081685,78,-0.204415,-0.278309,-0.383636,63
1429698081731,76,-0.229188,-0.150598,-0.149537,59
1429698081746,76,-0.190574,0.00746295,0.10965,57
1429698081758,76,-0.106074,0.131726,0.284957,55
1429698081799,76,-0.0134974,0.15981,0.289975,50
1429698081843,76,0.0569791,0.101796,0.15546,45
1429698081885,76,0.0916064,0.00867516,-0.0224207,44
1429698081926,76,0.0958675,-0.0447854,-0.120814,42
1429698081968,76,0.0859333,-0.0226266,-0.0866203,37
1429698082009,76,0.0769756,0.0723363,0.0664157,32
1429698082050,76,0.0756876,0.187222,0.249566,28
1429698082092,76,0.0773866,0.256524,0.357967,24
1429698082133,76,0.0745838,0.237326,0.32644,23
1429698082175,76,0.0619889,0.131213,0.162873,22
1429698082217,76,0.0384821,-0.0184759,-0.06345,22
1429698082259,76,0.0105186,-0.152271,-0.258727,22
1429698082301,76,-0.0133128,-0.219577,-0.351713,22
1429698082384,76,-0.0253295,-0.210731,-0.328508,22
1429698082425,76,-0.0248907,-0.149445,-0.227142,23
1429698082466,76,-0.0175985,-0.0819108,-0.11051,27
1429698082508,76,-0.00601041,-0.0386337,-0.0276329,46
1429698082549,76,0.00234708,-0.0360666,-0.00600979,60
1429698082590,76,0.00294307,-0.0634057,-0.036685,64
1429698082633,76,-0.00128077,-0.0874314,-0.0777582,60
1429698082675,76,-0.00843366,-0.0765987,-0.0846911,52
1429698082716,76,-0.0172544,-0.0175277,-0.0323586,47
1429698082758,76,-0.02924,0.0736873,0.0713501,43
1429698082799,76,-0.0458845,0.159897,0.186968,42
1429698082842,76,-0.0662978,0.200682,0.265719,39
1429698082883,76,-0.0837204,0.177175,0.274865,36
1429698082924,76,-0.0912656,0.0962043,0.21191,32
1429698082965,76,-0.0810381,-0.00453413,0.111423,31
1429698083105,76,-0.0523456,-0.0848191,0.017788,29
1429698083150,76,-0.012202,-0.117873,-0.0356246,29
1429698083222,76,0.0285382,-0.100798,-0.0392871,28
1429698083428,76,0.0598183,-0.0510504,-0.00913876,49
1429698083470,76,0.0767777,0.00558164,0.0289839,61
1429698083512,76,0.0775937,0.0456881,0.0483818,65
1429698083693,76,0.0746304,0.0722381,0.0520505,48
1429698083818,76,0.0627116,0.0712317,0.0137642,32
1429698083859,76,0.043299,0.0511212,-0.0579156,28
1429698083901,76,0.0116041,0.0110479,-0.159594,28
1429698083984,76,-0.0314711,-0.0456406,-0.269426,28
1429698084080,76,-0.0918736,-0.122725,-0.377214,29
1429698084122,76,-0.1539,-0.200346,-0.437359,29
1429698084164,76,-0.194496,-0.244993,-0.408953,30
1429698084205,76,-0.181174,-0.213872,-0.25427,30
1429698084246,76,-0.0917151,-0.0858415,0.0247675,31
1429698084288,76,0.0690551,0.121581,0.373598,32
1429698084330,76,0.258534,0.338101,0.674818,44
1429698084342,76,0.415625,0.485296,0.826226,50
1429698084383,76,0.480857,0.493712,0.753801,61
1429698084425,76,0.422279,0.34641,0.466616,64
1429698084466,76,0.250495,0.0938807,0.0613571,61
1429698084549,76,0.0145687,-0.164668,-0.313937,50
1429698084591,76,-0.221134,-0.332847,-0.532686,46
1429698084602,76,-0.396375,-0.360422,-0.538469,46
1429698084697,76,-0.480046,-0.273517,-0.381202,40
1429698084739,76,-0.473547,-0.150682,-0.180098,39
1429698084850,76,-0.40097,-0.0777038,-0.0544573,32
1429698084986,76,-0.295551,-0.093617,-0.0556187,31
1429698085069,76,-0.179049,-0.171873,-0.145551,35
1429698085188,76,-0.0564267,-0.235067,-0.223289,35
1429698085449,76,0.0702269,-0.213082,-0.205134,40
1429698085534,76,0.19294,-0.0854537,-0.0683154,38
1429698085576,76,0.295637,0.112209,0.143188,37
1429698085701,76,0.350156,0.296962,0.328437,33
1429698085742,76,0.333633,0.386525,0.390804,33
1429698085784,76,0.238335,0.334866,0.283072,32
1429698085825,76,0.0921407,0.165653,0.0506666,32
1429698085867,76,-0.0537184,-0.0432118,-0.193802,32
1429698085908,76,-0.141276,-0.191654,-0.323198,32
1429698085953,76,-0.13581,-0.21153,-0.261302,32
1429698086176,76,-0.0467213,-0.10087,-0.0317465,64
1429698086260,76,0.0764995,0.0842385,0.262697,47
1429698086343,76,0.170435,0.254655,0.486717,43
1429698086384,76,0.190016,0.335332,0.543517,42
1429698086467,76,0.129644,0.301808,0.417336,36
1429698086513,76,0.0238819,0.185146,0.177955,31
1429698086524,76,-0.0768861,0.0444423,-0.0712526,31
1429698086566,76,-0.136112,-0.0702696,-0.248794,29
1429698086612,76,-0.142282,-0.135369,-0.321208,28
1429698086624,76,-0.111266,-0.15914,-0.308038,28
1429698086710,76,-0.072416,-0.163095,-0.251433,31
1429698086766,76,-0.0470703,-0.168179,-0.196403,34
1429698086777,76,-0.0430317,-0.177697,-0.157841,34
1429698086819,76,-0.0533842,-0.185643,-0.135873,34
1429698086861,76,-0.0604524,-0.179517,-0.114962,36
1429698086963,76,-0.0506887,-0.151468,-0.0865183,62
1429698087088,75,-0.0215975,-0.103336,-0.0502171,54
1429698087171,75,0.0139551,-0.044179,-0.0121207,48
1429698087213,75,0.0396794,0.0142563,0.0229537,47
1429698087626,75,0.0421333,0.0606619,0.0515767,33
1429698087667,75,0.0195122,0.0872135,0.074393,31
1429698087709,75,-0.0158539,0.0926985,0.0950729,30
1429698087794,75,-0.0454144,0.0812966,0.114623,37
1429698087848,75,-0.0559567,0.0609625,0.131007,57
1429698087889,75,-0.0467249,0.0401538,0.135612,60
1429698087972,75,-0.0262226,0.025137,0.119248,53
1429698088013,75,-0.0121632,0.0130896,0.071747,48
1429698088055,75,-0.00524721,0.00863984,0.00606342,47
1429698088096,75,-0.00910837,0.00292382,-0.0687125,46
1429698088179,75,-0.0174149,-0.0083101,-0.134475,43
1429698088443,75,-0.0221958,-0.0290343,-0.178567,29
1429698088526,75,-0.0151366,-0.0472192,-0.180799,29
1429698088567,75,0.00740202,-0.0518743,-0.137863,29
1429698088609,75,0.0492805,-0.0225166,-0.0419425,29
1429698088651,75,0.112514,0.0513106,0.101771,30
1429698088693,75,0.192655,0.167383,0.279698,35
1429698088734,75,0.27337,0.296492,0.450627,49
1429698088776,75,0.328111,0.390194,0.554915,57
1429698088818,75,0.326781,0.401261,0.538715,58
1429698088830,75,0.250522,0.304151,0.377458,58
1429698088954,75,0.104846,0.111933,0.098913,43
1429698089038,75,-0.0784138,-0.126068,-0.223471,43
1429698089050,75,-0.251753,-0.340451,-0.493523,43
1429698089185,75,-0.371057,-0.474327,-0.637902,34
1429698089281,75,-0.410235,-0.498953,-0.628834,28
1429698089498,75,-0.371588,-0.427033,-0.494699,30
1429698089540,75,-0.278017,-0.294464,-0.296126,40
1429698089581,75,-0.162128,-0.144959,-0.0949259,50
1429698089624,75,-0.0555694,-0.015091,0.0613431,59
1429698089792,74,0.0230513,0.0771012,0.154182,44
1429698089875,74,0.0655823,0.128271,0.186027,45
1429698089920,74,0.0731534,0.139333,0.167175,43
1429698089931,74,0.0532677,0.11833,0.115006,43
1429698089973,74,0.0211735,0.0768998,0.0469966,40
1429698090015,74,-0.00134224,0.0380185,-0.00721158,37
1429698090155,74,0.00470041,0.0262627,-0.0182946,29
1429698090280,74,0.045724,0.0449409,0.0118954,38
1429698090321,74,0.114913,0.0967482,0.0833059,53
1429698090363,74,0.190565,0.157181,0.163421,59
1429698090451,74,0.24429,0.1944,0.21444,54
1429698090463,74,0.255234,0.182915,0.208021,54
1429698090545,74,0.213405,0.119155,0.142264,47
1429698090587,74,0.132948,0.0299041,0.049101,47
1429698090711,74,0.0317017,-0.0481485,-0.0294094,43
1429698090753,74,-0.0616079,-0.0847835,-0.061989,40
1429698090794,74,-0.130289,-0.0767214,-0.0466022,37
1429698091043,74,-0.167608,-0.0438909,-0.00974047,50
1429698091084,74,-0.18077,-0.0159699,0.0125799,58
1429698091208,74,-0.173652,-0.00614111,0.00531668,53
1429698091332,74,-0.150098,-0.0154683,-0.0311553,47
1429698091374,74,-0.115034,-0.0382352,-0.0863035,46
1429698091416,74,-0.0790323,-0.0745924,-0.155491,44
1429698091457,74,-0.0530407,-0.126035,-0.233061,40
1429698091514,74,-0.0370063,-0.18282,-0.300371,35
1429698091558,74,-0.0200672,-0.219302,-0.324023,32
1429698091587,74,0.0149465,-0.20212,-0.265122,30
1429698091598,74,0.0768958,-0.113503,-0.111698,30
1429698091640,74,0.15254,0.030527,0.105163,29
1429698091682,74,0.21344,0.183997,0.317495,29
1429698091727,74,0.229971,0.292232,0.451757,31
1429698091738,74,0.188076,0.316986,0.461562,34
1429698091780,74,0.0978227,0.256032,0.353526,44
1429698091822,74,-0.00920658,0.141095,0.177652,59
1429698091835,74,-0.100658,0.0167507,0.00087289,59
1429698091876,74,-0.154698,-0.0804836,-0.12618,61
1429698091918,74,-0.166375,-0.133097,-0.184404,58
1429698091960,74,-0.147376,-0.145852,-0.186767,53
1429698092001,74,-0.112855,-0.133726,-0.160536,50
1429698092042,74,-0.0773925,-0.11321,-0.131051,48
1429698092084,74,-0.0468467,-0.0923615,-0.108819,49
1429698092125,74,-0.0235455,-0.0741849,-0.0943517,49
1429698092167,74,-0.00663493,-0.0556356,-0.0799328,47
1429698092209,74,0.00490379,-0.0341727,-0.0596518,41
1429698092252,74,0.0137145,-0.00711846,-0.0319346,38
1429698092294,74,0.0190565,0.0219533,-0.00153842,33
1429698092335,74,0.0224124,0.0493817,0.0258238,32
1429698092376,74,0.0250333,0.0695738,0.0461542,30
1429698092417,74,0.0287737,0.0810146,0.0625464,29
1429698092459,74,0.0371746,0.0844471,0.0807772,28
1429698092502,74,0.0525938,0.0840976,0.105228,34
1429698092514,74,0.0728933,0.0821881,0.133929,39
1429698092556,74,0.0916506,0.0778284,0.155783,54
1429698092610,74,0.100226,0.0677913,0.156065,58
1429698092653,74,0.0887531,0.0466999,0.122665,56
1429698092664,74,0.0547909,0.0122364,0.0541827,54
1429698092747,74,0.000876646,-0.0339846,-0.0368866,47
1429698092788,74,-0.0586421,-0.0831918,-0.126657,45
1429698092830,74,-0.105543,-0.125951,-0.192182,44
1429698092883,74,-0.125724,-0.147281,-0.212878,43
1429698092925,74,-0.110106,-0.143211,-0.190728,42
1429698092977,74,-0.0635277,-0.105491,-0.128952,40
1429698093018,74,0.00132302,-0.0378842,-0.0422606,38
1429698093060,74,0.064239,0.0487898,0.0543441,33
1429698093071,74,0.105796,0.132735,0.141303,33
1429698093125,74,0.113263,0.188772,0.198829,30
1429698093166,74,0.0847469,0.194383,0.20836,32
1429698093208,74,0.0310667,0.14247,0.163209,32
1429698093219,74,-0.0290292,0.0445379,0.0712037,32
1429698093275,74,-0.0795454,-0.0731138,-0.0457406,34
1429698093316,74,-0.110942,-0.177456,-0.156198,40
1429698093328,74,-0.123872,-0.241414,-0.231413,45
1429698093493,74,-0.123968,-0.253237,-0.257568,60
1429698093535,74,-0.11475,-0.211395,-0.226178,53
1429698093641,74,-0.0962972,-0.127812,-0.145273,49
1429698093765,74,-0.0712983,-0.0274218,-0.0398421,38
1429698093807,74,-0.0368871,0.0708095,0.0712359,28
1429698093891,74,0.00127064,0.147741,0.165648,20
1429698093974,74,0.0413697,0.197513,0.233465,17
1429698094015,74,0.0799271,0.218361,0.26756,16
1429698094182,74,0.121811,0.221061,0.275925,81
1429698094266,74,0.162319,0.204034,0.248494,71
1429698094307,74,0.194356,0.168731,0.1862,61
1429698094763,74,0.202246,0.112718,0.0899776,22
1429698094849,74,0.176087,0.0360086,-0.0318235,20
1429698095114,74,0.107906,-0.058821,-0.167538,56
1429698095239,74,0.00602045,-0.161054,-0.298477,51
1429698095365,74,-0.102436,-0.248225,-0.39479,29
1429698095406,74,-0.17819,-0.287884,-0.419149,21
1429698095447,74,-0.190244,-0.256182,-0.345942,13
1429698095530,74,-0.12883,-0.14718,-0.172282,13
1429698095613,74,-0.0140389,0.0158661,0.067067,16
1429698095737,74,0.107201,0.181553,0.302121,73
1429698095820,74,0.183029,0.290397,0.452276,73
1429698096068,74,0.181186,0.301482,0.466552,44
1429698096275,74,0.103457,0.213131,0.343408,20
1429698096358,74,-0.014734,0.0680274,0.142452,20
1429698096400,74,-0.124648,-0.0731573,-0.0553013,20
1429698096482,74,-0.190787,-0.162566,-0.184594,35
1429698096535,74,-0.201441,-0.183783,-0.224686,64
1429698096629,74,-0.171272,-0.155028,-0.201263,77
1429698096670,74,-0.125557,-0.111139,-0.162984,67
1429698096711,74,-0.0863839,-0.0810707,-0.143997,60
1429698096806,74,-0.0616257,-0.0713262,-0.146337,53
1429698096817,74,-0.0439276,-0.0725793,-0.149762,52
1429698096859,74,-0.0172374,-0.059342,-0.117195,49
1429698096870,74,0.0251405,-0.0230909,-0.0398317,48
1429698096912,74,0.0794725,0.0309819,0.0662381,43
1429698096953,74,0.131166,0.082299,0.160578,37
1429698096995,74,0.163763,0.112093,0.208904,31
1429698097007,74,0.164566,0.110847,0.196836,29
1429698097048,74,0.133038,0.0846896,0.138453,23
1429698097060,74,0.0762331,0.0456509,0.0594035,23
1429698097101,74,0.00846061,0.00754809,-0.0136193,19
1429698097112,74,-0.0544639,-0.0225962,-0.07065,19
1429698097154,74,-0.0960492,-0.0383231,-0.103796,15
1429698097165,74,-0.107442,-0.0384895,-0.112912,13
1429698097206,74,-0.0865374,-0.0225504,-0.0974241,11
1429698097226,74,-0.0415983,0.0057094,-0.0588983,10
1429698097267,74,0.0130011,0.0391558,-0.00404412,13
1429698097308,74,0.0624344,0.0693174,0.0565335,29
1429698097326,74,0.0956361,0.0883732,0.109709,39
1429698097367,74,0.105624,0.0893882,0.140094,66
1429698097393,74,0.0929645,0.0728964,0.141095,70
1429698097434,74,0.0635854,0.0429224,0.113814,71
1429698097459,74,0.0251952,0.00739471,0.067733,68
1429698097500,74,-0.016019,-0.02835,0.0142276,58
1429698097526,74,-0.0543628,-0.0598043,-0.0345489,55
1429698097558,74,-0.0874132,-0.0842074,-0.069917,50
1429698097594,74,-0.112328,-0.0999145,-0.0891507,47
1429698097625,74,-0.126838,-0.105678,-0.0957217,46
1429698097659,74,-0.126187,-0.0989822,-0.091431,44
1429698097693,74,-0.108501,-0.0797475,-0.0801673,40
1429698097734,74,-0.0747938,-0.0514246,-0.0651281,31
1429698097760,74,-0.029128,-0.0186755,-0.0463252,28
1429698097793,74,0.0200292,0.0127233,-0.0235571,23
1429698097825,74,0.0657351,0.0394971,0.00453669,20
1429698097866,74,0.100813,0.0576999,0.0320296,19
1429698097907,74,0.119664,0.0655572,0.0519644,19
1429698097949,74,0.11967,0.0599,0.0536896,19
1429698097991,74,0.102591,0.0423645,0.0330907,19
1429698098033,74,0.0674095,0.0138542,-0.00644874,18
1429698098074,74,0.0186339,-0.0198466,-0.0512201,17
1429698098115,74,-0.0382404,-0.0515569,-0.0837577,31
1429698098157,74,-0.0924016,-0.0740887,-0.0913459,51
1429698098198,74,-0.133994,-0.082616,-0.0744821,71
1429698098239,74,-0.150957,-0.0749995,-0.0387379,78
1429698098280,74,-0.134093,-0.0476387,0.00966472,73
1429698098322,74,-0.0815082,-0.00634705,0.0539165,61
1429698098363,74,0.00185382,0.0484719,0.0993875,54
1429698098404,74,0.100995,0.109446,0.147835,50
1429698098446,74,0.193586,0.166662,0.199668,50
1429698098487,74,0.256281,0.211773,0.252667,49
1429698098571,74,0.269907,0.231393,0.286565,41
1429698098612,74,0.218078,0.204911,0.263507,37
1429698098654,74,0.105381,0.123759,0.159952,26
1429698098740,74,-0.0388598,0.00347678,-0.0023063,12
1429698098751,74,-0.172765,-0.125458,-0.180443,10
1429698098834,74,-0.260226,-0.229679,-0.32211,3
1429698098875,74,-0.284596,-0.283028,-0.389975,2
1429698098958,74,-0.247564,-0.276621,-0.37696,5
1429698099124,74,-0.170836,-0.217811,-0.299356,87
1429698099289,74,-0.0788685,-0.130244,-0.195201,47
1429698099455,74,0.0030382,-0.0406465,-0.095527,35
1429698099649,74,0.0656013,0.0350654,-0.0117185,12
1429698099690,74,0.104513,0.0875733,0.0553972,10
1429698099731,74,0.117686,0.108558,0.103995,10
1429698099856,74,0.102696,0.0917301,0.123781,20
1429698099939,74,0.0644143,0.0402661,0.108541,79
1429698099984,74,0.015425,-0.0280593,0.0646159,85
1429698099997,74,-0.0207952,-0.0798856,0.0225587,83
1429698100095,74,-0.022391,-0.0803355,0.0183531,52
1429698100181,74,0.0154398,-0.0178308,0.0693521,40
1429698100193,74,0.0762302,0.0872467,0.159032,42
1429698100234,74,0.129233,0.191712,0.245911,45
1429698100275,74,0.141775,0.245154,0.278651,44
1429698100524,74,0.0996958,0.218107,0.225488,10
1429698100580,74,0.0168125,0.121973,0.0998551,12
1429698100592,74,-0.0724309,-0.00259033,-0.053525,13
1429698100716,74,-0.133389,-0.103979,-0.179789,62
1429698100799,74,-0.142096,-0.143531,-0.236074,77
1429698100989,74,-0.0972021,-0.112636,-0.211527,51
1429698101001,74,-0.0214116,-0.0346346,-0.128369,50
1429698101160,74,0.0518997,0.0474915,-0.0299044,22
1429698101366,74,0.0933363,0.0924707,0.0427738,17
1429698101393,74,0.0894441,0.0801013,0.0652968,20
1429698101434,74,0.0433554,0.0126991,0.0325042,33
1429698101457,74,-0.0271433,-0.0833513,-0.0376751,52
1429698101525,74,-0.0985422,-0.17128,-0.11751,77
1429698101566,75,-0.150082,-0.219648,-0.177271,74
1429698101593,75,-0.165906,-0.212643,-0.197184,69
1429698101636,75,-0.141865,-0.154613,-0.169269,63
1429698101659,75,-0.0824365,-0.0657011,-0.0988275,57
1429698101693,75,-0.00291833,0.0251789,-0.00670209,52
1429698101725,75,0.0788385,0.0943676,0.0835385,48
1429698101766,75,0.142385,0.128448,0.148325,45
1429698101793,75,0.173148,0.129568,0.179467,42
1429698101834,75,0.168501,0.112088,0.181695,40
1429698101858,75,0.13469,0.0904013,0.165769,36
1429698101899,75,0.0832715,0.0746582,0.145438,32
1429698101925,75,0.0294804,0.0665341,0.127806,28
1429698101966,75,-0.0158102,0.0606799,0.110604,26
1429698101993,75,-0.0523364,0.0459262,0.0842565,26
1429698102034,75,-0.0802672,0.0180802,0.0420642,28
1429698102057,75,-0.102263,-0.0228361,-0.0184944,29
1429698102101,75,-0.11638,-0.0667547,-0.0853835,27
1429698102125,75,-0.120895,-0.103715,-0.145772,24
1429698102166,75,-0.108515,-0.118266,-0.177996,22
1429698102207,75,-0.0767453,-0.102673,-0.169892,18
1429698102248,75,-0.0297136,-0.0597282,-0.123932,26
1429698102290,75,0.0195807,-0.00402966,-0.0591469,43
1429698102332,75,0.0574551,0.0469576,0.000698805,71
1429698102373,75,0.0764795,0.0789661,0.0367245,77
1429698102414,75,0.0755124,0.0825179,0.0378468,70
1429698102456,75,0.0600487,0.0577048,0.00744065,61
1429698102498,75,0.0434148,0.0173974,-0.0332889,49
1429698102540,75,0.0406402,-0.0246037,-0.0617401,45
1429698102581,75,0.0591289,-0.0495959,-0.0542447,44
1429698102622,75,0.0971533,-0.0462467,-0.00217216,44
1429698102664,75,0.136535,-0.0157302,0.0806737,42
1429698102706,75,0.151175,0.0309126,0.167333,37
1429698102748,75,0.11835,0.0734682,0.223025,27
1429698102789,75,0.029087,0.0961521,0.22491,20
1429698102830,75,-0.097847,0.0829753,0.162875,12
1429698102872,75,-0.226237,0.0286074,0.0445131,10
1429698102913,75,-0.311719,-0.0586628,-0.102834,9
1429698102954,75,-0.325217,-0.152191,-0.236382,9
1429698103425,75,-0.264409,-0.217501,-0.314473,41
1429698103565,75,-0.15468,-0.223725,-0.30991,29
1429698103870,75,-0.0315092,-0.161208,-0.222464,21
1429698103911,75,0.0699665,-0.0517236,-0.0865802,54
1429698104424,75,0.133324,0.0670207,0.0532909,29
1429698104466,75,0.166743,0.162457,0.161684,27
1429698104507,75,0.179831,0.211559,0.216514,26
1429698104603,75,0.180964,0.207161,0.212359,21
1429698104645,75,0.170539,0.15725,0.157768,30
1429698104972,75,0.143733,0.0814456,0.0737198,57
1429698105066,75,0.105651,0.00979781,-0.00581228,53
1429698105161,75,0.0631825,-0.0306831,-0.048703,40
1429698105215,75,0.0278608,-0.0267571,-0.0388365,28
1429698105257,75,0.00793848,0.0132372,0.0154965,23
1429698105309,75,0.00730666,0.0636141,0.0836851,19
1429698105351,75,0.0209215,0.0949353,0.128795,17
1429698105392,75,0.0360596,0.0884411,0.128218,25
1429698105403,75,0.039463,0.0472548,0.0836879,33
1429698105487,75,0.0203652,-0.0102799,0.0164879,80
1429698105499,75,-0.025586,-0.0633972,-0.0508692,83
1429698105541,75,-0.0904046,-0.0987822,-0.101941,84
1429698105558,75,-0.160265,-0.118338,-0.13697,81
1429698105601,75,-0.215431,-0.129267,-0.160137,70
1429698105625,75,-0.243176,-0.143545,-0.180607,66
1429698105666,75,-0.237339,-0.161917,-0.197801,57
1429698105693,75,-0.200635,-0.174597,-0.201794,56
1429698105734,75,-0.142816,-0.167402,-0.180309,57
1429698105758,75,-0.0732645,-0.129996,-0.12727,58
1429698105793,75,-0.0018903,-0.063706,-0.0474125,58
1429698105858,75,0.0658634,0.01782,0.0399409,50
1429698105893,75,0.123385,0.0933786,0.112694,44
1429698105934,75,0.164245,0.143171,0.152359,40
1429698105959,75,0.185082,0.160905,0.159231,39
1429698106126,75,0.183709,0.14962,0.14293,34
1429698106158,75,0.160801,0.121449,0.120291,43
1429698106258,75,0.125573,0.0917525,0.105217,73
1429698106334,75,0.0896729,0.0726981,0.105267,64
1429698106458,75,0.063878,0.0686133,0.117378,52
1429698106581,75,0.0527587,0.0741183,0.131127,45
1429698106623,75,0.0496376,0.0753642,0.129066,39
1429698106722,75,0.042476,0.0609935,0.0999628,25
1429698106813,75,0.0160844,0.0200516,0.0348046,18
1429698106827,75,-0.0423123,-0.0482888,-0.0642432,16
1429698106950,75,-0.131103,-0.134534,-0.182833,18
1429698106992,75,-0.231158,-0.217968,-0.293294,39
1429698107033,75,-0.305034,-0.266062,-0.35354,65
1429698107082,75,-0.316656,-0.251797,-0.33066,69
1429698107096,75,-0.236755,-0.162595,-0.209577,67
1429698107137,75,-0.0722999,-0.00680646,-0.00616993,61
1429698107182,75,0.135657,0.17612,0.226343,56
1429698107194,75,0.32729,0.328013,0.414011,54
1429698107235,75,0.443597,0.403228,0.501235,50
1429698107276,75,0.443334,0.371251,0.453137,51
1429698107319,75,0.329393,0.242917,0.288979,49
1429698107330,75,0.140675,0.0625049,0.0670672,49
1429698107371,75,-0.0600551,-0.109351,-0.138928,44
1429698107413,75,-0.21886,-0.227686,-0.277697,40
1429698107454,75,-0.305256,-0.272785,-0.329739,33
1429698107495,75,-0.324044,-0.260579,-0.316502,29
1429698107537,75,-0.30348,-0.228932,-0.280483,24
1429698107578,75,-0.267848,-0.201211,-0.247317,22
1429698107620,75,-0.224949,-0.178909,-0.216189,20
1429698107705,75,-0.166599,-0.14537,-0.167841,15
1429698107747,75,-0.0789099,-0.0781287,-0.0807601,16
1429698108163,75,0.0356793,0.0247284,0.0425446,47
1429698108205,75,0.156351,0.140056,0.172846,40
1429698108246,75,0.244941,0.224445,0.259437,37
1429698108342,75,0.273607,0.243818,0.270473,22
1429698108633,75,0.239662,0.193397,0.206478,59
1429698108826,75,0.164794,0.0995639,0.0968599,56
1429698108868,75,0.0850289,0.00833528,-0.00837383,51
1429698108909,75,0.0348593,-0.0425933,-0.0687417,50
1429698108951,75,0.0264751,-0.0401323,-0.0719341,49
1429698108993,75,0.0532427,0.0026897,-0.0316275,43
1429698109117,75,0.0874766,0.0536027,0.0186549,28
1429698109200,75,0.0982466,0.0816023,0.0492656,25
1429698109283,75,0.0701235,0.0774182,0.0562789,22
1429698109449,75,0.00143214,0.0477893,0.0502435,76
1429698109532,77,-0.0848364,0.0105938,0.0486829,63
1429698109544,77,-0.161305,-0.0179989,0.0595094,60
1429698109596,77,-0.203155,-0.0328007,0.075896,54
1429698109638,77,-0.199937,-0.039913,0.0790979,52
1429698109680,77,-0.156438,-0.0506177,0.0524503,50
1429698109785,77,-0.0849665,-0.0682125,-0.00221672,41
1429698109827,77,-0.00594915,-0.0893935,-0.0703614,35
1429698109893,77,0.0599066,-0.102796,-0.127877,27
1429698109934,77,0.0959583,-0.097053,-0.155237,23
1429698109957,77,0.0943022,-0.0698894,-0.149258,20
1429698110124,77,0.062391,-0.0258761,-0.116899,13
1429698110234,77,0.0106879,0.0185838,-0.0788701,67
1429698110259,77,-0.0398102,0.0480362,-0.0522535,78
1429698110292,77,-0.072249,0.0557413,-0.0422056,79
1429698110358,77,-0.083659,0.0384191,-0.0491603,71
1429698110426,77,-0.0790781,0.00427448,-0.0623008,59
1429698110493,77,-0.0726649,-0.0386729,-0.0746133,56
1429698110704,77,-0.074621,-0.0782017,-0.0771866,29
1429698110789,77,-0.077966,-0.0989471,-0.0603921,19
1429698110913,77,-0.0617999,-0.0841367,-0.0106664,10
1429698110954,77,-0.00845787,-0.0286389,0.0723725,9
1429698110995,77,0.0828429,0.0593505,0.177818,11
1429698111036,77,0.189697,0.153696,0.275364,23
1429698111119,77,0.273233,0.221209,0.328898,69
1429698111259,77,0.298324,0.237072,0.314819,58
1429698111466,77,0.249864,0.195154,0.233685,42
1429698111507,77,0.138748,0.106048,0.104301,38
1429698111548,77,0.000706689,-0.000969908,-0.0327528,30
1429698111590,77,-0.125369,-0.100606,-0.146887,25
1429698111674,77,-0.212339,-0.176477,-0.221424,15
1429698111727,77,-0.25023,-0.218941,-0.249527,12
1429698111768,77,-0.240794,-0.222842,-0.232756,10
1429698111916,77,-0.193148,-0.187819,-0.179491,50
1429698112011,77,-0.119027,-0.114344,-0.0980788,67
1429698112108,77,-0.0266482,-0.00808504,0.00361262,52
1429698112149,77,0.0726068,0.113159,0.110078,46
1429698112192,77,0.164104,0.222242,0.200104,46
1429698112203,77,0.221395,0.282613,0.241941,46
1429698112286,77,0.221201,0.263525,0.207838,42
1429698112411,77,0.152443,0.158652,0.0924632,22
1429698112620,77,0.0355965,-0.00303218,-0.0735696,16
1429698112787,77,-0.0969128,-0.17149,-0.240567,71
1429698112829,77,-0.193744,-0.286378,-0.34736,63
1429698112966,77,-0.22189,-0.310763,-0.356193,47
1429698113176,77,-0.178652,-0.245439,-0.270097,22
1429698113229,77,-0.0986414,-0.132167,-0.134054,17
1429698113271,77,-0.0219949,-0.0216778,-0.00284563,14
1429698113437,77,0.0231325,0.0469974,0.0821817,47
1429698113448,77,0.038805,0.0678214,0.115139,57
1429698113490,77,0.0479638,0.0637339,0.12147,72
1429698113503,77,0.0765166,0.0735251,0.143214,76
1429698113556,77,0.131746,0.12013,0.202785,75
1429698113598,77,0.19267,0.196181,0.289329,67
1429698113692,77,0.231301,0.268335,0.366317,57
1429698113776,77,0.215437,0.292889,0.386269,53
1429698113788,77,0.133856,0.238907,0.31569,51
1429698113976,77,0.00300088,0.11243,0.162335,33
1429698114029,77,-0.14381,-0.0497596,-0.0349357,30
1429698114134,77,-0.260902,-0.193132,-0.21863,33
1429698114358,78,-0.314049,-0.270648,-0.336929,63
1429698114392,78,-0.289424,-0.269477,-0.37032,58
1429698114456,78,-0.1995,-0.209942,-0.330696,54
1429698114497,78,-0.0760075,-0.135242,-0.255485,51
1429698114524,78,0.0400829,-0.0850908,-0.183413,48
1429698114724,78,0.115327,-0.0761295,-0.136487,31
1429698114765,78,0.138077,-0.093803,-0.111794,29
1429698114807,78,0.119976,-0.105912,-0.0893068,28
1429698114849,78,0.0865693,-0.0802829,-0.0445731,26
1429698114890,78,0.0643456,-0.00705781,0.0287991,25
1429698114973,78,0.0663338,0.0982742,0.11775,43
1429698115100,78,0.0890316,0.203066,0.197422,71
1429698115155,78,0.113252,0.2717,0.241428,63
1429698115217,78,0.115312,0.280276,0.235189,55
1429698115299,78,0.0819712,0.229083,0.184115,52
1429698115692,78,0.0169545,0.135175,0.106478,18
1429698115816,78,-0.0589561,0.0292785,0.0287352,12
1429698115900,78,-0.116413,-0.0579885,-0.0242744,38
1429698115942,78,-0.137696,-0.107494,-0.0434238,64
1429698116106,78,-0.120287,-0.115798,-0.0339868,56
1429698116316,78,-0.0801321,-0.0944805,-0.0161964,45
1429698116328,78,-0.0462844,-0.0638252,-0.00664418,42
1429698116578,78,-0.0438841,-0.0499266,-0.0252305,24
1429698116661,78,-0.0774659,-0.0606479,-0.0637692,20
1429698116746,78,-0.132576,-0.0915464,-0.104304,17
1429698116829,78,-0.175897,-0.121719,-0.118015,51
1429698116912,78,-0.177667,-0.124601,-0.0860652,69
1429698117119,78,-0.112503,-0.0762213,-0.00117901,47
1429698117201,78,0.0201215,0.0259299,0.116766,45
1429698117325,78,0.19712,0.160789,0.231551,33
1429698117463,78,0.363802,0.280819,0.295383,30
1429698117504,78,0.453167,0.323606,0.260753,28
1429698117545,78,0.42142,0.252009,0.118346,20
1429698117587,78,0.265311,0.0690541,-0.103065,15
1429698117600,78,0.0360299,-0.169194,-0.335825,15
1429698117642,78,-0.188635,-0.380416,-0.505187,29
1429698117687,78,-0.333195,-0.486122,-0.553761,46
1429698117698,78,-0.359698,-0.445747,-0.463944,55
1429698117740,78,-0.27604,-0.273298,-0.259809,65
1429698117781,78,-0.129734,-0.0284591,0.00230622,63
1429698117824,78,0.0226042,0.210283,0.256141,56
1429698117835,78,0.127127,0.372384,0.440145,56
1429698117876,78,0.159994,0.423458,0.520019,48
1429698117918,78,0.127284,0.368189,0.490907,45
1429698117959,78,0.0556197,0.24317,0.376076,45
1429698118001,78,-0.0182533,0.101271,0.219852,45
1429698118044,78,-0.0676476,-0.0198582,0.0606794,40
1429698118056,78,-0.0801924,-0.0986582,-0.069583,39
1429698118097,78,-0.0626163,-0.135838,-0.157978,35
1429698118138,78,-0.0360608,-0.145647,-0.206964,31
1429698118180,78,-0.0176384,-0.139138,-0.22147,26
1429698118192,78,-0.0162,-0.121971,-0.207577,25
1429698118233,78,-0.0271696,-0.0970859,-0.174458,22
1429698118274,78,-0.0360028,-0.0627235,-0.127233,21
1429698118316,78,-0.0323843,-0.0267166,-0.0794725,20
1429698118357,78,-0.016732,-0.00194367,-0.0480395,18
1429698118398,78,0.00584955,0.00486166,-0.0392835,15
1429698118439,78,0.0312621,-0.00157973,-0.0434329,12
1429698118480,78,0.0529227,-0.0113585,-0.0463657,21
1429698118524,78,0.073022,-0.00945424,-0.0278963,39
1429698118535,78,0.0871822,0.00705944,0.0136865,48
1429698118576,78,0.087826,0.0292261,0.0635097,64
1429698118588,78,0.0647388,0.0394208,0.0957479,64
1429698118683,78,0.0230666,0.0334053,0.0991545,51
1429698118694,78,-0.0278762,0.013135,0.0742854,48
1429698118992,78,-0.067175,-0.00688797,0.0400639,35
1429698119116,78,-0.0690354,-0.00535014,0.0278566,23
1429698119283,78,-0.0238064,0.0234071,0.0494418,22
1429698119324,78,0.0642724,0.078584,0.108022,43
1429698119449,78,0.165589,0.141413,0.178037,74
1429698119490,78,0.238911,0.191664,0.233306,69
1429698119531,78,0.246053,0.209559,0.246777,64
1429698119656,78,0.165133,0.179739,0.197862,52
1429698119739,78,0.0100196,0.101885,0.0897992,47
1429698119780,78,-0.173394,-0.0106621,-0.0550855,40
1429698119822,78,-0.324479,-0.132442,-0.198309,37
1429698119864,78,-0.392031,-0.233331,-0.302661,34
1429698119906,78,-0.361092,-0.291133,-0.347614,31
1429698119947,78,-0.253842,-0.295515,-0.332062,26
1429698119988,78,-0.116686,-0.249891,-0.269077,23
1429698120071,78,0.00759789,-0.167131,-0.17679,14
1429698120112,78,0.0934928,-0.064961,-0.0712739,11
1429698120196,78,0.13967,0.0371853,0.0350647,49
1429698120237,78,0.158668,0.11984,0.126978,65
1429698120279,78,0.166855,0.171378,0.19266,68
1429698120324,78,0.172688,0.186306,0.220096,63
1429698120335,78,0.178309,0.17316,0.210601,61
1429698120377,78,0.173381,0.139668,0.167976,52
1429698120418,78,0.148526,0.097148,0.106088,48
1429698120459,78,0.0965143,0.0499677,0.039558,47
1429698120501,78,0.0201494,-0.000843004,-0.0228152,46
1429698120542,78,-0.0702474,-0.0551979,-0.0763209,45
1429698120583,78,-0.157105,-0.109665,-0.119555,42
1429698120625,78,-0.220398,-0.15438,-0.150046,40
1429698120666,78,-0.242942,-0.175344,-0.16099,37
1429698120707,78,-0.216924,-0.16121,-0.14475,36
1429698120749,78,-0.149418,-0.111525,-0.0995927,35
1429698120790,78,-0.0589832,-0.037754,-0.0328823,34
1429698120831,78,0.0285737,0.0397657,0.039896,31
1429698120873,78,0.0913628,0.0999629,0.0978884,29
1429698120914,78,0.119368,0.12921,0.12602,25
1429698120956,78,0.114344,0.125896,0.119718,29
1429698120998,78,0.085635,0.0955659,0.0811759,50
1429698121039,78,0.0459949,0.0482184,0.0223272,63
1429698121081,78,0.0120633,0.000140359,-0.0366585,65
1429698121122,79,-0.00656887,-0.035157,-0.0751591,61
1429698121164,79,-0.00410044,-0.0465832,-0.0773641,54
1429698121205,79,0.0177918,-0.030547,-0.0370601,51
1429698121246,79,0.0482104,0.00481366,0.0329705,47
1429698121288,79,0.0782567,0.0486587,0.114961,46
1429698121329,79,0.0905155,0.078912,0.175734,44
1429698121370,79,0.0769526,0.0814814,0.190805,40
1429698121411,79,0.0418568,0.0555713,0.156901,37
1429698121452,79,-0.00391913,0.00965046,0.0831428,33
1429698121494,79,-0.0435172,-0.0349235,-0.000882036,31
1429698121618,79,-0.0691082,-0.0656883,-0.0732555,26
1429698121659,79,-0.07608,-0.0736917,-0.113916,24
1429698121700,79,-0.0731208,-0.0674574,-0.126412,21
1429698121741,79,-0.0656248,-0.0566886,-0.121428,19
1429698121782,79,-0.062433,-0.0512256,-0.114082,18
1429698121824,79,-0.0578714,-0.0467861,-0.106047,25
1429698121865,79,-0.0476618,-0.0367808,-0.0940734,50
1429698121909,79,-0.0284468,-0.0157643,-0.0747468,66
1429698121921,79,-0.000730004,0.016429,-0.0450701,70
1429698121962,79,0.0270979,0.0510054,-0.0105184,70
1429698122003,79,0.0510617,0.0789003,0.0237069,61
1429698122044,79,0.0616403,0.0875547,0.0473063,53
