1429614811240,98,-0.0171976,-0.0250665,0.0580017,22
1429614811281,98,0.00031695,-1.11198e-06,0.0721848,18
1429614811323,98,0.0225207,0.0320837,0.0815291,26
1429614811364,98,0.0234314,0.0435537,0.0609416,42
1429614811406,98,0.00574351,0.0242225,0.0103052,68
1429614811448,98,-0.0196888,-0.00842219,-0.0443409,72
1429614811490,98,-0.0424568,-0.0425951,-0.0945509,65
1429614811533,98,-0.0360244,-0.0452866,-0.0902717,56
1429614811574,98,-0.00940417,-0.0203123,-0.04392,43
1429614811616,98,0.0178961,0.0163501,0.0103036,40
1429614811658,98,0.0338304,0.0463129,0.0472707,43
1429614811700,98,0.0319091,0.0604824,0.0400638,47
1429614811742,98,0.0252597,0.0633825,0.0148367,49
1429614811785,98,0.0287658,0.0643689,0.00768548,46
1429614811828,98,0.0464705,0.0690731,0.0439913,40
1429614811870,98,0.0756234,0.0801703,0.106552,33
1429614811912,98,0.102324,0.0903399,0.155264,34
1429614811953,98,0.110203,0.0879506,0.163116,50
1429614811995,98,0.0933097,0.0717691,0.11193,63
1429614812036,98,0.0526395,0.0387767,0.0186704,65
1429614812078,98,0.0022886,0.000753556,-0.0933924,56
1429614812120,98,-0.0449918,-0.0367893,-0.182204,40
1429614812161,98,-0.0789415,-0.0634025,-0.236559,30
1429614812203,98,-0.0961899,-0.0773152,-0.250894,23
1429614812245,98,-0.0974752,-0.0782161,-0.235524,24
1429614812287,98,-0.0900797,-0.074819,-0.194148,28
1429614812329,98,-0.073665,-0.0704182,-0.127497,28
1429614812370,98,-0.0563773,-0.0674076,-0.0559004,25
1429614812412,98,-0.0445589,-0.0655911,0.0191879,22
1429614812454,98,-0.0338916,-0.06149,0.0812649,18
1429614812496,98,-0.0219139,-0.0498195,0.118361,20
1429614812538,98,-0.00672298,-0.0320095,0.121974,40
1429614812579,98,0.0116444,-0.00839883,0.100043,57
1429614812620,98,0.0256572,0.0137995,0.0628595,67
1429614812662,98,0.0322136,0.0302661,0.0319223,63
1429614812704,98,0.0264526,0.0356802,0.0170309,50
1429614812746,98,0.016452,0.0413104,0.0318479,43
1429614812787,98,-0.00684426,0.0238271,0.033871,39
1429614812829,98,-0.0433129,-0.0208443,-0.00746668,40
1429614812871,98,-0.0861015,-0.0875802,-0.0903402,44
1429614812913,98,-0.113439,-0.145115,-0.174531,46
1429614812954,98,-0.11642,-0.170655,-0.212576,44
1429614812995,98,-0.0988504,-0.158014,-0.190744,39
1429614813037,98,-0.0484659,-0.0998283,-0.100894,35
1429614813078,98,0.0080911,-0.0226338,0.0194893,30
1429614813120,98,0.0514982,0.0475297,0.116918,33
1429614813161,98,0.059673,0.0835655,0.166871,52
1429614813202,98,0.0349971,0.0821727,0.159426,66
1429614813244,98,0.0156472,0.07272,0.135442,69
1429614813285,99,0.00284955,0.0546498,0.0974664,62
1429614813327,99,0.01791,0.0547857,0.0746185,47
1429614813369,99,0.0341905,0.050417,0.0545418,39
1429614813411,99,0.0446752,0.0419884,0.0390446,31
1429614813452,99,0.0401578,0.0265047,0.0261037,28
1429614813494,99,0.0200186,0.00118969,-0.0027762,26
1429614813535,99,-0.00185034,-0.0193532,-0.0351425,24
1429614813577,99,-0.0167448,-0.0329139,-0.0739324,18
1429614813619,99,-0.00257518,-0.0125548,-0.0780117,13
1429614813661,99,0.0241995,0.0172557,-0.0613627,5
1429614813702,99,0.0454428,0.0395595,-0.0360173,1
1429614813744,99,0.0513612,0.0460592,-0.00870939,12
1429614813786,99,0.0336741,0.030211,0.00131865,31
1429614813827,99,0.00800922,0.008944,0.000827148,55
1429614813869,99,-0.0197289,-0.0177893,-0.0145395,58
1429614813911,100,-0.0384131,-0.039115,-0.0326119,49
1429614813922,100,-0.047415,-0.0493618,-0.0481138,49
1429614813964,100,-0.0503615,-0.0516469,-0.0571158,39
1429614814005,100,-0.0476199,-0.0484238,-0.0552481,34
1429614814048,100,-0.0365199,-0.0387212,-0.0362618,35
1429614814060,100,-0.0273998,-0.031701,-0.0169279,36
1429614814101,100,-0.0222368,-0.0295912,-0.00574842,38
1429614814144,100,-0.0116946,-0.0195514,0.0115069,36
1429614814155,100,-0.000816635,-0.00731314,0.0234447,36
1429614814197,100,0.00627272,0.00223773,0.0244584,31
1429614814209,100,0.00672216,0.00474626,0.0115131,29
1429614814251,100,0.0119406,0.0111625,0.00720691,25
1429614814263,100,0.0182223,0.0185605,0.00762998,23
1429614814304,100,0.0273955,0.0290082,0.0221922,23
1429614814316,100,0.0339186,0.0371576,0.0364185,27
1429614814357,100,0.0301122,0.0333991,0.0365599,39
1429614814400,100,0.0255136,0.0284438,0.0280087,61
1429614814411,100,0.0206095,0.0252648,0.0216648,64
1429614814453,100,0.0191372,0.0258643,0.0240797,64
1429614814494,100,0.0197943,0.0273084,0.0329439,53
1429614814536,100,0.0130837,0.0163592,0.0230039,44
1429614814548,100,0.00688432,0.00865689,0.0151756,40
1429614814590,100,0.000566441,0.00237435,0.00685582,36
1429614814610,100,-0.00701294,-0.000948015,-0.00370465,34
1429614814640,100,-0.014227,-0.00270105,-0.01635,34
1429614814682,100,-0.0133186,-0.00154239,-0.0237453,35
1429614814709,100,-0.00123442,0.00927376,-0.0125305,35
1429614814743,100,0.0213043,0.0286995,0.0109975,33
1429614814776,100,0.0400206,0.0488951,0.0331341,30
1429614814809,100,0.0491518,0.0603031,0.0442532,27
1429614814840,100,0.0413959,0.0558278,0.0371925,25
1429614814881,100,0.025431,0.0403566,0.0263263,22
1429614814908,100,0.0153356,0.0242197,0.0233694,23
1429614814950,100,0.012989,0.0117073,0.0299129,38
1429614814977,100,0.015962,0.00327012,0.0382306,52
1429614815008,100,0.0149314,-0.0059761,0.036882,58
1429614815050,100,-0.00224717,-0.023537,0.0111442,62
1429614815077,100,-0.0280777,-0.0443588,-0.0277369,57
1429614815108,100,-0.0478425,-0.0576939,-0.0604792,53
1429614815150,100,-0.0572518,-0.0639872,-0.0774451,42
1429614815177,100,-0.052593,-0.0595926,-0.0749005,38
1429614815208,100,-0.0392774,-0.0493379,-0.0549527,37
1429614815250,100,-0.0268068,-0.0377736,-0.0328245,36
1429614815277,100,-0.0139187,-0.0266736,-0.0124136,37
1429614815309,100,-0.00602293,-0.0175976,-0.000261263,37
1429614815340,100,-3.1561e-05,-0.00667797,0.0069321,36
1429614815378,100,0.00657813,0.00454124,0.0111888,33
1429614815408,100,0.0191965,0.0224414,0.0249441,31
1429614815449,100,0.0331588,0.0410362,0.0408918,27
1429614815476,100,0.0441909,0.0546179,0.0536331,26
1429614815508,100,0.0471793,0.0575145,0.0544152,24
1429614815549,100,0.038374,0.0469524,0.0411754,33
1429614815591,100,0.0233644,0.0294559,0.021151,44
1429614815632,100,0.00794125,0.0118385,0.0037883,56
1429614815674,101,-0.00108482,0.00201128,-0.00172931,55
1429614815715,101,-0.00065917,0.0039798,0.00403174,48
1429614815757,101,0.00338297,0.010545,0.0121049,41
1429614815800,101,0.0106339,0.0179365,0.0219237,33
1429614815849,101,0.0113189,0.017628,0.0211302,27
1429614815865,101,0.0067277,0.0112205,0.0160189,26
1429614815907,101,0.00314799,0.00544015,0.00945834,25
1429614815949,101,0.00422857,0.00526958,0.00445014,24
1429614815990,101,0.0118612,0.0117393,0.00224856,23
1429614816032,101,0.0212552,0.0191846,0.000388044,20
1429614816074,101,0.0244194,0.0193959,-0.00320563,18
1429614816121,101,0.0152172,0.00711346,-0.0106313,17
1429614816133,101,-0.00512175,-0.0149019,-0.022494,19
1429614816175,101,-0.0314527,-0.0406417,-0.0379112,26
1429614816216,101,-0.0544935,-0.0619687,-0.0517404,40
1429614816258,101,-0.0680856,-0.0724586,-0.0651589,43
1429614816299,101,-0.0689344,-0.071539,-0.0713609,45
1429614816341,101,-0.0593332,-0.0618107,-0.0741346,40
1429614816383,101,-0.0455531,-0.0481377,-0.0746654,28
1429614816425,101,-0.0309182,-0.0353005,-0.0667896,21
1429614816467,101,-0.0173256,-0.0229167,-0.0499254,18
1429614816508,101,-0.00598669,-0.0113751,-0.0286395,20
1429614816551,101,0.00448423,0.000613526,-0.00534008,19
1429614816592,101,0.0128235,0.0126255,0.0136507,15
1429614816634,101,0.0183272,0.0226363,0.0267278,6
1429614816676,101,0.0217192,0.0301565,0.0381439,2
1429614816718,101,0.0216324,0.0329552,0.0465971,18
1429614816760,101,0.0203527,0.0320505,0.0531565,37
1429614816802,101,0.0169228,0.0273888,0.0550337,48
1429614816844,101,0.0127856,0.0210418,0.0527595,42
1429614816886,101,0.00839228,0.0156159,0.0479424,25
1429614816927,101,0.00546704,0.0120641,0.041999,11
1429614816969,101,0.00379976,0.00995817,0.0332285,0
1429614817010,101,0.00233031,0.00726383,0.0196446,0
1429614817052,101,0.00119316,0.00410167,0.00362263,0
1429614817095,101,0.00135324,0.00107931,-0.0100753,0
1429614817138,101,0.00181277,-0.00119501,-0.0192059,0
1429614817180,101,0.000688314,-0.0040025,-0.0236655,0
1429614817222,101,-0.00275308,-0.00690395,-0.0270086,0
1429614817264,101,-0.00662528,-0.00817337,-0.0280214,0
1429614817306,101,-0.00682279,-0.00706696,-0.0231942,0
1429614817352,101,-0.00467619,-0.00562476,-0.0134766,23
1429614817364,101,-0.00274817,-0.00472624,-0.00524118,33
1429614817412,101,-0.000278299,-0.00436025,2.87618e-05,41
1429614817425,101,0.000716173,-0.00389901,-0.000657877,40
1429614817466,101,0.000977688,-0.00337731,-0.00442173,30
1429614817508,101,-0.00137297,-0.00361014,-0.0112821,21
1429614817550,101,-0.00704944,-0.0061892,-0.0187671,12
1429614817594,101,-0.0170003,-0.012642,-0.0277926,9
1429614817606,101,-0.0294527,-0.0223014,-0.0368234,9
1429614817648,101,-0.0418505,-0.0332545,-0.0454142,9
1429614817690,101,-0.0513129,-0.043694,-0.0534953,9
1429614817734,101,-0.0551932,-0.0503771,-0.0588867,4
1429614817746,101,-0.0494111,-0.0490456,-0.0555698,4
1429614817788,101,-0.0345275,-0.0384904,-0.0414235,0
1429614817830,101,-0.0117196,-0.019392,-0.0151904,0
1429614817872,101,0.0152104,0.00496171,0.0195611,0
1429614817913,101,0.042711,0.0317214,0.0592332,0
1429614817956,101,0.0654716,0.0550848,0.0950313,14
1429614817999,101,0.0786284,0.0712193,0.117025,21
1429614818011,101,0.0807446,0.0778167,0.121042,21
1429614818052,101,0.0738557,0.0743551,0.108401,12
1429614818094,101,0.0638781,0.0638829,0.0880119,4
1429614818136,101,0.052238,0.0485642,0.0649401,0
1429614818178,101,0.0409277,0.0313706,0.0443977,0
1429614818219,101,0.0285029,0.014409,0.0246703,0
1429614818261,101,0.0141431,-0.000995883,0.00385067,0
1429614818302,101,-0.00272787,-0.0152469,-0.021045,3
1429614818314,101,-0.0187194,-0.026523,-0.0421411,3
1429614818355,101,-0.0313431,-0.0338884,-0.0553993,6
1429614818397,101,-0.0393566,-0.0369358,-0.0594994,6
1429614818439,101,-0.0416365,-0.0345999,-0.0567687,5
1429614818481,101,-0.0383902,-0.028176,-0.0493154,7
1429614818522,101,-0.0322029,-0.0204275,-0.0422269,28
1429614818564,101,-0.0262351,-0.0134728,-0.0362155,46
1429614818605,101,-0.0224715,-0.00872755,-0.0289244,60
1429614818647,101,-0.0218342,-0.0072045,-0.0244476,60
1429614818688,101,-0.0210326,-0.00718975,-0.0181352,52
1429614818730,101,-0.0203815,-0.00793912,-0.0144979,46
1429614818772,101,-0.0175713,-0.00806405,-0.0109663,37
1429614818816,101,-0.0109337,-0.00515356,-0.00598455,34
1429614818828,101,-0.00200166,-0.000952239,0.00186473,33
1429614818869,101,0.00166043,0.000176649,0.00521229,33
1429614818911,101,-0.00467636,-0.00655176,-0.00333375,35
1429614818952,101,-0.0207737,-0.0200335,-0.0221571,37
1429614818994,101,-0.0359595,-0.0323109,-0.043108,37
1429614819035,101,-0.0451656,-0.0398937,-0.0543609,35
1429614819077,101,-0.0454051,-0.0418983,-0.052511,35
1429614819118,101,-0.0410662,-0.0419487,-0.0448543,49
1429614819130,101,-0.0341433,-0.0398124,-0.0335516,49
1429614819171,101,-0.022727,-0.0339521,-0.012982,77
1429614819213,101,-0.00042578,-0.0164514,0.0223781,87
1429614819225,101,0.0228975,0.00141236,0.0569217,88
1429614819268,101,0.0382031,0.0127387,0.0727506,80
1429614819280,101,0.0366415,0.0120494,0.0617774,80
1429614819322,101,0.0265764,0.00744215,0.0423925,67
1429614819364,101,0.0168468,0.00717068,0.0269778,59
1429614819405,101,0.00966751,0.0127693,0.0223062,52
1429614819447,101,0.0085556,0.0215823,0.026448,51
1429614819459,101,0.00500323,0.0232462,0.020014,52
1429614819502,101,-0.00196773,0.0142923,-0.00514298,52
1429614819514,101,-0.00553494,0.00689036,-0.0324058,52
1429614819555,101,-0.00109369,0.00589858,-0.0504728,47
1429614819597,101,0.0170022,0.0188422,-0.0417655,43
1429614819610,101,0.0337732,0.0335866,-0.0210983,41
1429614819652,101,0.048524,0.0455495,0.0059204,37
1429614819664,101,0.0502357,0.0460736,0.0230832,34
1429614819706,101,0.0417169,0.0378186,0.0288997,31
1429614819718,101,0.0231909,0.0228957,0.0200022,31
1429614819740,101,0.00206196,0.00771007,0.00432074,40
1429614819781,101,-0.0158703,-0.00244123,-0.00916652,57
1429614819823,101,-0.028071,-0.00880916,-0.0166821,75
1429614819864,100,-0.0309959,-0.0100315,-0.0124747,74
1429614819906,100,-0.0260297,-0.00941408,-0.00120887,62
1429614819947,100,-0.0130659,-0.00645704,0.0146495,52
1429614819989,100,-0.00343726,-0.00706078,0.020551,40
1429614820030,100,-0.00456932,-0.0151814,0.00667431,35
1429614820072,100,-0.0185791,-0.0306484,-0.0226407,33
1429614820116,100,-0.0373199,-0.0464519,-0.0557654,32
1429614820158,100,-0.0554538,-0.0583002,-0.0835017,27
1429614820200,100,-0.0646717,-0.0629414,-0.0980245,21
1429614820241,100,-0.060679,-0.0571403,-0.0906187,11
1429614820282,100,-0.0444271,-0.0401602,-0.0671885,4
1429614820325,100,-0.0218357,-0.0168096,-0.0361743,0
1429614820366,100,0.00299479,0.0101573,-0.000400936,8
1429614820408,100,0.0288065,0.0385028,0.0377135,25
1429614820450,100,0.0511993,0.0630326,0.0719689,24
1429614820493,100,0.069723,0.0819995,0.0986801,4
1429614820535,100,0.0818868,0.0937711,0.115095,0
1429614820576,100,0.0904063,0.0998762,0.123584,0
1429614820618,100,0.0901889,0.0961968,0.121659,0
1429614820662,100,0.083301,0.0843804,0.110981,0
1429614820675,100,0.0707121,0.0662668,0.0927295,0
1429614820718,100,0.0520379,0.0421828,0.0653652,0
1429614820768,100,0.0312865,0.0173299,0.0353393,0
1429614820781,100,0.00951367,-0.00774059,0.00407392,0
1429614820823,100,-0.0049032,-0.0251494,-0.0162091,0
1429614820865,100,-0.0147278,-0.0374824,-0.0286856,0
1429614820906,100,-0.0180164,-0.0423948,-0.0321504,0
1429614820948,100,-0.0191239,-0.041731,-0.0297875,0
1429614820990,100,-0.0210644,-0.0384648,-0.0261414,23
1429614821031,100,-0.0255796,-0.0356748,-0.0260956,36
1429614821073,100,-0.0305787,-0.0342634,-0.0292534,31
1429614821114,100,-0.0342558,-0.0345421,-0.0355241,20
1429614821156,100,-0.0366621,-0.0353064,-0.0446151,2
1429614821197,100,-0.0363313,-0.0332653,-0.0487668,0
1429614821239,100,-0.0316408,-0.025378,-0.0433171,0
1429614821280,100,-0.0244078,-0.0150363,-0.0301546,0
1429614821322,100,-0.0141824,-0.00135152,-0.0119032,3
1429614821363,100,-0.00365759,0.0114682,0.00460498,3
1429614821405,100,0.00641511,0.0216673,0.0157604,0
1429614821447,100,0.0124271,0.025634,0.0177661,0
1429614821488,100,0.017702,0.0262652,0.0183734,0
1429614821530,100,0.0177519,0.0221276,0.0128949,19
1429614821572,100,0.0172165,0.0193668,0.0091244,57
1429614821614,100,0.0124285,0.0163482,0.00452831,67
1429614821655,100,0.00739744,0.0137697,0.00120647,60
1429614821697,100,0.00434207,0.01136,0.000289649,48
1429614821739,100,0.00378503,0.00836264,0.000478786,32
1429614821781,100,0.00400085,0.00396857,0.00128081,24
1429614821824,100,0.00712171,0.00305451,0.0105148,24
1429614821866,100,0.0151523,0.00893067,0.0281133,28
1429614821908,100,0.0286585,0.0227962,0.0508518,29
1429614821949,100,0.0442854,0.0395837,0.0705887,27
1429614821991,100,0.0546328,0.0504618,0.0773852,24
1429614822033,100,0.0540772,0.0470751,0.0704972,21
1429614822074,100,0.0404494,0.0279568,0.0466604,27
1429614822116,100,0.0142153,-0.00282902,0.0131886,50
1429614822157,100,-0.0152001,-0.03558,-0.0261934,97
1429614822199,100,-0.0395441,-0.0610954,-0.0616567,114
1429614822240,100,-0.0534298,-0.0745008,-0.0877894,111
1429614822282,100,-0.0567591,-0.0756631,-0.101094,69
1429614822324,100,-0.0554479,-0.0700584,-0.10219,59
1429614822365,100,-0.0543818,-0.0620141,-0.0958421,53
1429614822407,100,-0.0546268,-0.0537849,-0.0851141,51
1429614822448,100,-0.0551895,-0.0454128,-0.0701997,51
1429614822494,100,-0.0521481,-0.0346072,-0.0535789,52
1429614822506,100,-0.0440835,-0.0217863,-0.0340325,52
1429614822548,100,-0.0313995,-0.00581104,-0.0150511,49
1429614822590,100,-0.01598,0.0107315,0.00159816,47
1429614822631,100,-0.000592553,0.0262756,0.0140711,43
1429614822673,100,0.0138497,0.0384174,0.0255261,43
1429614822715,100,0.0266673,0.0466044,0.0377527,56
1429614822727,100,0.0375976,0.0505519,0.0498852,63
1429614822769,100,0.0441675,0.0496948,0.0592632,74
1429614822811,100,0.044132,0.0448532,0.063534,77
1429614822824,100,0.0406069,0.0364021,0.0633823,77
1429614822865,100,0.0350553,0.0264713,0.0579106,72
1429614822907,100,0.0310567,0.0170291,0.0503475,66
1429614822948,100,0.0299024,0.00930854,0.0430842,57
1429614822990,100,0.0275416,0.003833,0.035164,53
1429614823032,100,0.0258886,0.000548748,0.0264966,51
1429614823074,100,0.0232526,-0.00232362,0.01657,50
1429614823086,100,0.0178801,-0.00582781,0.0039007,49
1429614823128,100,0.0106799,-0.00946547,-0.0100115,46
1429614823169,100,-0.00200935,-0.0143401,-0.0250145,44
1429614823181,100,-0.019621,-0.0203403,-0.0351513,43
1429614823222,100,-0.0380609,-0.0254061,-0.0439327,42
1429614823264,100,-0.0513695,-0.0281764,-0.0515376,50
1429614823306,100,-0.0556778,-0.0279511,-0.0590734,61
1429614823317,100,-0.0515563,-0.0250591,-0.0653412,66
1429614823359,100,-0.0411133,-0.0192839,-0.066058,72
1429614823400,100,-0.0295859,-0.0126659,-0.0580848,71
1429614823413,100,-0.0198329,-0.00656683,-0.0425437,69
1429614823454,100,-0.0121983,-0.00160763,-0.0191584,64
1429614823467,100,-0.00582393,0.0016844,0.00348488,60
1429614823509,100,-0.000836916,0.0025663,0.0222915,54
1429614823521,100,0.00323805,0.00249178,0.0306819,52
1429614823563,100,0.00647475,0.00208498,0.0325662,48
1429614823575,100,0.00854186,0.00308174,0.0303374,48
1429614823616,100,0.0112782,0.0070818,0.0281466,48
1429614823658,100,0.0139772,0.0122984,0.0275007,47
1429614823669,100,0.0174887,0.0174762,0.0282293,47
1429614823711,100,0.0204696,0.0208211,0.0295402,45
1429614823723,100,0.0224444,0.0224682,0.0309191,45
1429614823764,100,0.0226804,0.0220108,0.0293459,42
1429614823806,100,0.0217876,0.0201352,0.0260773,42
1429614823847,100,0.0201973,0.0176478,0.0204583,53
1429614823859,100,0.0156069,0.012222,0.0126148,53
1429614823901,100,0.00573596,0.00525047,-0.000633977,72
1429614823913,100,-0.0140114,-0.0118168,-0.0246258,76
1429614823954,100,-0.039157,-0.0384946,-0.0536545,79
1429614823976,100,-0.0650234,-0.0711604,-0.0837893,79
1429614824018,99,-0.0768645,-0.094748,-0.100236,74
1429614824060,99,-0.0768085,-0.104702,-0.0997289,69
1429614824106,99,-0.0656448,-0.0959861,-0.0811629,62
1429614824117,99,-0.0475634,-0.0710682,-0.0494229,60
1429614824163,99,-0.0321556,-0.0426186,-0.0162229,58
1429614824176,99,-0.0227934,-0.020024,0.00846715,58
1429614824222,99,-0.015921,-0.00354511,0.0239147,56
1429614824243,99,-0.00942304,0.00695736,0.0303509,55
1429614824276,99,0.00130797,0.0172787,0.0322795,52
1429614824320,99,0.0168412,0.0307303,0.0332889,46
1429614824366,99,0.0304206,0.043045,0.0326264,42
1429614824382,99,0.0417973,0.0535641,0.0316926,42
1429614824408,99,0.0550356,0.065833,0.0362731,44
1429614824449,99,0.0634132,0.0735383,0.0437732,56
1429614824491,99,0.0642346,0.0738429,0.0490457,62
1429614824537,99,0.0605591,0.0703345,0.0541052,79
1429614824548,99,0.0487747,0.0594638,0.0502609,73
1429614824590,99,0.0318501,0.0432554,0.0368777,57
1429614824631,99,0.0110268,0.021587,0.0119982,34
1429614824673,99,-0.00706098,-0.000357967,-0.0125965,23
1429614824714,99,-0.0208861,-0.0209238,-0.0352942,17
1429614824757,99,-0.0277035,-0.0350611,-0.0499792,16
1429614824799,99,-0.0310978,-0.0443825,-0.0579361,11
1429614824841,99,-0.0309567,-0.0458841,-0.0582048,6
1429614824883,99,-0.0271403,-0.0401677,-0.0504633,0
1429614824925,99,-0.0178917,-0.028629,-0.0316986,0
1429614824966,99,-0.0036143,-0.0134789,-0.00600042,3
1429614825008,99,0.00948844,-0.000926033,0.015596,25
1429614825049,99,0.0140896,0.00388646,0.0232744,61
1429614825091,99,0.00887844,0.000510563,0.0151091,70
1429614825134,99,0.00512905,-0.0014523,0.00909295,59
1429614825176,99,0.00587607,2.0481e-05,0.0117432,46
1429614825219,99,0.014411,0.00778363,0.0271026,31
1429614825262,99,0.0219179,0.0152288,0.0414464,25
1429614825305,99,0.0228345,0.0183001,0.0461494,25
1429614825317,99,0.0147943,0.0140273,0.0354694,26
1429614825359,99,-0.000636195,0.0049036,0.0117315,27
1429614825401,99,-0.0136299,-0.0034369,-0.0104052,25
1429614825443,99,-0.0188038,-0.0062767,-0.0203534,22
1429614825485,99,-0.0125386,-0.0015105,-0.0142122,17
1429614825526,99,0.00348584,0.0107568,0.00702258,15
1429614825568,99,0.0239254,0.0266761,0.032961,32
1429614825610,99,0.0386999,0.0396585,0.0513115,56
1429614825652,99,0.0464525,0.0471184,0.057856,89
1429614825693,99,0.0442149,0.0462134,0.0525952,93
1429614825735,99,0.0393764,0.0414875,0.0453007,75
1429614825776,99,0.0324128,0.0336096,0.0363829,57
1429614825821,99,0.0245745,0.0220106,0.0261018,33
1429614825833,99,0.0166709,0.01056,0.0154995,27
1429614825875,99,0.00623729,-0.00160491,0.00245554,19
1429614825917,99,-0.00833042,-0.014679,-0.0148079,13
1429614825959,99,-0.0260359,-0.0283819,-0.0371492,8
1429614826000,99,-0.0441939,-0.04156,-0.0597159,0
1429614826042,99,-0.0537375,-0.0475389,-0.0724522,0
1429614826084,99,-0.0518112,-0.0444281,-0.0731386,0
1429614826126,99,-0.0406288,-0.0332771,-0.0630104,0
1429614826168,99,-0.0263247,-0.0171205,-0.0459358,0
1429614826209,99,-0.011132,0.0022502,-0.0226827,23
1429614826251,99,0.00190091,0.0198505,0.00258488,56
1429614826293,99,0.0193598,0.0394457,0.0338253,64
1429614826339,99,0.0436498,0.0597959,0.0718889,60
1429614826350,99,0.0729211,0.0795754,0.108759,57
1429614826392,99,0.0961301,0.0903739,0.132519,48
1429614826433,99,0.101583,0.0840032,0.126944,36
1429614826476,99,0.0825721,0.0567236,0.0877489,31
1429614826487,99,0.0401316,0.0115189,0.0247955,30
1429614826530,99,-0.0117763,-0.0397756,-0.0444703,31
1429614826542,99,-0.0579526,-0.0835837,-0.101931,31
1429614826583,99,-0.0884645,-0.11094,-0.132195,31
1429614826625,99,-0.0970154,-0.116664,-0.137059,30
1429614826667,99,-0.0877826,-0.105004,-0.124731,26
1429614826708,99,-0.0699761,-0.0826925,-0.104176,24
1429614826749,99,-0.0501554,-0.0568996,-0.0843835,25
1429614826791,99,-0.0329715,-0.0325989,-0.065865,39
1429614826833,99,-0.0195859,-0.0120423,-0.0451578,62
1429614826874,99,-0.00812157,0.0060458,-0.0205703,100
1429614826916,99,-3.9592e-06,0.0211229,0.00908118,112
1429614826957,99,0.00717102,0.033103,0.0350454,113
1429614826969,99,0.0133764,0.0407726,0.0516013,110
1429614827010,99,0.0172301,0.0416316,0.0576591,70
1429614827052,99,0.0197591,0.0382444,0.0538717,62
1429614827094,99,0.0227065,0.0325361,0.0461461,58
1429614827135,99,0.0256788,0.0264347,0.0379818,55
1429614827148,99,0.027714,0.0202273,0.0320217,55
1429614827190,99,0.0255881,0.0128706,0.0274453,52
1429614827202,99,0.0185075,0.00489905,0.0233532,51
1429614827244,99,0.00891966,-0.00207312,0.0206937,49
1429614827286,99,-0.000822001,-0.00673028,0.0187996,46
1429614827297,99,-0.00724788,-0.00798302,0.0185938,46
1429614827339,99,-0.010013,-0.00682747,0.0182485,43
1429614827350,99,-0.00842466,-0.00285651,0.0184522,43
1429614827392,99,-0.0069101,0.000944268,0.0143678,44
1429614827404,99,-0.00561529,0.00338234,0.00783903,47
1429614827445,99,-0.00655606,0.00288043,-0.00258913,56
1429614827457,99,-0.00872389,-0.00138508,-0.0137412,62
1429614827499,99,-0.0116049,-0.00781764,-0.0246204,70
1429614827511,99,-0.0123191,-0.0132435,-0.0295808,72
1429614827553,99,-0.011781,-0.0159553,-0.0307228,70
1429614827576,99,-0.0101985,-0.0160179,-0.0293581,68
1429614827618,99,-0.00779979,-0.0140265,-0.0273717,61
1429614827640,99,-0.00607084,-0.0113336,-0.0262982,53
1429614827681,99,-0.00482947,-0.00885735,-0.0242196,47
1429614827708,99,-0.00280725,-0.00570766,-0.0190122,44
1429614827749,99,0.000646054,-0.00105686,-0.00912873,44
1429614827775,99,0.00484674,0.00476213,0.00268764,44
1429614827817,99,0.00928014,0.010089,0.0125879,44
1429614827840,99,0.0117172,0.0136724,0.0187177,43
1429614827881,99,0.00955031,0.0129428,0.0190531,40
1429614827908,99,0.00280502,0.0075265,0.0106243,37
1429614827945,99,-0.00896933,-0.00250652,-0.00183811,33
1429614827975,99,-0.022453,-0.0139764,-0.0148037,29
1429614828017,99,-0.0337053,-0.0236214,-0.0221098,27
1429614828040,99,-0.0384187,-0.0286211,-0.0218138,33
1429614828081,99,-0.0350622,-0.0283944,-0.0156635,44
1429614828107,99,-0.0239027,-0.0230955,-0.00649185,56
1429614828149,99,-0.00882496,-0.0150124,0.00119293,61
1429614828175,99,0.00653109,-0.00599175,0.00611021,58
1429614828217,99,0.0181786,0.00242872,0.00669971,52
1429614828239,99,0.0255889,0.00947523,0.0061871,44
1429614828281,99,0.0289074,0.0155812,0.00650335,37
1429614828323,99,0.0298643,0.0216216,0.00893617,30
1429614828368,99,0.0292641,0.0259353,0.0144001,28
1429614828379,99,0.0256266,0.0263692,0.020889,28
1429614828421,99,0.0196784,0.0223298,0.0247034,29
1429614828466,99,0.0118568,0.0143369,0.0258134,28
1429614828478,99,0.0032463,0.00406911,0.0231499,27
1429614828520,99,-0.00277603,-0.00366338,0.0174117,25
1429614828561,99,-0.00894101,-0.00794825,0.0107928,22
1429614828603,99,-0.0156259,-0.00859,0.00498277,19
1429614828644,99,-0.0220579,-0.00697128,0.000365323,18
1429614828685,99,-0.0282479,-0.00890819,-0.0066588,21
1429614828727,99,-0.0308484,-0.0148074,-0.0166346,40
1429614828769,99,-0.0300218,-0.0242791,-0.0318086,55
1429614828813,99,-0.0259736,-0.0342943,-0.0448738,64
1429614828854,99,-0.0253752,-0.0471122,-0.0591452,58
1429614828896,99,-0.0297877,-0.0589792,-0.0706167,50
1429614828938,99,-0.0274782,-0.0578501,-0.0604135,38
1429614828979,99,-0.0219538,-0.0474778,-0.0382277,32
1429614829021,99,-0.00689392,-0.025302,-0.0058608,30
1429614829068,99,0.0103995,0.000395111,0.0253237,30
1429614829080,99,0.0228684,0.0226658,0.0476464,30
1429614829122,99,0.0297461,0.0395271,0.0568753,28
1429614829168,99,0.0334307,0.0517242,0.0602446,26
1429614829179,99,0.0384581,0.0601666,0.060165,25
1429614829221,99,0.0423367,0.0636851,0.0592375,20
1429614829263,99,0.044861,0.0627107,0.0591351,18
1429614829306,99,0.0385973,0.0536503,0.0488358,15
1429614829347,99,0.0226467,0.0359085,0.0274046,21
1429614829389,99,-0.000762721,0.0112815,-0.00516587,43
1429614829431,99,-0.0238348,-0.0141017,-0.0386279,56
1429614829473,99,-0.0368408,-0.0326413,-0.0602825,58
1429614829514,98,-0.0326639,-0.0377588,-0.0581993,51
1429614829556,98,-0.0192503,-0.0364022,-0.0412314,38
1429614829598,98,-0.0085994,-0.0362423,-0.0256254,29
1429614829640,98,-0.00997664,-0.0413327,-0.0238365,22
1429614829681,98,-0.0206327,-0.0481954,-0.036987,22
1429614829723,98,-0.0342636,-0.051099,-0.0577697,24
1429614829765,98,-0.0398672,-0.0441886,-0.071895,25
1429614829807,98,-0.0322589,-0.0269072,-0.0681811,24
1429614829849,98,-0.0109135,-0.00186081,-0.0427557,23
1429614829891,98,0.0172514,0.026757,-0.00228653,20
1429614829932,98,0.0374992,0.0471927,0.0295525,18
1429614829974,98,0.0494084,0.0609506,0.0511731,21
1429614830015,98,0.0494242,0.0655324,0.0581387,33
1429614830057,98,0.0431118,0.0642151,0.06053,56
1429614830098,98,0.0397721,0.0620745,0.0720227,63
1429614830140,97,0.036698,0.0568079,0.0842198,59
1429614830152,97,0.0236074,0.0388813,0.0723991,59
1429614830193,97,-0.00532599,0.00589552,0.0241943,47
1429614830235,97,-0.0351649,-0.0273914,-0.0336518,40
1429614830276,97,-0.0514664,-0.0468339,-0.0701678,31
1429614830318,97,-0.0418034,-0.041397,-0.0615609,30
1429614830361,97,-0.0104727,-0.0154882,-0.0126154,30
1429614830402,97,0.026973,0.0169682,0.050031,30
1429614830444,97,0.0549066,0.0417797,0.0945908,29
1429614830486,97,0.0597593,0.04592,0.0999157,27
1429614830528,97,0.0478326,0.0365135,0.074956,24
1429614830571,97,0.0265069,0.0189291,0.0351801,23
1429614830588,97,0.0153099,0.0115614,0.016491,25
1429614830600,97,0.0145234,0.0129889,0.0178246,29
1429614830643,97,0.0231641,0.0211233,0.0356845,46
1429614830656,97,0.0280777,0.0234599,0.0427028,46
1429614830699,97,0.0247914,0.018064,0.0342748,58
1429614830711,97,0.00925231,0.00222571,0.00483616,59
1429614830752,97,-0.0130254,-0.0174804,-0.0332012,57
1429614830793,97,-0.034755,-0.0341369,-0.0671061,49
1429614830836,97,-0.0481351,-0.0409064,-0.0855538,41
1429614830850,97,-0.0498229,-0.0367901,-0.0820501,39
1429614830891,97,-0.037804,-0.0229222,-0.0584931,34
1429614830933,97,-0.0178836,-0.00513452,-0.0272312,33
1429614830975,97,0.00352942,0.0108516,0.000517927,34
1429614831016,97,0.0194669,0.0199635,0.0171131,34
1429614831057,97,0.0256082,0.0203784,0.0185429,33
1429614831099,97,0.0215856,0.0129937,0.00953501,31
1429614831141,97,0.0109573,0.00113465,-0.00224912,29
1429614831153,97,-0.00303579,-0.0118868,-0.0128873,30
1429614831196,97,-0.0156841,-0.0233812,-0.016836,42
1429614831238,97,-0.0248676,-0.0307818,-0.0178902,59
1429614831279,97,-0.0278405,-0.0319651,-0.0167916,74
1429614831291,97,-0.0255951,-0.0279131,-0.0179204,74
1429614831333,97,-0.0190866,-0.0203076,-0.019506,70
1429614831375,97,-0.0116045,-0.0126943,-0.020967,61
1429614831390,97,-0.0068577,-0.00842822,-0.0194774,56
1429614831401,97,-0.00414574,-0.00642742,-0.0152693,51
1429614831444,97,-0.00314059,-0.00496748,-0.0121019,39
1429614831456,97,-0.00153471,-0.00175518,-0.0111961,39
1429614831498,97,0.00103324,0.00306709,-0.0117465,35
1429614831540,97,0.00431456,0.00861671,-0.0111681,35
1429614831552,97,0.00678762,0.011726,-0.0069992,36
1429614831594,97,0.00837102,0.011998,0.00195272,36
1429614831635,97,0.00860219,0.00962353,0.0149013,35
1429614831677,97,0.00834059,0.00634092,0.0294383,31
1429614831718,97,0.00772813,0.00402122,0.0409195,28
1429614831730,97,0.00641584,0.00297813,0.0453646,28
1429614831772,97,0.00502311,0.00337068,0.0434428,34
1429614831784,97,0.00367173,0.00365023,0.0357109,40
1429614831826,97,0.0014697,0.00239233,0.0256822,57
1429614831844,97,-0.00162565,-0.000239206,0.0126766,71
1429614831885,97,-0.00570362,-0.00372915,-0.00227204,76
1429614831908,97,-0.00937763,-0.00640676,-0.0173531,75
1429614831949,97,-0.0118156,-0.00742648,-0.0295348,64
1429614831975,97,-0.0124953,-0.00733421,-0.0366943,59
1429614832017,97,-0.0110663,-0.00654915,-0.0364442,46
1429614832044,97,-0.00935744,-0.0061097,-0.0298638,40
1429614832075,97,-0.00772923,-0.00602725,-0.0192151,40
1429614832117,97,-0.00807839,-0.00708029,-0.0111542,40
1429614832144,97,-0.00908151,-0.00788554,-0.00648328,42
1429614832175,97,-0.00912485,-0.00779099,-0.00431315,42
1429614832217,97,-0.00830764,-0.00697797,-0.00323898,41
1429614832245,97,-0.00657259,-0.00636829,-0.00237303,40
1429614832275,97,-0.00633889,-0.00791045,-0.004781,38
1429614832307,97,-0.0100336,-0.0132584,-0.012568,34
1429614832346,97,-0.016493,-0.0212264,-0.0248656,35
1429614832375,97,-0.0245975,-0.0293408,-0.0391455,40
1429614832417,97,-0.0304386,-0.034912,-0.0494864,62
1429614832445,97,-0.0333117,-0.0372557,-0.053824,74
1429614832475,97,-0.0305938,-0.0348445,-0.0505141,76
1429614832516,97,-0.021205,-0.0267153,-0.037861,70
1429614832560,97,-0.00856531,-0.015547,-0.0191548,56
1429614832606,97,0.000826198,-0.00595094,-0.00302084,47
1429614832622,97,0.0144754,0.00635166,0.0156182,43
1429614832646,97,0.018547,0.00958548,0.0227832,40
1429614832688,97,0.0193383,0.0108375,0.0285702,40
1429614832729,97,0.0142498,0.00666502,0.0258611,40
1429614832770,97,0.0118369,0.0059682,0.0292277,40
1429614832812,97,0.0139291,0.0116111,0.0405321,38
1429614832853,97,0.0181867,0.0200696,0.0531813,35
1429614832896,97,0.0176696,0.025869,0.0594594,30
1429614832938,97,0.0152235,0.0281393,0.0584885,29
1429614832979,97,0.0051674,0.0197327,0.0416896,41
1429614833022,97,-0.00577857,0.00658413,0.0183056,57
1429614833064,97,-0.0155982,-0.00984166,-0.00845752,71
1429614833107,97,-0.0169361,-0.0198008,-0.024941,69
1429614833151,97,-0.00884174,-0.0195701,-0.0263674,56
1429614833163,97,0.00396753,-0.00960356,-0.0163053,51
1429614833205,97,0.0148719,0.00385262,-0.00613966,42
1429614833246,97,0.0202877,0.0158304,-0.00161335,34
1429614833288,97,0.0209939,0.0237971,-0.00305257,33
1429614833330,97,0.0221978,0.0336858,-0.000771419,34
1429614833372,97,0.0251778,0.0468497,0.00997483,34
1429614833413,97,0.0272524,0.0602945,0.0194344,31
1429614833457,97,0.0250318,0.0658296,0.0211071,29
1429614833498,97,0.0216327,0.0632006,0.0191352,25
1429614833541,97,0.0155772,0.0487991,0.00950702,25
1429614833583,97,0.0123208,0.0290296,0.0067479,37
1429614833625,97,0.00944876,0.00748107,0.00680905,51
1429614833666,97,0.00779983,-0.00840792,0.00970885,64
1429614833708,97,0.00547998,-0.0160033,0.0110396,63
1429614833750,97,0.00181979,-0.0187018,0.00794692,53
1429614833793,97,-0.00424228,-0.0192752,0.000523304,44
1429614833806,97,-0.0126466,-0.0232923,-0.0114332,40
1429614833848,97,-0.0207994,-0.0294988,-0.0220535,35
1429614833892,97,-0.0249986,-0.036686,-0.0282643,35
1429614833933,97,-0.0214992,-0.0372528,-0.0225632,37
1429614833975,97,-0.0138769,-0.0327513,-0.0110751,37
1429614834016,97,-0.00725019,-0.0256469,0.000350519,35
1429614834058,97,-0.00219566,-0.0182807,0.00963948,32
1429614834101,97,0.000524151,-0.0127882,0.0140056,28
1429614834147,97,0.000981617,-0.00994425,0.0113232,31
1429614834159,97,-0.00225317,-0.00927515,0.00136035,31
1429614834202,97,-0.00459123,-0.00754616,-0.0098849,51
1429614834214,97,-0.00347067,-0.00313915,-0.014546,59
1429614834256,97,0.000407828,0.00351418,-0.013054,71
1429614834298,97,0.00355099,0.00994791,-0.00484489,72
1429614834310,97,0.00663384,0.0168502,0.00847075,72
1429614834352,97,0.00837271,0.0206791,0.0214746,61
1429614834393,97,0.00678717,0.0183692,0.02802,53
1429614834435,97,-0.000680782,0.00700432,0.0188287,46
1429614834477,97,-0.00837484,-0.00411769,0.00693832,46
1429614834519,97,-0.0152477,-0.0139255,-0.0116916,51
1429614834560,97,-0.0161767,-0.0146024,-0.0205825,52
1429614834602,97,-0.00865165,-0.00653626,-0.0161944,51
1429614834643,97,0.00311871,0.00658974,-0.00241756,49
1429614834685,97,0.0124591,0.0188476,0.0127799,46
1429614834726,97,0.0131258,0.0230534,0.0150581,50
1429614834767,97,0.0056683,0.0161988,0.00335061,68
1429614834809,97,-0.00513946,0.00104786,-0.018544,80
1429614834858,97,-0.0133406,-0.0155887,-0.0380446,79
1429614834869,97,-0.0163483,-0.0278122,-0.0491061,75
1429614834911,97,-0.0138248,-0.0309133,-0.0474823,64
1429614834952,97,-0.0104616,-0.0257865,-0.0398043,47
1429614834994,97,-0.0107287,-0.0179421,-0.031509,40
1429614835036,97,-0.00932188,-0.00619976,-0.0202003,38
1429614835078,97,-0.00687468,0.00348962,-0.00881572,39
1429614835119,97,-0.00127012,0.011388,0.00331937,39
1429614835161,97,0.00749722,0.0172554,0.0179813,36
1429614835202,97,0.0141207,0.0185611,0.0281409,31
1429614835243,97,0.0212149,0.0206438,0.0374246,27
1429614835285,97,0.0270425,0.0233055,0.0450418,28
1429614835296,97,0.0274908,0.0225587,0.0459701,28
1429614835338,97,0.022804,0.0182003,0.0417349,48
1429614835380,97,0.0152731,0.0120335,0.0359402,62
1429614835421,97,0.00704232,0.00477807,0.0277449,66
1429614835463,97,0.00263173,-0.000384511,0.0224228,59
1429614835504,97,-0.000764743,-0.00403069,0.0162138,44
1429614835546,97,-0.00493146,-0.0079584,0.0064179,37
1429614835588,97,-0.0108632,-0.0144462,-0.007078,32
1429614835629,97,-0.0173077,-0.0210021,-0.0196016,33
1429614835671,97,-0.0227909,-0.0268384,-0.0296675,35
1429614835713,97,-0.0208566,-0.024255,-0.0289771,35
1429614835755,97,-0.0144325,-0.0164817,-0.0245057,32
1429614835767,97,-0.0044491,-0.00592753,-0.0176534,32
1429614835809,97,0.00300541,0.00288738,-0.0137189,27
1429614835850,97,0.00709685,0.00662445,-0.011164,25
1429614835892,97,0.00603351,0.00606324,-0.00895737,36
1429614835933,97,0.00298197,0.00482855,-0.00547161,68
1429614836028,97,7.32423e-05,0.0060801,-0.00200652,38
1429614836115,97,-0.00309808,0.00852774,-0.00191438,38
1429614836158,97,-0.00585082,0.0122103,-0.00660645,25
1429614836169,97,-0.00584311,0.0141378,-0.0103075,22
1429614836211,97,-0.00470779,0.0134132,-0.0132207,18
1429614836223,97,-0.000648845,0.0114285,-0.00967665,17
1429614836264,97,0.000887831,0.00741988,-0.00554866,15
1429614836277,97,0.00440067,0.00701906,0.00552867,14
1429614836318,97,0.00656999,0.00835675,0.0166514,11
1429614836329,97,0.00759858,0.00895701,0.0249733,9
1429614836371,97,0.00938732,0.0071639,0.0285443,4
1429614836383,97,0.00982702,0.000962695,0.0229961,4
1429614836424,97,0.00990759,-0.00670932,0.0126902,1
1429614836443,97,0.00681941,-0.0161725,-0.00393215,0
1429614836485,97,-0.000103681,-0.022902,-0.0183415,6
1429614836508,97,-0.00288437,-0.0206844,-0.0163296,22
1429614836549,97,-0.005531,-0.0156083,-0.00864361,43
1429614836575,97,0.000448872,-0.00312032,0.0139425,59
1429614836616,97,0.00325107,0.00352301,0.025381,61
1429614836646,97,0.00672585,0.00812938,0.0325011,54
1429614836675,97,0.00604499,0.00721589,0.0264823,45
1429614836717,97,0.0028695,0.00379831,0.0129699,36
1429614836758,97,-0.00264787,-0.00263303,-0.00459056,28
1429614836799,97,-0.011102,-0.00915309,-0.0208598,27
1429614836841,97,-0.0163669,-0.0137603,-0.0276737,29
1429614836882,97,-0.0197891,-0.0172095,-0.0283628,30
1429614836924,97,-0.0197389,-0.0190642,-0.0248434,27
1429614836965,97,-0.0181744,-0.0194551,-0.0197093,22
1429614837007,97,-0.0134611,-0.0164418,-0.012501,15
1429614837049,97,-0.00595239,-0.0102769,-0.00231453,12
1429614837092,97,0.00214489,-0.00475722,0.00738366,9
1429614837134,97,0.00633652,-0.00387082,0.0106501,12
1429614837175,97,0.010123,-0.000759276,0.0153912,36
1429614837217,97,0.01043,0.00236509,0.0178477,57
1429614837259,97,0.0116865,0.00938734,0.0222293,71
1429614837301,96,0.0121299,0.0162489,0.0228621,68
1429614837343,96,0.0129753,0.0215503,0.0194943,54
1429614837384,96,0.0122033,0.0231107,0.0114511,44
1429614837426,96,0.00634208,0.0180774,-0.00654407,36
1429614837468,96,0.00263077,0.0146305,-0.0174006,36
1429614837510,96,0.0012516,0.014923,-0.0156319,39
1429614837551,96,0.00355939,0.018326,-0.00320831,39
1429614837593,96,0.00504918,0.019015,0.00627077,35
1429614837635,96,0.00328944,0.0132965,0.00366003,31
1429614837676,96,-0.000995716,0.00188517,-0.0118412,24
1429614837718,96,-0.00304491,-0.0081717,-0.0233351,21
1429614837760,96,0.000172677,-0.0107036,-0.0178724,17
1429614837802,96,0.00120787,-0.00937179,-0.00895065,18
1429614837844,96,0.00376738,-0.00136567,0.00992895,37
1429614837885,96,0.00424496,0.00673402,0.0218454,59
1429614837927,96,0.00500093,0.0129514,0.0251458,79
1429614837968,95,0.00730265,0.0146423,0.0200867,77
1429614838010,95,0.00185065,0.00504363,-0.0007823,62
1429614838051,95,-0.00509882,-0.00754874,-0.019133,49
1429614838093,95,-0.0155238,-0.0196844,-0.0354161,37
1429614838135,95,-0.0240369,-0.0267096,-0.0410159,33
1429614838177,95,-0.0279626,-0.0271086,-0.0376903,35
1429614838218,95,-0.0240274,-0.0219429,-0.0264201,36
1429614838260,95,-0.0135114,-0.0128959,-0.0115816,35
1429614838302,95,0.00199507,-0.000523797,0.00344997,32
1429614838344,95,0.0148013,0.0109923,0.0153829,26
1429614838385,95,0.0221189,0.0179087,0.0234151,21
1429614838426,95,0.0204475,0.0183884,0.0244549,14
1429614838468,95,0.0137903,0.0143763,0.0213758,11
1429614838510,95,0.00645506,0.00860443,0.0188828,15
1429614838552,95,0.00449772,0.00561322,0.0217719,31
1429614838594,95,0.00795981,0.00670427,0.0302289,64
1429614838635,95,0.0162213,0.0142212,0.0421736,76
1429614838677,95,0.0228126,0.0217677,0.0489917,74
1429614838718,93,0.0229144,0.0256421,0.0420699,66
1429614838759,93,0.022752,0.0268397,0.0325596,50
1429614838801,93,0.0219281,0.0241211,0.0211132,41
1429614838842,93,0.0223894,0.0196452,0.016836,38
1429614838884,93,0.0221084,0.0130339,0.0158646,40
1429614838926,93,0.0171845,0.00459764,0.0137135,42
1429614838968,93,0.00660864,-0.0058868,0.00218405,42
1429614839011,93,-0.00908314,-0.0174853,-0.0132426,39
1429614839029,93,-0.0261627,-0.0281427,-0.0321065,37
1429614839040,93,-0.0413479,-0.0381506,-0.0504851,36
1429614839083,93,-0.0504753,-0.0446287,-0.0643141,32
1429614839124,93,-0.0543223,-0.0475767,-0.0731145,29
1429614839168,93,-0.0558705,-0.049051,-0.0782643,36
1429614839180,93,-0.0527266,-0.0470228,-0.0750297,43
1429614839222,93,-0.0504535,-0.045136,-0.0698696,64
1429614839263,93,-0.0415946,-0.0384364,-0.0556798,88
1429614839305,93,-0.0290997,-0.0308852,-0.0322589,88
1429614839317,93,-0.014412,-0.0237456,-0.00786643,85
1429614839360,93,-0.00191438,-0.0210792,0.0095132,69
1429614839372,93,0.00726142,-0.0158609,0.0211505,69
1429614839415,93,0.0110557,-0.00918945,0.0196616,50
1429614839426,93,0.0115278,0.00270104,0.0136667,46
1429614839468,93,0.00861171,0.0134325,0.00522999,41
1429614839510,93,0.00589599,0.0225887,0.00249422,42
1429614839522,93,0.00937828,0.0312333,0.0155406,42
1429614839563,93,0.0183306,0.0394983,0.0355186,44
1429614839605,93,0.028466,0.04647,0.0523357,42
1429614839646,93,0.0414753,0.0522082,0.0638766,37
1429614839688,93,0.0458073,0.0514342,0.0586698,31
1429614839700,93,0.0429098,0.044907,0.0432105,28
1429614839741,93,0.0338053,0.0330484,0.0211629,23
1429614839784,93,0.0199778,0.0184639,-0.00334026,22
1429614839796,93,0.0123709,0.0094054,-0.0140793,27
1429614839842,93,0.0101312,0.00633166,-0.0107772,41
1429614839854,93,0.0108873,0.00631597,-0.000905494,51
1429614839896,93,0.0087032,0.00450258,0.00720973,71
1429614839907,93,5.13482e-05,-0.0034365,0.00481027,71
1429614839949,93,-0.00994735,-0.013326,-0.000477611,67
1429614839976,93,-0.0136942,-0.019526,0.000738593,62
1429614840018,93,-0.0103128,-0.0209744,0.00491105,45
1429614840060,93,-0.00418784,-0.0155496,0.0129111,33
1429614840102,93,0.00194551,-0.00736346,0.0173524,30
1429614840114,93,0.000690528,-0.00103974,0.0104533,30
1429614840156,93,-0.00809533,-0.0013433,-0.00633673,32
1429614840175,93,-0.0182351,-0.00521183,-0.0237583,33
1429614840217,93,-0.023376,-0.0109573,-0.0340379,34
1429614840243,93,-0.0233679,-0.0162474,-0.0370743,33
1429614840284,93,-0.0166753,-0.0171128,-0.0305806,28
1429614840307,93,-0.00693902,-0.0114,-0.0204707,26
1429614840349,93,0.000804462,-0.000389554,-0.0108838,19
1429614840390,93,0.000741597,0.00890747,-0.0115376,16
1429614840408,93,-0.0072443,0.011621,-0.0213795,17
1429614840449,93,-0.0138181,0.011383,-0.0302953,37
1429614840491,93,-0.0148467,0.0079004,-0.0318812,57
1429614840508,93,-0.00855723,0.00528771,-0.0221112,64
1429614840549,93,-0.00368772,0.00182748,-0.01131,68
1429614840575,93,0.000793918,-7.70573e-05,0.00212243,64
1429614840617,93,0.00164906,-0.00166281,0.0119519,47
1429614840646,93,0.00105163,-0.00153756,0.0148484,36
1429614840675,93,0.00338214,-0.000543868,0.0191358,31
1429614840716,93,0.00563107,-0.000126131,0.0199664,23
1429614840743,93,0.0095754,-0.00191237,0.021509,23
1429614840784,93,0.0144194,-0.000968956,0.0244405,27
1429614840807,93,0.0204234,0.00307839,0.0279715,27
1429614840849,93,0.0268976,0.00858083,0.0331616,26
1429614840875,93,0.032921,0.0140269,0.0411899,25
1429614840916,93,0.0334787,0.0143885,0.0453415,19
1429614840944,93,0.030355,0.012501,0.0472282,19
1429614840975,93,0.0253509,0.0115901,0.046315,22
1429614841017,93,0.0130811,0.0063512,0.0329465,45
1429614841058,93,-0.0022317,0.000408719,0.00994262,62
1429614841100,93,-0.0193544,-0.00891304,-0.0187975,65
1429614841142,93,-0.0288149,-0.0152405,-0.0373014,45
1429614841212,93,-0.0301523,-0.0173521,-0.0446634,30
1429614841254,93,-0.0212614,-0.0154707,-0.0396028,25
1429614841296,93,-0.0126168,-0.0127914,-0.0298854,24
1429614841338,93,-0.00966443,-0.0133848,-0.0261627,27
1429614841380,93,-0.011034,-0.0118585,-0.0240828,61
1429614841615,93,-0.0186473,-0.0111665,-0.0278293,62
1429614841657,93,-0.0262516,-0.00915677,-0.0327147,57
1429614841698,93,-0.0299934,-0.00749277,-0.0333438,42
1429614841740,93,-0.0350495,-0.0121337,-0.0393585,32
1429614841782,93,-0.0147791,0.000152601,-0.0173654,23
1429614841824,93,-0.0101474,-0.00725144,-0.0163371,23
1429614841865,93,-0.045218,-0.0532165,-0.061302,26
1429614841907,93,-0.115476,-0.13405,-0.141687,27
1429614841949,93,-0.188888,-0.215026,-0.223336,25
1429614841991,93,-0.223843,-0.253805,-0.257959,22
1429614842032,93,-0.197832,-0.226127,-0.225467,24
1429614842074,93,-0.118513,-0.141468,-0.132184,37
1429614842116,93,-0.0127245,-0.0289119,-0.013579,61
1429614842158,93,0.0978854,0.0868895,0.112313,68
1429614842200,93,0.1698,0.163831,0.190355,63
1429614842242,93,0.206708,0.205763,0.231762,54
1429614842284,93,0.206996,0.211614,0.235606,40
1429614842327,93,0.190043,0.19685,0.221836,33
1429614842370,93,0.147421,0.157072,0.17691,30
1429614842413,93,0.106435,0.118092,0.131538,31
1429614842455,93,0.0658563,0.0807657,0.0796749,32
1429614842499,93,0.0472084,0.0640949,0.0517708,29
1429614842511,93,0.0372144,0.0533273,0.0340074,29
1429614842553,93,0.0343333,0.045653,0.0305094,24
1429614842594,93,0.0263993,0.0302804,0.0261777,26
1429614842636,93,0.00709858,0.00655464,0.00993727,40
1429614842679,93,-0.0189644,-0.0216246,-0.0182779,53
1429614842720,93,-0.0431118,-0.0430911,-0.0511423,59
1429614842762,93,-0.0641918,-0.0586197,-0.0795783,56
1429614842803,93,-0.0776919,-0.0659391,-0.0948708,46
1429614842845,93,-0.0848374,-0.07132,-0.101423,40
1429614842887,93,-0.0747308,-0.0620235,-0.0826296,33
1429614842928,93,-0.0557782,-0.0491221,-0.0546717,31
1429614842970,93,-0.0154404,-0.0149904,-0.00106809,29
1429614843011,93,0.00923823,0.0082448,0.0296591,28
1429614843053,93,0.0278814,0.0275592,0.0467601,25
1429614843095,93,0.0247251,0.0252017,0.0336298,22
1429614843137,93,0.000893055,0.00169698,-0.00127071,22
1429614843149,93,-0.039295,-0.0370692,-0.053032,24
1429614843191,93,-0.0638621,-0.0614447,-0.0814589,34
1429614843232,93,-0.0673539,-0.0643576,-0.0842453,50
1429614843274,93,-0.0389585,-0.0374872,-0.0519228,54
1429614843316,93,0.00328885,0.00258476,-0.00358736,52
1429614843359,93,0.0482361,0.0445057,0.0442764,48
1429614843400,93,0.0834251,0.0761259,0.0784671,40
1429614843442,93,0.103788,0.0920178,0.0968991,35
1429614843484,93,0.102532,0.0875399,0.0935866,31
1429614843526,93,0.0891833,0.0733598,0.0797926,29
1429614843568,93,0.078488,0.0646097,0.0732784,26
1429614843610,93,0.0761144,0.0680871,0.0828253,23
1429614843652,93,0.0749191,0.0741099,0.0935829,19
1429614843694,93,0.0732035,0.0762992,0.0973843,19
1429614843736,93,0.0645853,0.0669356,0.0889797,26
1429614843778,93,0.0501459,0.0483813,0.0719396,33
1429614843820,93,0.0430321,0.0343878,0.0667279,40
1429614843861,93,0.0487824,0.0327802,0.0736751,40
1429614843903,93,0.0590242,0.0382663,0.0813331,40
1429614843945,93,0.0576146,0.0347743,0.0722887,39
1429614843987,93,0.0306508,0.0113397,0.0295802,37
1429614844028,93,-0.0257866,-0.0367357,-0.0440055,36
1429614844070,93,-0.0984139,-0.0959625,-0.135459,35
1429614844111,93,-0.164792,-0.148126,-0.218369,34
1429614844154,93,-0.207567,-0.179763,-0.266845,31
1429614844166,93,-0.216281,-0.182901,-0.27354,31
1429614844207,93,-0.196286,-0.163196,-0.242044,29
1429614844219,93,-0.158179,-0.128683,-0.191512,29
1429614844260,93,-0.116738,-0.0906648,-0.135181,33
1429614844302,93,-0.075496,-0.0554691,-0.0858163,44
1429614844313,93,-0.038151,-0.0273893,-0.0471251,44
1429614844356,93,-0.00660096,-0.00650154,-0.0129903,50
1429614844368,93,0.0201624,0.00684187,0.0175438,50
1429614844410,93,0.0415512,0.0148067,0.0458102,49
1429614844422,93,0.0509542,0.0163296,0.0681131,47
1429614844464,93,0.0495171,0.0125846,0.0794568,45
1429614844506,93,0.0428631,0.00885636,0.0817524,43
1429614844518,93,0.0407866,0.0139979,0.0818995,43
1429614844559,93,0.0519565,0.0325833,0.0896003,43
1429614844575,93,0.075171,0.0601371,0.106554,44
1429614844617,93,0.0964958,0.0852551,0.127102,44
1429614844643,93,0.104908,0.0996466,0.134474,45
1429614844675,93,0.0955246,0.0975679,0.122214,46
1429614844717,93,0.0684239,0.0804581,0.0889959,46
1429614844743,93,0.0353122,0.0558941,0.0440876,46
1429614844775,93,0.00769159,0.0312378,0.000196821,52
1429614844817,93,-0.0106908,0.0103045,-0.0330436,61
1429614844843,93,-0.025449,-0.00712275,-0.0558348,70
1429614844875,93,-0.0418577,-0.0214753,-0.0698991,73
1429614844916,93,-0.0616357,-0.0351959,-0.0787531,71
1429614844943,93,-0.0805721,-0.0460035,-0.0838284,64
1429614844984,93,-0.0908999,-0.0526015,-0.0840269,55
1429614845007,93,-0.0886458,-0.0534129,-0.078266,47
1429614845049,93,-0.0750101,-0.0495044,-0.0671868,40
1429614845076,93,-0.0569265,-0.0454747,-0.0543877,38
1429614845107,93,-0.0412039,-0.0426827,-0.0446042,36
1429614845148,93,-0.0290837,-0.0399739,-0.0369934,35
1429614845175,93,-0.0195435,-0.0345988,-0.0289143,34
1429614845218,93,-0.00747863,-0.0235581,-0.014987,31
1429614845243,93,0.00563419,-0.0104328,0.0029755,28
1429614845284,93,0.0181229,0.00211175,0.0197586,24
1429614845326,93,0.029537,0.0113878,0.0315903,27
1429614845367,93,0.0340176,0.0141352,0.0339443,38
1429614845409,93,0.0285036,0.0101674,0.0258561,58
1429614845450,93,0.0156297,0.00219662,0.0121489,62
1429614845492,93,-0.000436686,-0.00695399,-0.00260741,56
1429614845534,93,-0.0145107,-0.0151412,-0.0150353,48
1429614845575,93,-0.0218318,-0.0202317,-0.0225417,36
1429614845617,93,-0.0207359,-0.0218886,-0.0229462,29
1429614845658,93,-0.015551,-0.0223592,-0.0203405,27
1429614845701,93,-0.00870762,-0.0208807,-0.0170208,27
1429614845743,93,-0.0039689,-0.0193372,-0.0125172,28
1429614845784,93,-0.00161181,-0.017033,-0.00609734,26
1429614845832,93,0.00219567,-0.009835,0.00648031,22
1429614845844,93,0.00488461,-0.00215671,0.020398,20
1429614845887,93,0.00707828,0.00514271,0.0335375,18
1429614845933,93,0.0135538,0.0134264,0.0413153,26
1429614845944,93,0.0178402,0.0184892,0.0421604,33
1429614845986,93,0.0168553,0.0184483,0.0306675,49
1429614846031,93,0.00499458,0.0117885,0.0111613,64
1429614846043,93,-0.0205887,-0.00389165,-0.0174715,64
1429614846085,93,-0.0483174,-0.0200612,-0.0421937,59
1429614846131,93,-0.0675318,-0.0325983,-0.0553615,45
1429614846144,93,-0.0614139,-0.0284039,-0.0401109,40
1429614846186,93,-0.0315968,-0.00760172,-0.00666604,31
1429614846228,93,0.0061924,0.0175509,0.0245664,24
1429614846270,93,0.0399557,0.0394608,0.0484227,24
1429614846311,93,0.061155,0.0504095,0.0557833,26
1429614846353,93,0.0612046,0.0447901,0.0433876,25
1429614846394,93,0.0460204,0.0289957,0.0216875,21
1429614846436,93,0.0219734,0.00735619,-0.00548729,18
1429614846477,93,-0.00506382,-0.0156813,-0.0334066,14
1429614846519,93,-0.0277774,-0.0356849,-0.0563611,19
1429614846560,93,-0.0447203,-0.0498197,-0.0733223,42
1429614846602,93,-0.0424124,-0.0459198,-0.0644279,58
1429614846644,93,-0.0263741,-0.0275329,-0.0387423,62
1429614846685,93,-0.000147121,-0.00168179,-0.00361138,53
1429614846727,93,0.0338041,0.0280112,0.0400091,32
1429614846769,93,0.0638295,0.0527453,0.0736617,19
1429614846811,93,0.0770222,0.062024,0.0824435,10
1429614846854,93,0.0765642,0.0603842,0.0756742,11
1429614846897,93,0.0624961,0.0484849,0.0558596,18
1429614846909,93,0.0364657,0.0279347,0.026704,20
1429614846951,93,0.0157975,0.0141272,0.0138597,21
1429614846992,93,0.00217605,0.00604449,0.013423,20
1429614847034,93,-0.00813798,0.00106126,0.0135874,16
1429614847075,93,-0.00716074,0.00519721,0.0193992,16
1429614847116,93,-0.00624602,0.00814773,0.0151537,27
1429614847159,93,-0.00934527,0.00550969,0.000224239,54
1429614847171,93,-0.0121053,0.000524477,-0.012939,54
1429614847212,93,-0.0140933,-0.00508486,-0.0204218,66
1429614847253,93,-0.0141886,-0.00834376,-0.0195175,62
1429614847295,93,-0.0302633,-0.0264297,-0.0322432,47
1429614847340,93,-0.0350149,-0.0323818,-0.035035,30
1429614847352,93,-0.0192677,-0.0160121,-0.019683,30
1429614847393,93,0.00550181,0.0119691,-0.00183184,22
1429614847437,93,0.0500598,0.0583722,0.0381009,23
1429614847450,93,0.104336,0.109383,0.0942365,25
1429614847491,93,0.138819,0.138621,0.134132,29
1429614847533,93,0.142096,0.137633,0.147304,29
1429614847578,93,0.106942,0.103512,0.119706,24
1429614847590,93,0.0541523,0.054366,0.0728051,24
1429614847631,93,-0.00757033,-0.00190614,0.00949166,22
1429614847673,93,-0.0504231,-0.0430036,-0.037162,32
1429614847715,93,-0.075996,-0.0709014,-0.0701461,53
1429614847756,93,-0.084048,-0.0836386,-0.0860639,58
1429614847798,93,-0.0916924,-0.0923997,-0.100875,52
1429614847840,93,-0.0904208,-0.0894228,-0.0992363,42
1429614847881,93,-0.0939999,-0.0874129,-0.101197,27
1429614847893,93,-0.081765,-0.0712189,-0.0824482,23
1429614847935,93,-0.0554851,-0.0452785,-0.0512243,17
1429614847976,93,-0.0175576,-0.0132867,-0.0113092,19
1429614848018,93,0.0238193,0.0182119,0.0300687,23
1429614848061,93,0.056245,0.0416247,0.0614108,26
1429614848073,93,0.0738436,0.0542894,0.077812,26
1429614848115,93,0.0740895,0.0544248,0.0759817,25
1429614848157,93,0.0607942,0.0449837,0.0619682,28
1429614848169,93,0.0415447,0.030317,0.0409549,32
1429614848211,93,0.0210531,0.0143809,0.0191893,51
1429614848253,93,0.0010668,-0.0032296,-0.00545704,60
1429614848264,93,-0.0159701,-0.0194498,-0.0273641,62
1429614848306,93,-0.0305457,-0.0347842,-0.0472944,59
1429614848317,93,-0.0405002,-0.0443846,-0.058205,56
1429614848358,93,-0.0460874,-0.0470137,-0.0579359,47
1429614848400,93,-0.0409596,-0.0372211,-0.0435314,33
1429614848441,93,-0.028164,-0.018831,-0.0225479,25
1429614848484,93,0.0124048,0.0243195,0.0244655,22
1429614848495,93,0.038165,0.0507004,0.0490157,23
1429614848537,93,0.0311294,0.042424,0.0339418,27
1429614848548,93,-0.00796457,0.00138004,-0.0168731,28
1429614848590,93,-0.0760407,-0.0676966,-0.0958909,29
1429614848601,93,-0.143328,-0.135567,-0.169105,29
1429614848642,93,-0.177043,-0.170465,-0.200753,27
1429614848654,93,-0.170356,-0.165647,-0.185197,27
1429614848696,93,-0.125939,-0.12452,-0.128188,38
1429614848707,93,-0.0584073,-0.0611611,-0.0485784,38
1429614848749,93,0.00827303,0.00177045,0.0270738,57
1429614848775,93,0.0595548,0.0498179,0.0824121,61
1429614848816,93,0.0898954,0.0777028,0.112314,62
1429614848845,93,0.10309,0.0899725,0.12264,57
1429614848875,93,0.105631,0.0933005,0.121706,54
1429614848916,93,0.10451,0.0948425,0.116449,42
1429614848944,93,0.102169,0.0954681,0.109254,39
1429614848975,93,0.0976824,0.0936295,0.0990167,35
1429614849016,93,0.0877868,0.085595,0.0833828,33
1429614849044,93,0.0715726,0.0701534,0.0627537,34
1429614849075,93,0.0509708,0.0494531,0.0391868,35
1429614849116,93,0.0275667,0.0266978,0.0143393,34
1429614849145,93,0.00537772,0.00603279,-0.00820135,33
1429614849175,93,-0.0145129,-0.012014,-0.0260887,32
1429614849216,93,-0.0309401,-0.0264101,-0.0388151,40
1429614849243,93,-0.0411898,-0.0360907,-0.0449686,45
1429614849275,93,-0.0461492,-0.0414834,-0.0456172,57
1429614849307,93,-0.0459381,-0.0423054,-0.0424075,62
1429614849343,93,-0.0427127,-0.0400195,-0.0373834,60
1429614849376,93,-0.0389545,-0.0362254,-0.034007,53
1429614849407,93,-0.0356121,-0.0323628,-0.031866,44
1429614849444,93,-0.0320192,-0.0286232,-0.0295038,35
1429614849475,93,-0.0272006,-0.023784,-0.0263836,27
1429614849516,93,-0.0213396,-0.0178271,-0.021072,23
1429614849561,93,-0.0126355,-0.0104,-0.0112516,24
1429614849576,93,-0.00322182,-0.00301452,-0.000923345,24
1429614849618,93,0.00257757,0.000767338,0.00460993,21
1429614849659,93,0.00314905,0.000758728,0.00328273,17
1429614849702,93,0.00141553,-0.000721934,-0.000860334,19
1429614849714,93,-0.000586715,-0.000892377,-0.00417032,23
1429614849755,93,-0.000820558,2.25038e-05,-0.00447226,35
1429614849797,93,-0.000309944,0.00187941,-0.00291527,48
1429614849838,93,0.00278294,0.0044131,0.00116018,48
1429614849880,93,0.00617071,0.00687277,0.00585828,40
1429614849921,93,0.00858679,0.00867994,0.00863081,26
1429614849964,93,0.00950576,0.00991752,0.011866,8
1429614850006,93,0.0107029,0.0122033,0.0147531,5
1429614850048,93,0.0114886,0.0145275,0.0155856,12
1429614850095,93,0.0119104,0.0160083,0.0133047,16
1429614850107,93,0.0114067,0.0153619,0.00723561,16
1429614850149,93,0.0111432,0.0133501,0.000604108,13
1429614850194,93,0.010236,0.00968955,-0.00482219,17
1429614850207,93,0.00664431,0.00429281,-0.00985654,24
1429614850248,93,0.000442256,-0.00227657,-0.0124515,57
1429614850291,93,-0.00674519,-0.00827798,-0.0118458,74
1429614850302,93,-0.0120687,-0.0126252,-0.00765696,78
1429614850344,93,-0.0133303,-0.0147635,-0.000690299,76
1429614850386,93,-0.0099782,-0.0141299,0.00739951,58
1429614850427,93,-0.00323402,-0.0108632,0.0160956,43
1429614850468,93,0.00768335,-0.00335307,0.0258078,26
1429614850510,93,0.0217234,0.00931696,0.0374321,21
1429614850552,93,0.0370733,0.0261059,0.049206,21
1429614850593,93,0.0492454,0.0408498,0.0575072,21
1429614850635,93,0.0528689,0.0482101,0.0563546,18
1429614850677,93,0.0454899,0.0446641,0.044251,19
1429614850718,93,0.0274295,0.0300695,0.0221845,45
1429614850760,93,0.00471522,0.010085,-0.00351301,72
1429614850805,93,-0.0155607,-0.00907964,-0.0261037,94
1429614850817,93,-0.0291218,-0.0226009,-0.0408372,95
1429614850858,93,-0.0353475,-0.0297809,-0.0477545,91
1429614850900,93,-0.0361475,-0.0316443,-0.0479387,74
1429614850942,93,-0.0338218,-0.0309078,-0.0432818,60
1429614850983,93,-0.031499,-0.0293189,-0.0369392,46
1429614851027,93,-0.0293564,-0.0276336,-0.0306542,42
1429614851041,93,-0.0277609,-0.02579,-0.0263929,42
1429614851083,93,-0.0244001,-0.022247,-0.0225872,41
1429614851125,93,-0.0183672,-0.0160655,-0.017304,38
1429614851166,93,-0.0116546,-0.009312,-0.0104845,35
1429614851211,93,-0.00448823,-0.00290804,-0.000694149,47
1429614851223,93,0.00162738,0.00268478,0.00937042,58
1429614851264,93,0.00686866,0.0073888,0.0180588,84
1429614851307,93,0.0107424,0.010898,0.0228743,107
1429614851348,93,0.00991501,0.0107964,0.0204469,103
1429614851390,93,0.00365518,0.00644563,0.0113502,92
1429614851431,93,-0.0124202,-0.00707511,-0.0095294,78
1429614851473,93,-0.0335091,-0.0277853,-0.0373363,59
1429614851514,93,-0.0516616,-0.0487051,-0.0664731,54
1429614851556,93,-0.0613376,-0.0637782,-0.0854226,54
1429614851598,93,-0.0583936,-0.0657501,-0.0827762,56
1429614851640,93,-0.0428949,-0.0514509,-0.0561926,54
1429614851653,93,-0.0224299,-0.0298442,-0.0188549,53
1429614851695,93,-0.00345804,-0.00942971,0.0141543,59
1429614851737,93,0.00440473,-0.000806897,0.0282372,92
1429614851749,93,0.00149738,-0.00437769,0.0242171,92
1429614851791,93,-0.00558159,-0.0121018,0.0121907,122
1429614851832,93,-0.0122405,-0.0173484,-0.00215406,121
1429614851874,93,-0.00883685,-0.0144189,0.00061312,69
1429614851916,93,0.00755347,0.00208397,0.0124333,53
1429614851959,93,0.0289741,0.0275012,0.0224606,44
1429614851971,93,0.0541775,0.0606609,0.0281639,42
1429614852013,93,0.0681806,0.0858191,0.0200341,40
1429614852055,93,0.0787784,0.10396,0.0178143,40
1429614852096,93,0.0766065,0.104137,0.0196738,39
1429614852138,93,0.0647364,0.0883379,0.0260964,34
1429614852150,93,0.0445283,0.0607325,0.0305838,34
1429614852191,93,0.023641,0.0308017,0.0302792,28
1429614852234,93,0.0121717,0.0109434,0.0344761,30
1429614852245,93,0.00406928,-0.00297729,0.0351654,30
1429614852287,93,-0.0210535,-0.0307059,0.0149839,52
1429614852298,93,-0.0335619,-0.0448027,0.00242714,52
1429614852340,93,-0.020942,-0.0329352,0.010337,74
1429614852351,93,0.0208668,0.0090374,0.0386265,76
1429614852392,93,0.081009,0.0694304,0.0865483,71
1429614852434,93,0.132066,0.11792,0.134133,60
1429614852445,93,0.14297,0.126459,0.152816,54
1429614852487,93,0.112222,0.0921305,0.137775,36
1429614852499,93,0.0520674,0.0310554,0.0913992,36
1429614852540,93,-0.0135139,-0.0323559,0.0321058,27
1429614852551,93,-0.06533,-0.0777208,-0.0286639,27
1429614852593,93,-0.0934615,-0.0964077,-0.0771913,26
1429614852607,93,-0.103238,-0.0948106,-0.113252,27
1429614852649,93,-0.103123,-0.0844284,-0.137767,27
1429614852690,93,-0.102892,-0.0761255,-0.151011,24
1429614852707,93,-0.10005,-0.0710246,-0.149028,22
1429614852748,93,-0.0923141,-0.0668435,-0.132126,18
1429614852774,93,-0.076986,-0.0587432,-0.105004,13
1429614852816,93,-0.0559319,-0.0457593,-0.0743411,11
1429614852844,93,-0.0359511,-0.0313116,-0.0479557,20
1429614852885,93,-0.0201412,-0.0189835,-0.0284793,40
1429614852907,93,-0.00869211,-0.0101665,-0.0144272,61
1429614852948,93,-0.0061299,-0.00829058,-0.00971583,71
1429614852974,93,-0.00203242,-0.00634935,-0.00404617,68
1429614853016,93,0.00558195,-0.000354251,0.004654,58
1429614853043,93,0.0166158,0.0101382,0.0158757,45
1429614853074,93,0.0297872,0.024495,0.0293231,33
1429614853116,93,0.0413762,0.0395507,0.0425691,25
1429614853143,93,0.0488053,0.052039,0.0537009,22
1429614853175,93,0.0527577,0.0605792,0.0628904,23
1429614853207,93,0.0553879,0.0652481,0.0728167,23
1429614853242,93,0.0588585,0.065965,0.081398,22
1429614853274,93,0.063948,0.065866,0.0881471,18
1429614853316,93,0.0719825,0.0659401,0.0940649,14
1429614853343,93,0.0754462,0.0633209,0.091766,9
1429614853374,93,0.0699115,0.0551557,0.0792887,5
1429614853416,93,0.0577917,0.0455787,0.0614353,0
1429614853443,93,0.0423144,0.0370126,0.0443008,0
1429614853474,93,0.0273833,0.0307873,0.0311866,0
1429614853516,93,0.0142153,0.0242429,0.0206213,15
1429614853543,93,0.0045592,0.0158272,0.0127929,34
1429614853575,93,-0.00351277,0.00346185,0.00327846,45
1429614853607,93,-0.00946873,-0.0104412,-0.0063363,45
1429614853644,93,-0.015703,-0.0250783,-0.0164408,38
1429614853674,93,-0.0230305,-0.0370598,-0.0244067,29
1429614853716,93,-0.0336507,-0.0488238,-0.033542,20
1429614853757,93,-0.0473907,-0.0599318,-0.0456634,14
1429614853799,93,-0.060828,-0.0699114,-0.0601696,16
1429614853840,93,-0.0699154,-0.076381,-0.073643,22
1429614853883,93,-0.0686295,-0.0741046,-0.0766588,24
1429614853930,93,-0.0570991,-0.0634484,-0.0699133,22
1429614853942,93,-0.0391375,-0.046598,-0.0555694,20
1429614853984,93,-0.0218258,-0.0296935,-0.041377,16
1429614854025,93,-0.00951221,-0.0158977,-0.0302618,10
1429614854067,93,0.0161656,0.0122687,-0.000750329,6
1429614854109,93,0.0267362,0.0273416,0.0163939,5
1429614854154,93,0.0102766,0.017968,0.00811952,27
1429614854166,93,-0.0262298,-0.010662,-0.0223001,27
1429614854208,93,-0.0821282,-0.0586955,-0.0748671,59
1429614854254,93,-0.134535,-0.106572,-0.12637,70
1429614854266,93,-0.158529,-0.131327,-0.152046,70
1429614854307,93,-0.150871,-0.12868,-0.147325,60
1429614854348,93,-0.112058,-0.0982881,-0.111192,48
1429614854395,93,-0.0570883,-0.0516043,-0.0570152,32
1429614854408,93,0.00192527,0.000824547,0.00362872,28
1429614854449,93,0.0537329,0.048494,0.0587151,26
1429614854460,93,0.0935644,0.0860627,0.102584,26
1429614854502,93,0.119863,0.110774,0.131144,29
1429614854543,93,0.132458,0.12226,0.143269,31
1429614854585,93,0.13349,0.121972,0.140356,29
1429614854626,93,0.124444,0.112111,0.125413,21
1429614854668,93,0.107885,0.0959239,0.103542,15
1429614854711,93,0.0862534,0.0757215,0.0788132,8
1429614854754,93,0.0632644,0.0550623,0.0559185,5
1429614854796,93,0.0407948,0.0356785,0.0358523,18
1429614854838,93,0.0226859,0.0199058,0.0210682,37
1429614854879,93,0.00827627,0.00739076,0.009538,60
1429614854921,93,-0.00158375,-0.00215026,0.00097168,63
1429614854963,93,-0.00877567,-0.00987419,-0.00731636,53
1429614855004,93,-0.0133225,-0.0153929,-0.0139483,41
1429614855046,93,-0.0166751,-0.0194802,-0.0181205,26
1429614855088,93,-0.0188787,-0.021006,-0.0210469,20
1429614855129,93,-0.0194681,-0.0199768,-0.0233218,21
1429614855171,93,-0.0200774,-0.0175064,-0.0259303,23
1429614855213,93,-0.0222883,-0.0162018,-0.0296056,24
1429614855255,93,-0.0282547,-0.0188049,-0.0364652,22
1429614855297,93,-0.03755,-0.0259005,-0.0459111,17
1429614855339,93,-0.0468071,-0.0356109,-0.0544735,13
1429614855380,93,-0.0504221,-0.0433956,-0.056691,7
1429614855422,93,-0.0483253,-0.0466281,-0.0529017,4
1429614855464,93,-0.043169,-0.0456712,-0.0449036,18
1429614855505,93,-0.0385232,-0.0411382,-0.0371515,39
1429614855547,93,-0.0369673,-0.0366521,-0.0325689,63
1429614855588,93,-0.0405896,-0.0378479,-0.0334948,67
1429614855630,92,-0.046681,-0.0432102,-0.038077,59
1429614855677,92,-0.0503678,-0.0479065,-0.0399101,44
1429614855690,92,-0.0464121,-0.0471524,-0.0369469,44
1429614855732,92,-0.0342941,-0.0385932,-0.0268986,32
1429614855773,92,-0.0146724,-0.0229529,-0.0109754,29
1429614855815,92,0.0105639,-0.000942325,0.00874315,30
1429614855856,92,0.0281393,0.0166451,0.0225242,32
1429614855898,92,0.0433971,0.0349855,0.0414718,30
1429614855909,92,0.0551745,0.0520621,0.0609153,29
1429614855951,92,0.0640091,0.0657202,0.0788211,24
1429614855992,92,0.0710788,0.0747871,0.0910451,17
1429614856034,92,0.0694633,0.0741338,0.0872495,12
1429614856076,92,0.0595054,0.0639597,0.0684222,14
1429614856117,92,0.0451048,0.0494433,0.0430784,27
1429614856160,92,0.0336545,0.0369302,0.0216222,55
1429614856172,92,0.0262829,0.0287106,0.00806629,55
1429614856213,92,0.0223768,0.0243988,0.0021238,69
1429614856255,91,0.0195833,0.0224436,-0.000696941,67
1429614856296,91,0.0132631,0.0167601,-0.00579442,56
1429614856338,91,0.00410394,0.00761546,-0.0125651,46
1429614856350,91,-0.00565929,-0.00432777,-0.0197292,41
1429614856392,91,-0.0175775,-0.0187121,-0.0267351,36
1429614856433,91,-0.0254805,-0.0311537,-0.0285272,34
1429614856445,91,-0.034734,-0.0442858,-0.0336651,35
1429614856487,91,-0.0415886,-0.0514242,-0.0316407,36
1429614856499,91,-0.0470056,-0.0539321,-0.0307949,36
1429614856541,91,-0.0506517,-0.0516541,-0.0314622,34
1429614856582,91,-0.0559513,-0.0501364,-0.0426047,29
1429614856593,91,-0.0690619,-0.0566013,-0.0702242,27
1429614856635,91,-0.0751639,-0.0614619,-0.093993,24
1429614856677,91,-0.0614156,-0.0549131,-0.0917797,35
1429614856689,91,-0.0407239,-0.0437994,-0.0753258,35
1429614856731,91,-0.00690787,-0.0210363,-0.0349667,60
1429614856742,91,0.0142592,-0.00315971,-0.00277027,60
1429614856784,91,0.0282535,0.0135096,0.0247351,74
1429614856795,91,0.0260452,0.0187698,0.0385106,73
1429614856837,91,0.0299354,0.030254,0.0534585,66
1429614856848,91,0.0419903,0.0491378,0.0674065,61
1429614856890,91,0.057319,0.0707948,0.0709863,49
1429614856907,91,0.070648,0.0888265,0.0655342,43
1429614856948,91,0.0773397,0.0972595,0.0588751,32
1429614856975,91,0.0676986,0.0883047,0.0487546,31
1429614857016,91,0.0565378,0.0727221,0.0494024,32
1429614857057,91,0.0374861,0.046798,0.0479518,34
1429614857075,91,0.0234156,0.0224574,0.0500925,34
1429614857116,91,0.00275299,-0.00636256,0.0392292,32
1429614857158,91,-0.0227699,-0.0356986,0.0151992,29
1429614857174,91,-0.0511749,-0.0623271,-0.0182285,27
1429614857216,91,-0.0931705,-0.0973696,-0.0681053,23
1429614857243,91,-0.109257,-0.107589,-0.09661,26
1429614857285,91,-0.0817731,-0.0781806,-0.082115,47
1429614857307,91,-0.0110024,-0.00860419,-0.0292658,58
1429614857349,91,0.0875877,0.0849874,0.0569367,77
1429614857375,91,0.174779,0.165748,0.142057,78
1429614857416,91,0.213914,0.199649,0.193454,67
1429614857443,91,0.189905,0.17428,0.190488,61
1429614857475,91,0.118108,0.106497,0.138515,49
1429614857516,91,0.0320013,0.0271684,0.0618862,35
1429614857543,91,-0.0377736,-0.0366504,-0.0113473,33
1429614857591,91,-0.0766123,-0.0728629,-0.0630988,33
1429614857610,91,-0.0820478,-0.0801768,-0.0837325,35
1429614857652,91,-0.0785693,-0.0792752,-0.0889547,37
1429614857675,91,-0.080691,-0.0833141,-0.0928192,37
1429614857716,91,-0.0932246,-0.0953754,-0.101988,33
1429614857743,91,-0.112804,-0.113245,-0.118829,31
1429614857774,91,-0.131109,-0.128476,-0.138117,27
1429614857816,91,-0.127654,-0.123473,-0.136611,36
1429614857843,91,-0.105122,-0.100649,-0.116201,44
1429614857874,91,-0.0701205,-0.0664103,-0.0797369,63
1429614857916,91,-0.0319031,-0.0292163,-0.0376898,76
1429614857958,91,-0.00346466,-0.00129486,-0.00559945,71
1429614858000,91,0.016107,0.0180482,0.0156389,54
1429614858042,91,0.0267039,0.0279233,0.026947,42
1429614858084,91,0.0335864,0.0343808,0.0347156,33
1429614858125,91,0.0425618,0.0426615,0.0445101,33
1429614858166,91,0.0532551,0.0539309,0.0545328,37
1429614858208,91,0.064474,0.0659862,0.0636187,38
1429614858249,91,0.0752626,0.0772473,0.0714424,34
1429614858292,91,0.0800245,0.0816312,0.0747806,28
1429614858333,91,0.081183,0.0807907,0.0762023,27
1429614858375,91,0.0795617,0.0760588,0.0768893,40
1429614858416,91,0.0739539,0.0677371,0.0745206,67
1429614858458,91,0.0652183,0.057165,0.0697226,74
1429614858500,91,0.0507965,0.043174,0.0587838,65
1429614858541,91,0.0338422,0.0277882,0.044888,52
1429614858583,91,0.0133617,0.010397,0.0258105,37
1429614858625,91,-0.00404217,-0.00444319,0.0118559,32
1429614858668,91,-0.0156034,-0.0137079,0.00203731,34
1429614858711,91,-0.017713,-0.0152903,-0.000777478,36
1429614858752,91,-0.0154467,-0.0135894,-0.00243437,37
1429614858794,91,-0.0128603,-0.0126677,-0.00912015,36
1429614858835,91,-0.0165918,-0.0188992,-0.0231429,31
1429614858877,91,-0.0271872,-0.0312677,-0.0454427,28
1429614858919,91,-0.0454531,-0.0490534,-0.0699425,39
1429614858960,91,-0.0632497,-0.0659523,-0.0930961,57
1429614859002,91,-0.0753384,-0.0779634,-0.109708,82
1429614859043,91,-0.076679,-0.082035,-0.113947,86
1429614859088,91,-0.0691281,-0.0777619,-0.106774,76
1429614859100,91,-0.0565242,-0.0665157,-0.0903713,71
1429614859145,91,-0.0448786,-0.0520255,-0.0699563,59
1429614859161,91,-0.0356399,-0.0370503,-0.0475761,54
1429614859173,91,-0.0282597,-0.0227773,-0.0245073,50
1429614859215,91,-0.0202593,-0.00901522,-0.000747464,43
1429614859257,91,-0.0095275,0.00549494,0.0228902,43
1429614859300,91,0.00498305,0.0214476,0.0449078,44
1429614859344,91,0.01933,0.0364153,0.0605376,42
1429614859358,91,0.0308591,0.0482928,0.0693059,41
1429614859399,91,0.038093,0.0563537,0.0710113,36
1429614859441,91,0.0403975,0.059174,0.0683278,32
1429614859482,91,0.0363752,0.0549064,0.0600364,40
1429614859524,91,0.0251341,0.0416198,0.0435614,59
1429614859536,91,0.00649473,0.0188388,0.0167946,70
1429614859577,91,-0.0186036,-0.0117632,-0.0207632,86
1429614859619,91,-0.0444585,-0.0438439,-0.0589048,84
1429614859660,91,-0.0664884,-0.071193,-0.0888848,71
1429614859702,91,-0.0733037,-0.0824283,-0.0988052,51
1429614859744,91,-0.0694494,-0.082444,-0.0908867,42
1429614859786,91,-0.0511434,-0.0668173,-0.0624054,39
1429614859829,91,-0.0258882,-0.0422401,-0.0272577,40
1429614859870,91,0.00197707,-0.0138686,0.00876215,38
1429614859912,91,0.0229928,0.00904075,0.0338803,36
1429614859954,91,0.0377557,0.0256942,0.0460232,31
1429614859996,91,0.0403591,0.0293807,0.0429298,27
1429614860037,91,0.0338612,0.0221738,0.0295043,22
1429614860079,91,0.0128656,0.00181683,0.00595402,20
1429614860121,91,-0.0139615,-0.0213247,-0.0180128,33
1429614860163,91,-0.0367108,-0.0411817,-0.0327806,50
1429614860176,91,-0.0479236,-0.0531432,-0.0388135,60
1429614860218,91,-0.0379013,-0.0485985,-0.0283875,76
1429614860229,91,-0.00972719,-0.0275509,-0.00639273,76
1429614860272,91,0.0345674,0.00956924,0.02738,73
1429614860284,91,0.0754648,0.0495795,0.0571507,70
1429614860326,91,0.0963557,0.0783533,0.0715935,61
1429614860338,91,0.0909733,0.0852944,0.0730358,56
1429614860380,91,0.0718109,0.0831869,0.0633423,48
1429614860421,91,0.0496592,0.0773537,0.0464936,42
1429614860463,91,0.0459035,0.0839835,0.0383997,40
1429614860504,91,0.0533274,0.0940582,0.034312,39
1429614860546,91,0.0569848,0.0949084,0.0289798,36
1429614860588,91,0.0429967,0.0757164,0.0140874,31
1429614860599,91,0.0191791,0.0450755,0.0022169,31
1429614860641,91,0.00165734,0.018857,-0.00155567,26
1429614860654,91,-0.0153867,-0.00627527,-0.00192863,24
1429614860695,91,-0.0310364,-0.0288093,0.000431065,20
1429614860738,91,-0.0477137,-0.052522,0.00217128,23
1429614860749,91,-0.073962,-0.0865275,-0.00586906,23
1429614860791,91,-0.0852597,-0.1043,-0.0106432,44
1429614860804,91,-0.0690832,-0.0925646,-0.00550282,54
1429614860846,91,-0.0383447,-0.0592898,-0.001126,68
1429614860858,91,0.00838642,-0.00578706,0.00943465,71
1429614860899,91,0.0515698,0.0455667,0.017402,70
1429614860941,91,0.084332,0.0832169,0.0252277,60
1429614860953,91,0.102273,0.101514,0.0340757,56
1429614860975,91,0.1068,0.102225,0.0438999,51
1429614861016,91,0.0939694,0.0824107,0.04575,43
1429614861058,91,0.0709788,0.0548366,0.0404303,37
1429614861075,91,0.0443131,0.0289699,0.0339754,36
1429614861116,91,0.0101273,-7.73804e-05,0.0156399,35
1429614861144,91,-0.0237474,-0.024397,-0.00603192,34
1429614861174,91,-0.0509169,-0.044571,-0.0290961,32
1429614861216,91,-0.0717459,-0.0610745,-0.0536088,29
1429614861242,91,-0.0862137,-0.0762315,-0.0810224,26
1429614861284,91,-0.0925931,-0.0838415,-0.0970554,23
1429614861307,91,-0.0906228,-0.0826006,-0.0993578,19
1429614861348,91,-0.0780546,-0.0689671,-0.0804885,16
1429614861375,91,-0.0538869,-0.0405461,-0.0432301,14
1429614861417,91,-0.026642,-0.0110294,-0.00495142,18
1429614861442,91,-0.00332093,0.0130101,0.0224102,26
1429614861485,91,0.0135902,0.025174,0.0341881,36
1429614861508,91,0.0230373,0.0270892,0.0352145,43
1429614861542,91,0.0277961,0.0234911,0.0328977,47
1429614861574,91,0.0288082,0.0181207,0.0309058,50
1429614861616,91,0.0288973,0.0154808,0.03173,49
1429614861642,91,0.0294927,0.0169363,0.0336575,47
1429614861684,91,0.033098,0.0228098,0.0363117,45
1429614861707,91,0.0332045,0.026874,0.0337727,43
1429614861754,91,0.0318855,0.0275666,0.0270095,42
1429614861775,91,0.0285366,0.0242926,0.0179551,41
1429614861816,91,0.0230339,0.0166384,0.00706774,40
1429614861842,91,0.0165997,0.00791957,-0.00178049,40
1429614861884,91,0.0089957,-0.000723469,-0.00879096,38
1429614861907,91,-0.00433184,-0.0108664,-0.0150877,36
1429614861948,91,-0.0184266,-0.0201621,-0.0224707,33
1429614861975,91,-0.0290498,-0.0266354,-0.0299019,31
1429614862016,91,-0.0129248,-0.0101035,-0.0172984,28
1429614862042,91,0.00169386,0.00378047,-0.00917127,26
1429614862084,91,-0.00140363,0.000752435,-0.0156711,30
1429614862107,91,-0.0253215,-0.021696,-0.0376926,41
1429614862148,91,-0.0742039,-0.066048,-0.078177,56
1429614862190,91,-0.126329,-0.113525,-0.118467,71
1429614862231,91,-0.156229,-0.140714,-0.137936,71
1429614862277,91,-0.155598,-0.140331,-0.130783,64
1429614862289,91,-0.124309,-0.112333,-0.0993256,60
1429614862330,91,-0.0743248,-0.0673924,-0.0522669,52
1429614862377,91,-0.0199132,-0.0175778,-0.00422202,42
1429614862389,91,0.0291979,0.0272056,0.0377181,40
1429614862431,91,0.0685473,0.0635156,0.0701728,39
1429614862472,91,0.0971104,0.0898544,0.0927814,38
1429614862519,91,0.114815,0.106527,0.106133,35
1429614862530,91,0.126277,0.117459,0.115493,34
1429614862571,91,0.124784,0.116381,0.114027,27
1429614862612,91,0.10839,0.101415,0.0994966,23
1429614862655,91,0.0780408,0.0734839,0.0725229,17
1429614862697,91,0.0407739,0.0396721,0.0390418,14
1429614862738,91,0.00722143,0.009689,0.00882146,21
1429614862780,91,-0.0144096,-0.00920309,-0.0118463,37
1429614862821,91,-0.022119,-0.0163178,-0.0203869,64
1429614862863,91,-0.0194055,-0.0151162,-0.0202836,72
1429614862905,91,-0.0134239,-0.0119984,-0.0168462,66
1429614862947,91,-0.00908695,-0.0102527,-0.0136263,56
1429614862988,91,-0.00962966,-0.0111647,-0.0138018,41
1429614863030,91,-0.0136115,-0.0142709,-0.0166934,36
1429614863071,91,-0.0201208,-0.0191561,-0.0217774,34
1429614863113,91,-0.0270151,-0.0240561,-0.0266099,35
1429614863155,91,-0.0344262,-0.0296661,-0.0330604,34
1429614863198,91,-0.0442845,-0.0379424,-0.0441302,32
1429614863239,91,-0.0529698,-0.0452297,-0.0560709,26
1429614863281,91,-0.0561548,-0.047558,-0.0626984,22
1429614863323,91,-0.0499894,-0.0420864,-0.0604168,16
1429614863365,91,-0.0351305,-0.0292053,-0.0471215,14
1429614863406,91,-0.0175198,-0.0156102,-0.0265136,13
1429614863448,91,0.00244066,-0.000935734,0.000456786,20
1429614863490,91,0.0170016,0.00997494,0.0244205,48
1429614863531,91,0.0279583,0.0186765,0.0426957,69
1429614863574,91,0.0289923,0.0193388,0.0481727,77
1429614863616,91,0.0234084,0.0152931,0.0447728,71
1429614863658,91,0.0137902,0.00743266,0.0368832,56
1429614863700,91,0.00704122,0.00175363,0.0310902,47
1429614863742,91,0.00493769,-0.00024278,0.0262494,39
1429614863784,91,0.00785551,0.00130304,0.0224284,38
1429614863825,91,0.0121555,0.00629544,0.0187199,40
1429614863867,91,0.0143051,0.0106665,0.0127697,39
1429614863913,91,0.0105979,0.0118248,0.00163736,33
1429614863925,91,0.0101582,0.0137997,-0.00382647,31
1429614863966,91,0.0100367,0.0149844,-0.0066648,25
1429614864008,91,0.00824077,0.0137856,-0.00761381,17
1429614864049,91,0.00484503,0.0120933,-0.00749273,13
1429614864091,91,-0.00162534,0.00806026,-0.0101709,9
1429614864133,91,-0.00976777,0.00243897,-0.0157909,13
1429614864175,91,-0.0165746,-0.00431153,-0.0227453,37
1429614864216,91,-0.0172989,-0.00809136,-0.0257395,58
1429614864258,91,-0.0167246,-0.013228,-0.0276826,76
1429614864300,91,-0.022634,-0.0256978,-0.0362688,75
1429614864341,91,-0.0335715,-0.042101,-0.048023,64
1429614864383,91,-0.0487612,-0.0603644,-0.0621022,54
1429614864424,91,-0.0567404,-0.0679519,-0.067228,46
1429614864466,91,-0.0480113,-0.0588042,-0.0543885,40
1429614864507,91,-0.0243093,-0.0339832,-0.0271255,41
1429614864549,91,0.00871513,-6.66081e-05,0.00907699,43
1429614864590,91,0.0361298,0.0274084,0.0386342,42
1429614864631,91,0.0492043,0.0391189,0.0579879,39
1429614864673,91,0.0523497,0.0417877,0.0653232,36
1429614864715,91,0.0482199,0.0406887,0.0596503,30
1429614864756,91,0.0479521,0.0470553,0.0502308,26
1429614864797,91,0.0485422,0.0568561,0.0379779,33
1429614864839,91,0.0516802,0.0667278,0.0303404,49
1429614864881,91,0.0497351,0.067593,0.026664,74
1429614864922,91,0.021698,0.0382506,0.00901575,79
1429614864963,91,-0.00443207,0.00823807,-0.00205807,69
1429614865005,91,-0.0052645,0.00233592,0.0108283,59
1429614865046,91,0.0275015,0.0309096,0.0457326,43
1429614865088,91,0.0857711,0.0846357,0.100784,37
1429614865129,91,0.132684,0.126469,0.144853,36
1429614865141,91,0.149222,0.136658,0.164301,36
1429614865182,91,0.127048,0.109122,0.150758,39
1429614865224,91,0.0773427,0.0569717,0.11007,38
1429614865265,91,0.0128265,-0.00584676,0.0475514,34
1429614865307,91,-0.0510962,-0.0631557,-0.0227316,30
1429614865319,91,-0.106356,-0.108339,-0.090823,28
1429614865361,91,-0.14022,-0.134189,-0.14076,22
1429614865373,91,-0.154369,-0.142704,-0.168286,22
1429614865414,91,-0.150085,-0.136402,-0.172184,33
1429614865425,91,-0.136176,-0.122399,-0.161437,33
1429614865467,91,-0.113339,-0.100558,-0.136309,60
1429614865479,91,-0.0884651,-0.0769516,-0.106823,69
1429614865520,91,-0.0606439,-0.0514515,-0.07459,76
1429614865532,91,-0.0353018,-0.0289347,-0.0460417,76
1429614865574,92,-0.00977869,-0.00704847,-0.0195767,70
1429614865586,92,0.0101817,0.00886079,0.000641302,65
1429614865627,92,0.0290704,0.0245452,0.0207013,53
1429614865642,92,0.0500099,0.0435639,0.0457417,47
1429614865684,92,0.0671073,0.0606835,0.066622,35
1429614865712,92,0.0775991,0.07275,0.079954,32
1429614865743,92,0.0794108,0.0766601,0.0824681,32
1429614865785,92,0.0697893,0.0690858,0.0721312,33
1429614865810,92,0.0524106,0.054047,0.0535619,33
1429614865852,92,0.034913,0.0379064,0.0350998,30
1429614865875,92,0.0284259,0.0316662,0.0305453,29
1429614865916,92,0.0275378,0.0311247,0.0330066,22
1429614865942,92,0.0321227,0.0357625,0.0427518,20
1429614865984,92,0.0375083,0.0403633,0.0507341,14
1429614866010,92,0.0386145,0.0409021,0.0535373,16
1429614866051,92,0.0354166,0.0376069,0.0505745,38
1429614866075,92,0.0259289,0.0293181,0.0406182,48
1429614866117,92,0.0127661,0.0184117,0.0259126,70
1429614866142,92,-0.00262323,0.00368129,0.00693825,72
1429614866184,93,-0.0151638,-0.00959443,-0.0103143,67
1429614866210,93,-0.0222075,-0.0206882,-0.022466,63
1429614866252,93,-0.0254934,-0.0290768,-0.0296195,47
1429614866275,93,-0.0277609,-0.036285,-0.0343736,42
1429614866310,93,-0.0293594,-0.0408559,-0.0360379,35
1429614866342,93,-0.0321071,-0.0445685,-0.0388869,31
1429614866384,93,-0.0382181,-0.0496038,-0.0449756,33
1429614866425,93,-0.0461253,-0.0560593,-0.0524544,34
1429614866468,93,-0.0522896,-0.0601037,-0.0587297,32
1429614866509,93,-0.0533078,-0.058911,-0.0608525,29
1429614866551,93,-0.0476729,-0.0496899,-0.0549531,23
1429614866592,93,-0.035587,-0.0344763,-0.0433205,20
1429614866634,93,-0.0221875,-0.0187484,-0.0320924,34
1429614866675,93,0.00633164,0.00999662,-0.00879327,54
1429614866717,93,0.0209969,0.0220851,0.00168746,79
1429614866759,93,0.0106309,0.00806098,-0.0110491,81
1429614866802,95,-0.020875,-0.0264091,-0.0414837,70
1429614866843,95,-0.0699484,-0.0757541,-0.08467,58
1429614866885,95,-0.115642,-0.1187,-0.119673,42
1429614866927,95,-0.135874,-0.134548,-0.126918,37
1429614866968,95,-0.125811,-0.119648,-0.105555,37
1429614867010,95,-0.08829,-0.0777695,-0.060379,39
1429614867052,95,-0.0351081,-0.0222859,-0.00799166,39
1429614867093,95,0.0181411,0.032149,0.0414555,36
1429614867135,95,0.0611822,0.0753805,0.0811215,30
1429614867176,95,0.0890396,0.102727,0.107922,28
1429614867218,95,0.104638,0.116327,0.124232,43
1429614867230,95,0.113497,0.122623,0.130845,52
1429614867272,95,0.116288,0.122064,0.126778,72
1429614867313,95,0.112566,0.115165,0.111857,81
1429614867356,97,0.101656,0.10164,0.0889476,74
1429614867398,97,0.087198,0.0846107,0.0654,56
1429614867410,97,0.0684402,0.063656,0.0431175,56
1429614867452,97,0.0484941,0.0403686,0.0233834,39
1429614867493,97,0.0286209,0.017696,0.00808176,33
1429614867535,97,0.00881674,-0.0032991,-0.00482329,33
1429614867576,97,-0.00731532,-0.0191415,-0.0148394,34
1429614867618,97,-0.0202055,-0.0305783,-0.0227866,33
1429614867660,97,-0.0330665,-0.0411506,-0.0328252,30
1429614867701,97,-0.0436968,-0.050158,-0.0432974,23
1429614867744,97,-0.0535721,-0.0583365,-0.0546836,18
1429614867786,97,-0.0597473,-0.0628898,-0.0612221,23
1429614867827,97,-0.0621769,-0.0627523,-0.0622485,40
1429614867869,97,-0.0580362,-0.0555249,-0.0547236,72
1429614867910,97,-0.0468854,-0.0428779,-0.0394992,80
1429614867952,98,-0.0291577,-0.0251171,-0.0200026,72
1429614867993,98,-0.0121441,-0.00972869,-0.0045152,59
1429614868035,98,0.00153659,0.00118825,0.00560309,42
1429614868077,98,0.00711995,0.00402223,0.00830557,36
1429614868119,98,0.00893256,0.00400478,0.00927451,35
1429614868161,98,0.00343889,-0.00125386,0.00414528,38
1429614868202,98,-0.00146358,-0.00277482,0.00123848,39
1429614868244,98,-0.00600925,-0.00226448,-0.00274144,37
1429614868286,98,-0.00421021,0.00432858,-0.000602119,31
1429614868327,98,0.00265614,0.0131141,0.00540006,26
1429614868369,98,0.0117606,0.0216722,0.0134805,22
1429614868411,98,0.0203548,0.0275583,0.0222054,33
1429614868453,98,0.022487,0.0277383,0.0239448,62
1429614868500,98,0.0221338,0.0260989,0.0224741,74
1429614868512,98,0.0198077,0.0227241,0.0186333,74
1429614868555,99,0.0176262,0.0204722,0.0148951,62
1429614868596,99,0.0188877,0.0198299,0.0145004,49
1429614868638,99,0.021111,0.0198052,0.0168601,34
1429614868680,99,0.0254265,0.0229789,0.0243635,30
1429614868721,99,0.026566,0.0234278,0.0300228,32
1429614868763,99,0.0199692,0.0180763,0.0276647,34
1429614868805,99,0.0121051,0.0118774,0.0222819,33
1429614868847,99,0.00405849,0.0031714,0.0139242,30
1429614868888,99,-0.00185277,-0.00410105,0.00459488,23
1429614868930,99,-0.00424276,-0.0101194,-0.0025286,19
1429614868971,99,-0.00739486,-0.0168993,-0.0120098,22
1429614869013,99,-0.0125947,-0.0232623,-0.0221649,38
1429614869055,99,-0.0188948,-0.0282048,-0.0305658,69
1429614869096,99,-0.0244858,-0.0304312,-0.0353323,79
1429614869108,99,-0.0288513,-0.0305886,-0.03684,78
1429614869149,99,-0.0297436,-0.0278903,-0.0350087,70
1429614869191,99,-0.0281877,-0.0251138,-0.0337364,51
1429614869203,99,-0.0264085,-0.0258686,-0.0342416,44
1429614869245,99,-0.0279032,-0.032533,-0.0364497,34
1429614869286,99,-0.0274954,-0.0377029,-0.0328674,27
1429614869298,99,-0.0246933,-0.0378846,-0.0241352,27
1429614869339,99,-0.0174109,-0.0291213,-0.00991268,31
1429614869351,99,-0.00598278,-0.0134353,0.00572419,31
1429614869392,99,0.0074449,0.00647926,0.0197745,32
1429614869404,99,0.0202428,0.0252634,0.0307272,31
1429614869446,99,0.0268026,0.0372608,0.0345065,27
1429614869457,99,0.0267918,0.0403097,0.0306155,25
1429614869499,99,0.0234603,0.0373113,0.0254808,19
1429614869510,99,0.0194759,0.0304805,0.020341,16
1429614869552,99,0.0171797,0.0245615,0.0185482,10
1429614869575,99,0.013818,0.0176226,0.0172121,7
1429614869617,99,0.00974237,0.0106557,0.0152956,16
1429614869642,99,0.00368951,0.00178206,0.00981862,37
1429614869684,99,-0.00348831,-0.00840443,0.00100946,62
1429614869711,99,-0.00836528,-0.0158133,-0.00757583,78
1429614869742,99,-0.0100174,-0.0194996,-0.0145202,79
1429614869783,100,-0.00705682,-0.0145506,-0.0140278,70
1429614869810,100,-0.00375408,-0.00597697,-0.0101788,56
1429614869851,100,-0.00139275,0.00261292,-0.00489941,42
1429614869893,100,0.00248948,0.0113315,0.00222431,29
1429614869910,100,0.00550559,0.0161456,0.00664948,28
1429614869953,100,0.00868035,0.018024,0.00865404,28
1429614869975,100,0.00902433,0.0144854,0.00584604,31
1429614870016,100,0.00792087,0.00880848,0.0020921,32
1429614870042,100,0.00421259,0.00112938,-0.00428568,29
1429614870084,100,-0.000746277,-0.00542858,-0.0106906,24
1429614870110,100,-0.00537261,-0.00934025,-0.0141922,18
1429614870152,100,-0.00721329,-0.00917383,-0.0125053,12
1429614870175,100,-0.00376987,-0.00487293,-0.00689615,8
1429614870217,100,0.00224302,0.00201192,0.000654034,5
1429614870242,100,0.00685665,0.00928372,0.00613834,11
1429614870284,100,0.0108833,0.0162025,0.0110468,29
1429614870310,100,0.0105282,0.0195907,0.0116562,52
1429614870352,100,0.00802573,0.0187125,0.010738,70
1429614870374,100,0.004623,0.0138957,0.00874685,74
1429614870417,99,0.00614357,0.0112217,0.0131644,69
1429614870442,99,0.00763527,0.00820546,0.017256,58
1429614870484,99,0.00767236,0.00481337,0.0178531,45
1429614870510,99,0.00302911,-0.00208247,0.00982178,34
1429614870551,99,-0.00405742,-0.0103967,-0.0022336,27
1429614870574,99,-0.0141556,-0.0204022,-0.0164585,26
1429614870615,99,-0.0249477,-0.0315196,-0.0307336,29
1429614870657,99,-0.0255936,-0.0323458,-0.030188,34
1429614870699,99,-0.0192916,-0.0269891,-0.022057,33
1429614870741,99,-0.00633151,-0.0127071,-0.00552027,29
1429614870782,99,0.00621471,0.00192055,0.00879214,25
1429614870823,99,0.0112866,0.00830168,0.0134352,17
1429614870865,99,0.00981364,0.00769545,0.0108442,20
1429614870906,99,0.00381679,0.0030403,0.00548497,48
1429614870947,99,-0.0015041,-0.000632374,0.000996904,73
1429614870989,99,-0.00378068,-0.00311047,-0.00195156,88
1429614871030,99,-0.00145884,-0.00213943,-0.00105443,85
1429614871072,99,-0.000867502,-0.00348688,-0.00364404,72
1429614871113,99,-0.000989592,-0.00359407,-0.00782318,61
1429614871155,99,-0.00490178,-0.00445946,-0.0133055,49
1429614871197,99,-0.00981794,-0.00512717,-0.0164826,47
1429614871238,99,-0.0131519,-0.00539153,-0.0142336,48
1429614871280,99,-0.0119514,-0.00414975,-0.0067887,48
1429614871322,99,-0.00625909,-0.00175013,0.00179183,45
1429614871364,99,0.00119155,0.000249656,0.00869941,42
1429614871406,99,0.00759464,0.00281479,0.010623,36
1429614871448,99,0.0116016,0.00613514,0.00967713,32
1429614871490,99,0.0109723,0.00901937,0.00412812,40
1429614871532,99,0.00977619,0.0135754,0.000475084,58
1429614871573,99,0.00642158,0.0168247,-0.00354715,82
1429614871615,99,0.00418087,0.0188123,-0.00611705,83
1429614871656,99,0.00109789,0.0182714,-0.00722004,69
1429614871698,99,0.0011472,0.0166139,-0.00451416,56
1429614871740,99,0.00410475,0.0144765,0.00221371,39
1429614871891,99,0.00852005,0.0109642,0.0104754,39
1429614871933,99,0.0147574,0.00787273,0.0208063,36
1429614871975,99,0.0167096,0.00251045,0.0255711,29
1429614872017,99,0.0136109,-0.00425453,0.0248886,24
1429614872058,99,0.0041761,-0.012455,0.0157112,18
1429614872100,99,-0.0081833,-0.0211664,0.0025544,23
1429614872142,99,-0.0209767,-0.029409,-0.013618,49
1429614872183,99,-0.0309934,-0.0365535,-0.0295074,69
1429614872229,99,-0.041116,-0.0442537,-0.0468309,77
1429614872253,99,-0.048411,-0.0487841,-0.0602576,74
1429614872294,99,-0.0517874,-0.0483615,-0.0665409,58
1429614872336,99,-0.0514564,-0.0432625,-0.0651209,45
1429614872377,99,-0.0390323,-0.0289552,-0.0469124,32
1429614872419,99,-0.0193352,-0.0109151,-0.017826,29
1429614872460,99,0.00301301,0.00869367,0.0138982,32
1429614872503,99,0.0255027,0.0270619,0.041484,34
1429614872544,99,0.0418173,0.0406343,0.0567727,30
1429614872605,99,0.0484921,0.0471995,0.0583534,26
1429614872651,99,0.0487169,0.0496938,0.0515056,19
1429614872662,99,0.0484239,0.0515076,0.0455672,16
1429614872704,99,0.0471808,0.0524178,0.0411448,18
1429614872746,99,0.0471502,0.0527288,0.0413491,41
1429614872787,99,0.0430223,0.0489637,0.0388017,61
1429614872829,99,0.0341553,0.040788,0.0316199,71
1429614872871,98,0.0218187,0.0289281,0.0208415,65
1429614872914,98,0.00921237,0.0157193,0.00863749,46
1429614872926,98,0.00192254,0.00463174,0.000935578,40
1429614872968,98,-0.00265024,-0.00548814,-0.00462735,29
1429614873009,98,-0.00436693,-0.011979,-0.00648858,23
1429614873052,98,-0.00865418,-0.0195715,-0.0106842,25
1429614873064,98,-0.0129707,-0.0230452,-0.0123628,27
1429614873105,98,-0.0208098,-0.0264909,-0.0160796,30
1429614873147,98,-0.0280139,-0.0275061,-0.0188016,29
1429614873188,98,-0.0329447,-0.0268895,-0.021594,25
1429614873230,98,-0.0359573,-0.0273487,-0.028387,17
1429614873271,98,-0.0343485,-0.0279499,-0.033272,14
1429614873313,98,-0.0294668,-0.028955,-0.034816,27
1429614873324,98,-0.021242,-0.0291988,-0.0298777,27
1429614873366,98,-0.0132544,-0.0287329,-0.0220361,57
1429614873378,98,-0.0100794,-0.0289025,-0.0182036,65
1429614873420,98,-0.00419693,-0.0219139,-0.0101073,71
1429614873462,98,0.00196413,-0.011701,-0.00176668,60
1429614873474,98,0.00892552,-0.000263505,0.00828436,60
1429614873516,98,0.0143882,0.00758179,0.0155111,41
1429614873558,98,0.0175263,0.0120399,0.020065,31
1429614873600,98,0.0167414,0.0136357,0.020826,26
1429614873611,98,0.0105576,0.0104535,0.0150187,26
1429614873653,98,-0.00214276,0.0037943,0.00163196,29
1429614873665,98,-0.0155008,-0.00351809,-0.0110862,30
1429614873706,98,-0.0244307,-0.00718357,-0.0159174,30
1429614873718,98,-0.024153,-0.00807291,-0.0116636,29
1429614873760,98,-0.0176977,-0.0087865,-0.0052909,25
1429614873774,98,-0.00633122,-0.00869565,0.00170449,24
1429614873815,98,0.00524237,-0.00771993,0.0051072,18
1429614873858,98,0.0151698,-0.00460184,0.00721048,14
1429614873874,98,0.0223748,0.00106262,0.00982069,13
1429614873916,98,0.0295757,0.0109059,0.0178368,25
1429614873942,98,0.0381207,0.0249358,0.03006,35
1429614873983,98,0.041195,0.0348631,0.0364811,66
1429614874011,98,0.0396303,0.0401597,0.0365266,73
1429614874052,98,0.0282449,0.0351852,0.026982,72
1429614874074,98,0.0112474,0.0225484,0.0123837,67
1429614874116,98,-0.00734194,0.00604972,-0.00203748,49
1429614874142,98,-0.0219344,-0.00924352,-0.0139317,44
1429614874184,98,-0.0321073,-0.0201429,-0.0220832,34
1429614874209,98,-0.0321577,-0.0217916,-0.0210985,34
1429614874251,98,-0.0285303,-0.0184356,-0.0183396,37
1429614874274,98,-0.0194372,-0.0107959,-0.0107683,39
1429614874317,98,-0.0172987,-0.00765786,-0.013656,40
1429614874342,98,-0.0212559,-0.00927188,-0.0215874,39
1429614874383,98,-0.026705,-0.0136225,-0.031823,33
1429614874410,98,-0.0327296,-0.0228174,-0.0429784,30
1429614874451,98,-0.030906,-0.0285692,-0.0444582,22
1429614874474,98,-0.0200051,-0.0236921,-0.0315198,19
1429614874515,98,-0.00462148,-0.0125928,-0.0138916,19
1429614874542,98,0.00983682,0.00185226,0.00588554,25
1429614874583,98,0.0183657,0.0122358,0.019559,56
1429614874610,98,0.0236386,0.0192277,0.030163,67
1429614874651,98,0.0231678,0.0174546,0.0316994,79
1429614874674,98,0.0201338,0.00788404,0.0228671,77
1429614874715,98,0.0178592,0.00053352,0.0140336,62
1429614874742,98,0.0140809,-0.00411745,0.00242442,56
1429614874783,98,0.011939,-0.000564105,-0.000663221,40
1429614874810,98,0.00790765,0.00404446,-0.00278008,37
1429614874851,98,0.00659334,0.0120982,0.000280404,34
1429614874893,98,0.00242562,0.0132591,-0.00162487,36
1429614874934,98,-0.00628913,0.00625527,-0.0106545,36
1429614874976,98,-0.0210954,-0.00981715,-0.027809,33
1429614875017,98,-0.0378504,-0.0291893,-0.045515,25
1429614875058,98,-0.0518904,-0.0467859,-0.0591575,20
1429614875100,98,-0.0617683,-0.0589885,-0.0662729,13
1429614875141,98,-0.0626067,-0.0622975,-0.065344,11
1429614875183,98,-0.054969,-0.0570527,-0.0552309,28
1429614875225,98,-0.0473306,-0.0511586,-0.0461719,50
1429614875266,98,-0.038469,-0.0457945,-0.0378331,76
1429614875308,98,-0.0239969,-0.0377843,-0.0247866,76
1429614875350,98,0.000133625,-0.0171546,0.00133586,62
1429614875391,98,0.0320253,0.0142649,0.0382291,50
1429614875434,98,0.0707655,0.0547982,0.0829069,37
1429614875475,98,0.0997439,0.0863209,0.113802,33
1429614875517,98,0.121859,0.110021,0.148311,35
1429614875559,98,0.118935,0.114298,0.151803,36
1429614875606,98,0.0966563,0.105643,0.124828,34
1429614875617,98,0.0671495,0.0931933,0.0746134,33
1429614875659,98,0.0354571,0.0773961,0.0115953,28
1429614875702,98,0.0223233,0.0716948,-0.0281035,21
1429614875743,98,0.01238,0.0580898,-0.0515376,16
1429614875785,98,-0.000315364,0.0300361,-0.0578366,12
1429614875826,98,-0.0605939,-0.0463061,-0.0931072,21
1429614875869,98,-0.10932,-0.109187,-0.113637,48
1429614875912,98,-0.122853,-0.125295,-0.115427,63
1429614875953,98,-0.0732263,-0.0748915,-0.0668846,64
1429614875994,98,0.0488247,0.0394885,0.0538833,56
1429614876041,98,0.197449,0.166983,0.218768,41
1429614876053,98,0.324324,0.263086,0.380847,37
1429614876094,98,0.381617,0.292791,0.477477,30
1429614876137,98,0.339036,0.242987,0.455982,27
1429614876180,98,0.204559,0.126116,0.309176,29
1429614876221,98,0.0215188,-0.01973,0.0845732,30
1429614876262,98,-0.150696,-0.148743,-0.13951,28
1429614876304,98,-0.277166,-0.238247,-0.312441,23
1429614876346,98,-0.36062,-0.298519,-0.428808,19
1429614876388,98,-0.392588,-0.320094,-0.476258,13
1429614876429,98,-0.380378,-0.308191,-0.468959,13
1429614876470,98,-0.333795,-0.265031,-0.421449,32
1429614876513,98,-0.254789,-0.191778,-0.33676,51
1429614876554,98,-0.14645,-0.0921102,-0.214753,66
1429614876596,98,-0.019745,0.0217389,-0.0614225,62
1429614876638,98,0.10517,0.128615,0.099663,48
1429614876679,98,0.206293,0.208201,0.23998,38
1429614876721,98,0.269662,0.254902,0.341991,27
1429614876763,98,0.277021,0.25131,0.3691,26
1429614876805,98,0.235186,0.20489,0.32449,29
1429614876847,98,0.156733,0.123886,0.217669,31
1429614876889,98,0.0744627,0.0396208,0.0976446,29
1429614876931,98,0.0113763,-0.0261324,0.000749509,26
1429614876973,98,-0.0203762,-0.0592563,-0.0490236,20
1429614877014,98,-0.0305502,-0.0673722,-0.0613324,16
1429614877056,98,-0.0267653,-0.0549132,-0.0472956,19
1429614877097,98,-0.0154148,-0.030573,-0.0203814,33
1429614877139,98,0.0169655,0.0143389,0.0311871,60
1429614877180,98,0.0388532,0.0453876,0.0653938,69
1429614877222,97,0.0668401,0.0788404,0.0976373,62
1429614877265,97,0.053369,0.0680646,0.0732753,51
1429614877277,97,-0.0054356,0.0102252,-0.00874219,45
1429614877319,97,-0.0840191,-0.0702353,-0.113663,31
1429614877360,97,-0.16497,-0.155968,-0.214583,26
1429614877404,97,-0.211516,-0.209609,-0.268757,28
1429614877416,97,-0.226335,-0.230652,-0.27809,28
1429614877459,97,-0.213057,-0.22055,-0.249225,32
1429614877501,97,-0.177707,-0.185137,-0.191863,31
1429614877542,97,-0.130817,-0.133799,-0.124624,28
1429614877585,97,-0.0760858,-0.0726461,-0.0553906,22
1429614877597,97,-0.0177919,-0.00768956,0.00872165,22
1429614877638,97,0.0394076,0.0539168,0.0638858,16
1429614877680,97,0.0929609,0.107658,0.111548,18
1429614877722,97,0.13735,0.1482,0.150887,40
1429614877734,97,0.168435,0.173097,0.178969,40
1429614877776,97,0.181954,0.180373,0.190501,65
1429614877788,97,0.177221,0.170677,0.183576,69
1429614877830,97,0.155803,0.146427,0.16034,68
1429614877871,97,0.123197,0.113241,0.126012,57
1429614877913,97,0.0854443,0.0759986,0.0878466,46
1429614877955,97,0.0484705,0.040624,0.0503396,33
1429614877996,97,0.0156918,0.0104628,0.0153799,29
1429614878038,97,-0.00973269,-0.0119905,-0.0123199,30
1429614878051,97,-0.0289129,-0.0274095,-0.0325218,30
1429614878093,97,-0.0432898,-0.0377666,-0.0448476,33
1429614878105,97,-0.0555731,-0.0464125,-0.0532782,33
1429614878147,97,-0.0635027,-0.0530508,-0.0569678,31
1429614878158,97,-0.0660776,-0.0571315,-0.0548362,30
1429614878200,97,-0.0610886,-0.0556303,-0.0496096,27
1429614878211,97,-0.0506579,-0.0481613,-0.0460879,25
1429614878252,97,-0.0380664,-0.0371193,-0.0470563,25
1429614878264,97,-0.0253763,-0.0252842,-0.0494018,28
1429614878306,97,-0.0151857,-0.0160262,-0.0491752,49
1429614878318,97,-0.00826346,-0.00922984,-0.0414793,49
1429614878360,97,-0.00286471,-0.00356101,-0.0265632,69
1429614878375,97,0.0009331,0.00149706,-0.00745527,71
1429614878417,97,-0.00306329,-0.000621804,0.00422288,68
1429614878441,97,-0.0181029,-0.0139444,0.00130105,60
1429614878483,97,-0.049342,-0.046971,-0.0293765,48
1429614878509,97,-0.0826063,-0.0860303,-0.0728543,38
1429614878551,97,-0.108528,-0.118887,-0.111201,31
1429614878574,97,-0.12074,-0.134807,-0.129818,29
1429614878616,97,-0.110854,-0.129243,-0.121921,30
1429614878642,97,-0.0830925,-0.100621,-0.0858419,33
1429614878683,97,-0.0443427,-0.0546766,-0.0287369,34
1429614878710,97,0.000401972,0.000753862,0.038732,34
1429614878752,97,0.040786,0.0562065,0.100412,33
1429614878774,97,0.0716755,0.0968064,0.136887,32
1429614878815,97,0.0815396,0.1063,0.127744,40
1429614878842,97,0.0811205,0.0956534,0.0948225,56
1429614878883,97,0.0747836,0.0758293,0.056186,75
1429614878909,97,0.075467,0.0684374,0.0401639,86
1429614878951,97,0.0868705,0.0834717,0.0568178,85
1429614878974,97,0.101042,0.107707,0.085889,76
1429614879015,97,0.105072,0.120383,0.100264,64
1429614879042,97,0.0938437,0.108121,0.0862288,52
1429614879083,97,0.0567081,0.0604173,0.0310833,44
1429614879127,97,0.0149553,0.00584295,-0.0283405,41
1429614879142,97,-0.0132759,-0.0334946,-0.0639439,42
1429614879183,97,-0.0223913,-0.0481364,-0.0600194,43
1429614879225,97,-0.018544,-0.0413551,-0.0362281,42
1429614879271,97,-0.0116143,-0.0246477,-0.0164404,38
1429614879283,97,-0.00972997,-0.00923827,-0.0180601,38
1429614879329,97,-0.0160963,-0.00376372,-0.0407902,31
1429614879343,97,-0.024931,-0.00488385,-0.0625322,33
1429614879388,97,-0.0313206,-0.0080894,-0.0747822,50
1429614879410,97,-0.0582379,-0.0374065,-0.0848109,60
1429614879451,97,-0.0701817,-0.0572423,-0.0619259,75
1429614879493,97,-0.0516866,-0.0529943,-0.00111906,77
1429614879534,97,-0.000838943,-0.0179325,0.0842937,68
1429614879578,97,0.0802019,0.049821,0.1786,49
1429614879590,97,0.169448,0.130704,0.257889,44
1429614879631,97,0.227732,0.190236,0.290023,36
