1429094577577,121,0.0117038,0.0226077,0.0466097,36
1429094577604,121,0.000824106,0.0119655,0.0250237,59
1429094577642,121,-0.00457428,0.0107305,0.0173137,46
1429094577675,121,-0.00442016,0.017914,0.0224248,30
1429094577707,121,7.38216e-06,0.0314482,0.0422411,24
1429094577742,121,0.000373129,0.0398721,0.0542866,8
1429094577775,121,-0.00241715,0.0411885,0.0590233,30
1429094577805,121,-0.0070908,0.0332358,0.0463451,53
1429094577842,122,-0.012852,0.0222904,0.0269831,32
1429094577875,122,-0.0156393,0.0127025,0.00968793,20
1429094577905,122,-0.0171732,0.00635259,-0.000961847,17
1429094577942,122,-0.0157451,0.0030377,-0.00422667,10
1429094577975,122,-0.017945,-0.00219189,-0.0125914,32
1429094578005,122,-0.0229402,-0.0114234,-0.0273486,57
1429094578042,122,-0.0236052,-0.0180874,-0.0366172,40
1429094578075,122,-0.0167435,-0.0199684,-0.033215,28
1429094578104,122,-0.00643972,-0.0164175,-0.0199437,26
1429094578142,122,0.00381771,-0.0130735,-0.00789737,21
1429094578175,122,0.00815578,-0.0100382,-0.00214982,54
1429094578204,122,0.00960176,-0.00824044,-0.00231999,69
1429094578243,122,0.0081945,-0.00591651,-0.00737564,49
1429094578273,122,0.00740154,-0.00223335,-0.00894588,41
1429094578304,122,0.00738637,0.000190032,-0.00726473,37
1429094578343,122,0.00665174,0.00222903,-0.000114194,29
1429094578372,122,0.00174862,-0.0025888,-0.00063519,72
1429094578404,123,-0.00536498,-0.0125588,-0.0141158,69
1429094578443,123,-0.0155805,-0.0269518,-0.0432686,48
1429094578479,123,-0.0199839,-0.0340818,-0.0612036,31
1429094578504,123,-0.0188353,-0.0335931,-0.0660395,24
1429094578543,123,-0.00960987,-0.0191716,-0.0442242,18
1429094578573,123,0.0028911,-0.00294137,-0.011253,59
1429094578604,123,0.0111061,0.00753361,0.0125322,54
1429094578642,123,0.0170543,0.00850288,0.0217696,37
1429094578672,123,0.0142372,-0.00292562,0.00477825,25
1429094578705,123,0.00624817,-0.0165644,-0.0176841,18
1429094578741,123,0.00072926,-0.0213642,-0.0272096,13
1429094578772,123,0.00177622,-0.0132614,-0.0128299,52
1429094578804,123,0.00788586,0.00641363,0.0233106,49
1429094578843,123,0.010659,0.0209015,0.0507154,33
1429094578872,123,0.00981815,0.028603,0.0645645,28
1429094578904,123,0.0102463,0.0306573,0.0650647,22
1429094578946,123,0.0125939,0.0311025,0.0581266,21
1429094578972,123,0.0157603,0.0326328,0.050002,52
1429094579004,123,0.01325,0.0321135,0.0389722,49
1429094579040,123,0.00670816,0.0268373,0.0287773,29
1429094579072,123,-0.000114294,0.0192332,0.0202649,20
1429094579105,123,-0.0120569,0.000390768,-0.00430987,16
1429094579140,123,-0.0158424,-0.0140792,-0.0236776,15
1429094579172,123,-0.0208949,-0.0319053,-0.0530022,52
1429094579204,123,-0.0236959,-0.0421748,-0.0715603,55
1429094579245,123,-0.0194672,-0.039983,-0.0689324,33
1429094579278,123,-0.0151232,-0.0303035,-0.0554363,28
1429094579306,123,-0.00406753,-0.00698967,-0.0185464,24
1429094579340,123,0.00597977,0.0158121,0.0164483,14
1429094579372,123,0.00731399,0.0254398,0.0313954,36
1429094579406,122,0.00389026,0.0223865,0.0233527,51
1429094579440,122,-0.00275773,0.010289,0.00139468,39
1429094579472,122,-0.00617831,-0.00138198,-0.015608,26
1429094579506,122,-0.00313995,-0.00279646,-0.0143644,25
1429094579540,122,0.00611323,0.00555767,0.00779258,20
1429094579573,122,0.0115627,0.0102245,0.0263442,14
1429094579606,122,0.0121184,0.00955231,0.0313364,36
1429094579640,120,0.0126798,0.00654283,0.0322696,50
1429094579672,120,0.00719956,-0.00650159,0.0115731,38
1429094579706,120,0.000739064,-0.0167568,-0.00670283,26
1429094579740,120,-0.00105715,-0.0186623,-0.0116118,26
1429094579772,120,-0.00206844,-0.0172258,-0.0108618,24
1429094579806,120,0.00023797,-0.00971728,-0.00390319,20
1429094579840,120,0.00145209,-0.00352872,-0.00216885,53
1429094579872,120,-5.2296e-06,-0.00111112,-0.006904,58
1429094579913,120,-0.000832106,-1.68934e-05,-0.0117255,40
1429094579954,120,-0.00205293,0.00376518,-0.00653957,35
1429094579995,120,0.00240535,0.0121508,0.0086696,26
1429094580037,120,0.00319602,0.0164378,0.0157057,32
1429094580079,120,0.00128461,0.0166166,0.01408,60
1429094580120,120,-0.00436005,0.00574821,-0.00285925,40
1429094580162,120,-0.0144726,-0.0137256,-0.0340565,31
1429094580204,120,-0.0221477,-0.0287583,-0.0549141,25
1429094580245,120,-0.0220858,-0.0325958,-0.0552542,23
1429094580286,120,-0.0127102,-0.0193852,-0.0283318,64
1429094580328,119,-0.00435573,-0.00887888,-0.00901642,53
1429094580369,119,0.0109632,0.0120126,0.0260686,41
1429094580410,119,0.0211482,0.025026,0.0466653,36
1429094580451,119,0.0215983,0.0278561,0.047498,27
1429094580493,119,0.0139102,0.0250786,0.0393049,58
1429094580534,117,-0.000251336,0.0165095,0.0201124,68
1429094580576,117,-0.00818951,0.0101867,0.00799597,45
1429094580617,117,-0.00886802,0.00701188,0.00388499,35
1429094580658,117,0.0011048,0.0098923,0.0112932,24
1429094580699,117,0.0177293,0.0200752,0.0312409,16
1429094580741,117,0.0287037,0.025025,0.0448627,60
1429094580785,115,0.0292918,0.0276829,0.0522703,53
1429094580796,115,0.01754,0.0212954,0.0448276,47
1429094580838,115,0.00397265,0.0135802,0.0322357,40
1429094580879,115,-0.0135865,-0.0072824,0.0023195,33
1429094580920,115,-0.0201141,-0.024726,-0.0253264,25
1429094580962,115,-0.0193697,-0.0375182,-0.0452329,59
1429094581005,113,-0.0140581,-0.0410047,-0.0556614,71
1429094581046,113,-0.0105754,-0.0392911,-0.0591546,51
1429094581087,113,-0.0105676,-0.0343065,-0.059519,45
1429094581128,113,-0.0122593,-0.0280391,-0.0596107,34
1429094581169,113,-0.0160687,-0.022232,-0.0580903,29
1429094581211,113,-0.015669,-0.0137261,-0.0453369,75
1429094581252,112,-0.00803753,-0.000268541,-0.0123565,66
1429094581294,112,9.01589e-05,0.00732185,0.0183571,48
1429094581336,112,0.00360799,0.00841234,0.0330621,42
1429094581377,112,0.00341181,0.00317571,0.0270651,29
1429094581418,112,-0.00100699,-0.00424448,0.00326358,60
1429094581459,111,0.00318497,-0.000790801,-0.00482985,81
1429094581501,111,0.0145497,0.0183531,0.0171021,57
1429094581512,111,0.0288008,0.0421679,0.0538985,52
1429094581553,111,0.0342373,0.055247,0.0841668,42
1429094581564,111,0.0212026,0.0379881,0.0622901,35
1429094581605,111,0.00203157,0.00798212,0.0149569,34
1429094581617,111,-0.0131651,-0.0226992,-0.0377815,51
1429094581658,111,-0.0159448,-0.0362613,-0.0626366,86
1429094581669,110,-0.0076541,-0.0262352,-0.0487168,79
1429094581710,110,0.00163392,-0.0100763,-0.0179841,54
1429094581722,110,0.00116716,0.00250806,0.0115203,49
1429094581763,110,-0.00821102,0.00439583,0.0187014,37
1429094581775,110,-0.0198143,-0.005035,0.000547259,31
1429094581816,110,-0.0226761,-0.00930551,-0.0133429,40
1429094581841,110,-0.0143678,-0.00779058,-0.0180895,80
1429094581872,110,-0.00461042,-0.00514948,-0.0187709,75
1429094581906,110,0.00146542,-0.00349045,-0.0153072,52
1429094581940,110,0.0053615,-0.000592146,-0.00968921,41
1429094581981,110,0.00717648,0.00236143,-0.00474183,29
1429094582008,110,0.0101968,0.00788605,0.00280049,23
1429094582049,110,0.0107787,0.00915281,0.00380825,75
1429094582073,110,0.00650015,0.00855314,0.00418431,80
1429094582106,110,0.00148136,0.00277413,-0.00142174,60
1429094582140,110,-0.00720972,-0.00968761,-0.0184272,44
1429094582174,110,-0.0079142,-0.0149105,-0.0232375,38
1429094582208,110,-0.00183531,-0.0105024,-0.0110019,29
1429094582240,110,0.00981004,0.0057877,0.0227388,59
1429094582274,110,0.0159148,0.0219282,0.0581382,91
1429094582304,111,0.0127604,0.0260387,0.074192,72
1429094582340,111,0.00667659,0.0162685,0.0625754,44
1429094582374,111,0.00255655,0.000807744,0.0336888,35
1429094582408,111,0.00494518,-0.00407904,0.012572,23
1429094582441,111,0.00503469,-0.00782163,-0.00661536,31
1429094582474,111,-0.000550995,-0.0132884,-0.0294517,88
1429094582505,111,-0.00856267,-0.0168339,-0.0453694,82
1429094582543,111,-0.0109205,-0.0122917,-0.0442579,51
1429094582575,111,-0.00700383,-0.00201271,-0.0294251,42
1429094582608,111,0.000537773,0.0112437,-0.00420999,31
1429094582642,111,-0.000746356,0.0128051,0.000946275,18
1429094582675,111,-0.0119562,0.000955903,-0.0154769,49
1429094582704,111,-0.0230941,-0.0123873,-0.0351075,79
1429094582745,111,-0.0291397,-0.0245032,-0.0491212,53
1429094582775,111,-0.022121,-0.0278375,-0.0431586,37
1429094582810,111,-0.00354241,-0.0211204,-0.0189944,27
1429094582843,111,0.0180655,-0.00950883,0.0118289,14
1429094582873,111,0.0299262,0.000813608,0.0304933,6
1429094582904,111,0.0325425,0.0112973,0.0366597,0
1429094582948,111,0.0210479,0.0205974,0.0285154,0
1429094582972,111,0.00578806,0.0236082,0.0113068,0
1429094583010,111,-0.0027146,0.02752,0.00597619,44
1429094583043,111,-0.00972696,0.0221886,0.00635624,61
1429094583072,111,-0.00760922,0.0203817,0.0199272,43
1429094583104,111,-0.00267277,0.0174753,0.0355486,36
1429094583142,111,0.00292973,0.0184668,0.0466009,28
1429094583172,111,0.00696986,0.0186778,0.0444825,20
1429094583209,111,0.00481461,0.00852996,0.0186752,11
1429094583243,111,-0.00021389,-0.00417134,-0.0167437,10
1429094583272,111,-0.00757806,-0.018287,-0.0438503,50
1429094583304,111,-0.0135637,-0.0257503,-0.0528703,60
1429094583340,111,-0.01255,-0.0275166,-0.0441893,44
1429094583372,111,-0.00732565,-0.0185465,-0.0166812,32
1429094583410,111,0.00387853,-0.00785031,0.0145016,24
1429094583440,111,0.010156,-0.00494599,0.0297772,15
1429094583472,111,0.0133434,-0.00637321,0.0300922,9
1429094583504,111,0.0112853,-0.0129502,0.0127922,40
1429094583543,111,0.0122522,-0.00741904,0.0028351,64
1429094583573,111,0.00645452,-0.0089904,-0.0192559,53
1429094583611,111,-0.00376782,-0.0132968,-0.0377692,40
1429094583641,111,-0.0149647,-0.0165231,-0.0451419,37
1429094583672,111,-0.0247459,-0.0130424,-0.0382566,28
1429094583706,111,-0.025697,0.000890108,-0.0122519,26
1429094583740,111,-0.0146799,0.0192539,0.0165686,65
1429094583772,112,-0.00147043,0.0326046,0.0369036,69
1429094583811,112,0.00910936,0.0283942,0.0322733,52
1429094583840,112,0.00741126,0.00876107,0.00360285,40
1429094583872,112,3.69405e-05,-0.0151044,-0.0276211,31
1429094583906,112,-0.00466002,-0.0289106,-0.0401966,22
1429094583940,112,-0.00500274,-0.0302269,-0.0313181,34
1429094583972,112,0.00041298,-0.0183153,-0.00421442,73
1429094584008,112,0.014337,0.0132616,0.0450022,65
1429094584040,112,0.0226267,0.0398629,0.0761275,46
1429094584073,112,0.0180108,0.0492306,0.0706,40
1429094584114,112,0.00959607,0.0459186,0.0428385,27
1429094584155,112,-0.00182403,0.0273129,0.00445616,23
1429094584195,112,-0.00455022,0.00865619,-0.0229681,72
1429094584237,111,-0.00147841,-0.00381037,-0.0313762,63
1429094584279,111,0.00465101,-0.00965831,-0.0261288,43
1429094584320,111,0.00472531,-0.0119337,-0.0148574,34
1429094584362,111,-0.00265757,-0.0194333,-0.0125019,19
1429094584404,111,-0.00423359,-0.0236544,-0.0121981,47
1429094584446,111,-0.00474099,-0.024047,-0.0134674,71
1429094584487,111,0.000672408,-0.015765,-0.00885185,50
1429094584528,111,0.00433031,-0.00460587,-0.00236689,37
1429094584570,111,0.00135328,-0.00078746,-0.00558933,25
1429094584611,111,-0.00902418,-0.00738222,-0.0212405,39
1429094584653,111,-0.0195617,-0.0153386,-0.0348399,82
1429094584694,110,-0.0190181,-0.0122169,-0.0205467,64
1429094584736,110,-0.00599626,0.00823965,0.0199185,40
1429094584777,110,0.0121373,0.0299206,0.0625491,28
1429094584818,110,0.0226732,0.031635,0.0673853,16
1429094584859,110,0.019816,0.0207596,0.0461229,57
1429094584901,110,0.00827941,-0.000995836,0.00422897,75
1429094584942,110,-0.0040799,-0.0166104,-0.0269185,54
1429094584983,110,-0.0187296,-0.0323312,-0.0507768,41
1429094585025,110,-0.0187531,-0.0277039,-0.0397226,27
1429094585066,110,-0.0122739,-0.0140754,-0.0109062,23
1429094585112,110,-0.0036276,0.00490241,0.0177481,80
1429094585123,110,0.0024034,0.013865,0.0264779,77
1429094585164,110,0.00136721,0.00968548,0.0153977,50
1429094585208,110,-0.00794753,-0.0100949,-0.0216904,34
1429094585220,110,-0.0115944,-0.016986,-0.038212,27
1429094585262,110,-0.00652285,-0.00864236,-0.0346858,12
1429094585303,110,0.00640608,0.00765713,-0.0115238,39
1429094585344,110,0.0162306,0.0202656,0.010105,63
1429094585386,110,0.0207752,0.0229917,0.0225585,40
1429094585427,110,0.0221944,0.0188818,0.0208079,26
1429094585469,110,0.0216978,0.0143018,0.0130289,15
1429094585510,110,0.0189273,0.0166738,0.0105864,12
1429094585552,110,0.00975623,0.0176971,0.00598227,57
1429094585563,110,-0.00795145,0.00753849,-0.00642273,55
1429094585605,110,-0.025502,-0.00793779,-0.015862,38
1429094585645,110,-0.0292427,-0.0194053,-0.0116724,31
1429094585687,110,-0.0263819,-0.0233398,0.000474337,18
1429094585698,110,-0.0141874,-0.0212511,0.0131879,10
1429094585740,110,-0.00841105,-0.0196379,0.0110807,45
1429094585751,110,-0.00497745,-0.0213349,-0.0114983,58
1429094585792,110,-0.00322854,-0.0180167,-0.0272989,48
1429094585804,110,-0.000625743,-0.00917413,-0.0297735,40
1429094585845,110,0.00335228,0.00221127,-0.0151698,26
1429094585887,110,0.0115019,0.0219077,0.0177565,18
1429094585898,110,0.0174127,0.0355635,0.0457684,11
1429094585939,110,0.0179738,0.0328236,0.0449437,41
1429094585950,110,0.0110822,0.0171135,0.0244219,57
1429094585992,111,0.000468932,-0.00539683,-0.0118863,52
1429094586008,111,-0.00358522,-0.0173261,-0.0282766,41
1429094586049,111,0.000974755,-0.0154908,-0.0215739,29
1429094586073,111,0.0128365,-0.00274213,0.00403788,23
1429094586104,111,0.0193295,0.0036503,0.0155608,14
1429094586141,111,0.0252259,0.0106086,0.0283469,27
1429094586174,111,0.0189764,0.00678014,0.0204662,67
1429094586216,111,0.0124673,0.013686,0.0271026,56
1429094586241,111,0.00113511,0.018055,0.0360056,44
1429094586275,111,-0.00930879,0.0188543,0.0411704,39
1429094586304,111,-0.0225615,0.00939136,0.0257921,32
1429094586346,111,-0.032563,-0.00865834,-0.0106024,24
1429094586374,111,-0.0395468,-0.0322702,-0.0605873,62
1429094586408,112,-0.0371889,-0.044255,-0.0935852,64
1429094586442,112,-0.0319164,-0.051259,-0.104631,45
1429094586472,112,-0.0210466,-0.0362861,-0.0847038,38
1429094586508,112,-0.00315786,-0.00750457,-0.0399581,27
1429094586542,112,0.0178305,0.0287495,0.0113646,17
1429094586572,112,0.0269251,0.0540112,0.0390197,42
1429094586608,112,0.0226512,0.0526772,0.04337,72
1429094586643,112,0.0233532,0.0485158,0.0426182,55
1429094586673,112,0.0282784,0.0354723,0.0408291,44
1429094586709,112,0.0386994,0.025874,0.0379366,35
1429094586742,112,0.0308437,-0.0136349,0.0127322,23
1429094586772,112,0.00778161,-0.0611064,-0.011125,30
1429094586808,112,-0.0207962,-0.0981701,-0.0359768,74
1429094586843,112,-0.0486414,-0.131823,-0.0476494,65
1429094586872,112,-0.0546739,-0.120578,-0.0383042,49
1429094586910,112,-0.0498931,-0.0727367,-0.0212851,39
1429094586943,112,-0.0363212,-0.00336374,0.00195492,27
1429094586972,112,-0.0181464,0.0737437,0.0281603,14
1429094587010,112,0.0319633,0.154373,0.0706276,36
1429094587042,112,0.127703,0.23239,0.124463,72
1429094587072,112,0.247697,0.27437,0.164041,58
1429094587110,112,0.266708,0.23848,0.140828,38
1429094587140,112,0.199158,0.160451,0.0698092,28
1429094587173,112,-0.00493286,0.0205468,-0.0583611,15
1429094587210,112,-0.262068,-0.100197,-0.156804,5
1429094587240,112,-0.338041,-0.131008,-0.158599,22
1429094587272,112,-0.253576,-0.0981542,-0.0869589,57
1429094587310,111,-0.0973537,-0.0467543,-0.00184642,49
1429094587340,111,0.0259279,-0.0610098,0.00400715,33
1429094587372,111,0.0266726,-0.11382,-0.0344417,28
1429094587411,111,-0.0319774,-0.172127,-0.0958171,18
1429094587440,111,-0.0147849,-0.167364,-0.0870071,11
1429094587472,111,0.0467734,-0.103723,-0.0357136,36
1429094587511,111,0.160018,0.0220196,0.0711036,54
1429094587540,111,0.253781,0.150555,0.150117,40
1429094587574,111,0.336684,0.235159,0.196188,26
1429094587610,111,0.328575,0.227853,0.170905,19
1429094587640,111,0.151891,0.102907,0.0682544,9
1429094587672,111,-0.0548032,-0.0347225,-0.0457877,17
1429094587710,111,-0.250008,-0.16117,-0.166454,55
1429094587740,111,-0.300788,-0.174023,-0.18985,50
1429094587772,111,-0.242713,-0.11108,-0.147854,37
1429094587808,111,-0.167158,-0.0214649,-0.064558,31
1429094587840,111,-0.0408536,0.0650288,0.0359739,21
1429094587872,111,-0.0901255,0.0266664,0.0439364,13
1429094587908,111,-0.161232,-0.0586296,-0.00310424,47
1429094587940,110,-0.218337,-0.146701,-0.0638833,59
1429094587972,110,-0.0963535,-0.12531,-0.0373354,45
1429094588008,110,0.0618948,-0.0611583,0.0167844,38
1429094588040,110,0.159127,0.0273426,0.0752531,31
1429094588072,110,0.164086,0.0676684,0.0872128,19
1429094588108,110,0.128216,0.123144,0.0993974,34
1429094588140,110,0.0480077,0.134953,0.081483,61
1429094588172,111,-0.0481861,0.0935213,0.0265258,48
1429094588208,111,-0.0974962,0.0399036,-0.0308375,35
1429094588240,111,-0.0823956,0.00791631,-0.0634219,28
1429094588281,111,-0.0167517,0.00494106,-0.0715482,19
1429094588322,111,0.0724855,0.022731,-0.0624779,52
1429094588363,111,0.149788,0.0434141,-0.0432755,59
1429094588405,111,0.160763,0.024086,-0.0332411,37
1429094588446,111,0.155196,0.0134066,-0.00662365,30
1429094588487,111,0.15051,0.0342145,0.0481258,25
1429094588529,111,0.0736683,0.0600253,0.0944616,48
1429094588570,111,0.0665121,0.115795,0.147023,66
1429094588611,111,0.112049,0.1547,0.174924,46
1429094588653,111,0.168885,0.163673,0.183191,37
1429094588694,111,0.184363,0.121086,0.150017,26
1429094588736,111,0.0694618,0.0164984,0.0634364,40
1429094588777,112,-0.125767,-0.11427,-0.0598858,66
1429094588822,112,-0.333577,-0.261178,-0.19889,44
1429094588833,112,-0.420324,-0.335031,-0.267299,38
1429094588874,112,-0.32327,-0.291772,-0.228003,29
1429094588915,112,-0.148305,-0.156217,-0.112063,18
1429094588956,112,-0.0149665,-0.0132238,-0.00713613,47
1429094588997,113,0.0111111,0.0614858,0.0307381,60
1429094589042,113,-0.0916648,-0.0179798,-0.0533604,40
1429094589057,113,-0.159762,-0.120066,-0.145605,36
1429094589069,113,-0.141188,-0.165794,-0.181955,32
1429094589110,113,0.00698117,-0.08353,-0.0843394,21
1429094589151,113,0.160241,0.0381467,0.0564449,30
1429094589193,113,0.199784,0.128888,0.160828,70
1429094589234,114,0.196416,0.162165,0.182995,53
1429094589275,114,0.198167,0.192341,0.194757,42
1429094589316,114,0.133194,0.156511,0.135472,35
1429094589357,114,0.0578216,0.130528,0.091891,23
1429094589399,114,-0.0457045,0.0968842,0.0459748,63
1429094589441,114,-0.108319,0.0933381,0.035428,62
1429094589482,114,-0.108077,0.121086,0.0533779,46
1429094589524,114,-0.00698256,0.158861,0.0816009,39
1429094589567,114,0.140222,0.172071,0.109849,26
1429094589578,114,0.285847,0.122591,0.104007,31
1429094589620,114,0.240867,-0.0480495,-0.00936029,70
1429094589661,115,0.0627205,-0.251621,-0.167875,63
1429094589702,115,-0.178577,-0.401275,-0.319776,43
1429094589743,115,-0.261985,-0.381707,-0.317895,34
1429094589784,115,-0.188975,-0.210758,-0.171984,23
1429094589825,115,0.0531181,0.0706664,0.11671,61
1429094589866,115,0.188449,0.242933,0.307973,64
1429094589908,115,0.224864,0.297471,0.362027,41
1429094589919,115,0.0668612,0.142236,0.166852,38
1429094589961,115,-0.222223,-0.108281,-0.141746,29
1429094589973,115,-0.404703,-0.2689,-0.367018,22
1429094590014,115,-0.40975,-0.284652,-0.406105,35
1429094590026,115,-0.267424,-0.164803,-0.27268,53
1429094590067,115,-0.054285,0.00269836,-0.065512,64
1429094590078,115,0.116355,0.128207,0.10329,56
1429094590119,115,0.163623,0.146209,0.145512,37
1429094590130,115,0.19409,0.107112,0.123451,33
1429094590172,115,0.181833,0.0331065,0.054766,24
1429094590183,115,0.163843,-0.0175165,0.0202559,18
1429094590225,115,0.134405,-0.0183471,0.0265132,38
1429094590240,115,0.0778789,-0.0217621,0.0348069,66
1429094590281,114,0.0193215,-0.00206604,0.0796096,62
1429094590308,114,-0.0484134,0.00304985,0.0952462,46
1429094590349,114,-0.103056,0.0146822,0.085679,38
1429094590373,114,-0.0762479,0.048427,0.0755481,31
1429094590408,114,-0.00289068,0.0941707,0.0674904,22
1429094590449,114,0.078788,0.122102,0.0549227,60
1429094590473,114,0.0810923,0.100479,0.0123358,77
1429094590508,114,-0.00911532,0.0277062,-0.0609019,56
1429094590542,114,-0.147252,-0.0768228,-0.171633,43
1429094590574,114,-0.236048,-0.126984,-0.190076,38
1429094590608,114,-0.169975,-0.0814063,-0.080474,28
1429094590639,114,-0.014939,-0.00218943,0.0612712,36
1429094590673,114,0.11915,0.0478227,0.144419,88
1429094590708,114,0.156902,0.0176774,0.09283,73
1429094590749,114,0.107639,-0.0645178,-0.0255297,51
1429094590774,114,0.0952394,-0.0695963,-0.0211551,45
1429094590808,114,0.0374137,-0.0567019,0.0135452,34
1429094590842,114,0.0319263,0.00476816,0.0993537,39
1429094590872,114,-0.0310787,0.0049774,0.0640677,78
1429094590907,114,-0.126645,-0.0392518,-0.0760394,73
1429094590939,114,-0.217389,-0.08795,-0.242055,51
1429094590973,114,-0.20126,-0.0882104,-0.305278,38
1429094591009,114,-0.0460321,-0.00908674,-0.206601,24
1429094591039,114,0.150676,0.0954235,-0.0138498,16
1429094591072,114,0.275837,0.179077,0.183598,55
1429094591108,114,0.228186,0.177991,0.251193,70
1429094591139,114,0.0779964,0.0964119,0.174615,45
1429094591172,114,-0.0793229,0.0108021,0.0690529,32
1429094591210,114,-0.194504,-0.0492764,-0.0178527,24
1429094591241,114,-0.186095,-0.0677318,-0.0457695,12
1429094591272,114,-0.140205,-0.0782415,-0.054405,34
1429094591311,114,-0.0218854,-0.0600756,-0.01905,57
1429094591340,114,0.0586233,-0.0795097,-0.0350737,37
1429094591372,114,0.0851065,-0.106989,-0.0863127,24
1429094591411,114,0.0854465,-0.128629,-0.121784,17
1429094591440,114,0.0624435,-0.104367,-0.118231,7
1429094591472,114,0.0600738,-0.0350726,-0.0281901,14
1429094591510,114,0.0115645,0.00408837,0.0232604,51
1429094591540,114,-0.0436121,0.0353394,0.0498959,47
1429094591573,114,-0.00991964,0.0959338,0.128742,30
1429094591610,114,0.0374743,0.173555,0.244774,22
1429094591640,114,0.116144,0.241286,0.349927,16
1429094591673,114,0.112644,0.243577,0.329018,8
1429094591710,114,0.0717436,0.174519,0.19331,38
1429094591739,114,0.0168737,0.0899881,0.0207794,50
1429094591772,114,-0.0766875,-0.0236916,-0.163708,34
1429094591811,114,-0.144808,-0.100194,-0.270692,24
1429094591840,114,-0.17418,-0.149673,-0.312527,21
1429094591872,114,-0.173663,-0.184412,-0.296475,12
1429094591911,114,-0.132442,-0.183591,-0.226186,20
1429094591940,114,-0.0449676,-0.155172,-0.130847,51
1429094591972,114,0.029604,-0.10634,-0.0444831,44
1429094592010,114,0.0758178,-0.0489944,0.00622183,31
1429094592040,114,0.0498069,0.00646852,0.0205216,26
1429094592074,114,-0.0567145,0.000151362,-0.0327255,20
1429094592110,114,-0.114376,0.0149787,-0.00942095,14
1429094592139,114,-0.105852,0.0236924,0.0498987,41
1429094592172,114,0.0435571,0.0919064,0.209808,48
1429094592207,114,0.169076,0.127429,0.280053,34
1429094592240,114,0.2259,0.134436,0.257327,27
1429094592272,114,0.190898,0.0741318,0.10349,23
1429094592310,114,0.102134,0.0179597,-0.0342126,15
1429094592340,114,-0.0100591,-0.031726,-0.132609,31
1429094592371,114,-0.0755542,-0.0459341,-0.129062,54
1429094592408,114,-0.102631,-0.0535586,-0.092601,38
1429094592439,114,-0.129444,-0.0872501,-0.0956791,30
1429094592481,114,-0.16003,-0.121422,-0.125419,25
1429094592522,114,-0.123547,-0.113558,-0.125156,18
1429094592564,114,-0.045087,-0.0633307,-0.0935933,46
1429094592606,114,0.0769197,0.0339693,0.0213272,48
1429094592647,114,0.170936,0.115209,0.124363,32
1429094592689,114,0.239613,0.167577,0.235297,28
1429094592732,114,0.257291,0.18554,0.309843,21
1429094592774,114,0.223923,0.180601,0.339405,30
1429094592815,114,0.122144,0.138487,0.271858,57
1429094592856,114,-0.022139,0.0568378,0.100237,40
1429094592897,114,-0.162191,-0.0310906,-0.104302,35
1429094592938,114,-0.178856,-0.0687138,-0.21204,31
1429094592980,114,-0.0975798,-0.0555424,-0.191456,24
1429094593021,114,0.00551861,-0.0307761,-0.128081,57
1429094593062,113,0.0438573,-0.030349,-0.0796928,50
1429094593105,113,-0.0345532,-0.0847031,-0.127708,38
1429094593147,113,-0.149839,-0.14285,-0.179623,35
1429094593190,113,-0.232339,-0.189249,-0.225578,27
1429094593232,113,-0.202727,-0.169867,-0.172591,47
1429094593274,112,-0.0720295,-0.0818908,-0.0417694,60
1429094593317,112,0.09868,0.0288149,0.12223,41
1429094593358,112,0.200197,0.118274,0.224184,34
1429094593400,112,0.205474,0.134413,0.233007,27
1429094593441,112,0.136121,0.117648,0.175801,32
1429094593485,112,-0.00133737,0.0418954,0.0459284,63
1429094593496,112,-0.107996,-0.0121509,-0.0563067,57
1429094593538,112,-0.161386,-0.0605606,-0.144391,42
1429094593550,112,-0.124427,-0.0665385,-0.172283,40
1429094593591,112,-0.0660303,-0.0666504,-0.190149,34
1429094593632,112,0.00934879,-0.0285745,-0.136605,24
1429094593678,112,0.0600247,0.0150719,-0.05005,44
1429094593690,112,0.122022,0.0663419,0.070998,61
1429094593731,112,0.122319,0.0774264,0.128089,50
1429094593773,112,0.109351,0.0531513,0.125272,39
1429094593814,112,0.00817903,-0.0172893,0.0128837,32
1429094593856,112,-0.0609615,-0.0555678,-0.0369941,22
1429094593897,112,-0.0980581,-0.0371279,-0.00321333,37
1429094593938,111,-0.0717458,0.0454984,0.138666,53
1429094593980,111,-0.0238208,0.118,0.259267,37
1429094594021,111,0.0422623,0.146721,0.29077,31
1429094594063,111,0.0745826,0.0863187,0.162406,23
1429094594105,111,0.0747028,-0.0150975,-0.0397477,18
1429094594116,111,0.0468447,-0.100355,-0.218519,25
1429094594158,111,-0.00293511,-0.133876,-0.296408,51
1429094594199,111,-0.050423,-0.111741,-0.254738,36
1429094594241,111,-0.0978756,-0.0528634,-0.14917,29
1429094594253,111,-0.0981193,0.0282511,0.00864568,28
1429094594294,111,-0.0554982,0.0933771,0.138988,21
1429094594336,111,-0.00355256,0.106896,0.190662,15
1429094594377,111,0.0645341,0.0744493,0.169622,48
1429094594420,110,0.081502,-0.00841443,0.0446935,43
1429094594431,110,0.0525418,-0.0751724,-0.0578693,37
1429094594473,110,-0.0147637,-0.107406,-0.125839,32
1429094594485,110,-0.0645637,-0.0894957,-0.129426,31
1429094594526,110,-0.0818213,-0.0596084,-0.114138,24
1429094594567,110,-0.038717,-0.00360531,-0.0535096,19
1429094594578,110,0.0521235,0.0522234,0.0223415,26
1429094594620,110,0.123751,0.0949812,0.097999,57
1429094594661,109,0.141977,0.0838042,0.113937,43
1429094594702,109,0.061784,0.0181821,0.0419491,37
1429094594713,109,-0.0601032,-0.0737655,-0.0903387,36
1429094594754,109,-0.146714,-0.117873,-0.171554,27
1429094594766,109,-0.0940269,-0.0535666,-0.0625644,22
1429094594807,109,0.0803743,0.0751654,0.167274,34
1429094594819,109,0.25318,0.185545,0.374108,47
1429094594860,108,0.291816,0.200962,0.398903,54
1429094594872,108,0.140901,0.0961969,0.199464,47
1429094594913,108,-0.119983,-0.0674007,-0.123986,40
1429094594955,108,-0.373162,-0.204483,-0.405237,34
1429094594972,108,-0.398132,-0.213991,-0.445661,30
1429094595013,108,-0.303759,-0.170524,-0.358523,26
1429094595054,108,-0.0476704,-0.0488168,-0.124558,63
1429094595072,108,0.0849737,0.0107599,0.00299662,65
1429094595113,107,0.159533,0.053301,0.0786903,51
1429094595155,107,0.139608,0.0455998,0.0668211,42
1429094595173,107,0.118244,0.046817,0.0702685,40
1429094595214,107,0.0453811,0.0236393,0.0376878,31
1429094595241,107,-0.0194805,0.00818913,0.0183066,32
1429094595272,107,-0.062254,0.00372317,0.0355456,59
1429094595313,107,-0.0512274,0.0336075,0.104927,65
1429094595341,107,0.0248497,0.0761488,0.1907,52
1429094595372,107,0.12773,0.133916,0.277614,47
1429094595413,107,0.143071,0.127149,0.23308,40
1429094595439,107,0.0622379,0.0487507,0.0765386,35
1429094595472,107,-0.104971,-0.0822202,-0.159115,33
1429094595510,107,-0.266607,-0.206152,-0.368487,72
1429094595540,106,-0.258185,-0.199132,-0.363862,70
1429094595572,106,-0.112233,-0.0997205,-0.200394,56
1429094595610,106,0.136098,0.0515849,0.0543607,47
1429094595640,106,0.315463,0.153468,0.23581,40
1429094595672,106,0.392839,0.18445,0.301108,31
1429094595710,106,0.317847,0.133651,0.220186,28
1429094595739,106,0.0944858,0.033073,0.0499572,65
1429094595772,105,-0.109896,-0.0413863,-0.0790905,75
1429094595811,105,-0.217485,-0.0693407,-0.121691,60
1429094595839,105,-0.169975,-0.0398569,-0.0501241,50
1429094595872,105,-0.0980386,-0.0366935,-0.0185811,42
1429094595911,105,-0.00851525,-0.024437,0.0343622,37
1429094595940,105,-0.00677672,-0.0554397,0.00350324,31
1429094595971,105,-0.0653661,-0.0824146,-0.0507831,63
1429094596008,105,-0.188728,-0.133607,-0.180458,80
1429094596039,104,-0.251181,-0.133481,-0.228009,62
1429094596071,104,-0.229069,-0.0974243,-0.199003,52
1429094596110,104,-0.123516,-0.0369271,-0.110063,42
1429094596140,104,0.00747893,0.0152691,-0.019785,33
1429094596171,104,0.126105,0.0530898,0.048816,29
1429094596208,104,0.136238,0.0494627,0.0465049,73
1429094596239,104,0.177779,0.0838778,0.103974,74
1429094596272,104,0.226198,0.138512,0.189685,58
1429094596307,104,0.224637,0.17023,0.224241,45
1429094596339,104,0.195337,0.154215,0.197174,40
1429094596372,104,0.120312,0.0956221,0.125306,30
1429094596407,104,-0.0111257,0.012336,0.00981954,50
1429094596449,104,-0.123603,-0.0442857,-0.0464245,84
1429094596472,104,-0.153993,-0.0410268,-0.0156531,74
1429094596507,104,-0.137243,-0.0314168,0.0358248,52
1429094596540,104,-0.0987065,-0.0300355,0.0575282,40
1429094596572,104,-0.0477031,-0.0529579,0.028342,29
1429094596607,104,-0.0425206,-0.111559,-0.089277,19
1429094596639,104,-0.0119003,-0.111082,-0.142449,61
1429094596680,105,0.00522432,-0.0961521,-0.187839,77
1429094596722,105,0.0694963,0.000773772,-0.102307,51
1429094596763,105,0.11412,0.0637552,-0.0295216,38
1429094596805,105,0.0922146,0.0806151,0.0180682,24
1429094596846,105,0.0100747,0.0317632,0.00754698,21
1429094596887,105,-0.0594667,-0.0150936,-0.0040455,76
1429094596929,105,-0.101887,-0.0503072,-0.0274802,64
1429094596970,105,-0.0297678,-0.0119189,0.0106196,43
1429094597011,105,-0.0219142,-0.00743593,-0.0295621,33
1429094597053,105,0.0124037,0.0121124,-0.0113692,20
1429094597094,105,0.00956551,0.0260129,0.0199908,18
1429094597135,105,-0.0440711,-0.00122645,0.0138395,67
1429094597176,105,-0.00197825,0.0285014,0.109736,54
1429094597217,105,0.0165235,0.0447985,0.166603,37
1429094597259,105,0.0445412,0.0567913,0.182986,27
1429094597300,105,0.0129182,0.0175565,0.0802956,16
1429094597342,105,0.0037753,-0.0157552,-0.0254772,11
1429094597384,105,0.0541324,-0.00474028,-0.0668483,57
1429094597425,105,0.0869141,0.00696812,-0.0882699,51
1429094597466,105,0.0933363,0.0240168,-0.0907309,35
1429094597507,105,0.0410864,-0.000167438,-0.0979429,31
1429094597549,105,-0.0553848,-0.0732194,-0.139517,23
1429094597590,105,-0.167107,-0.147387,-0.172767,37
1429094597631,105,-0.280942,-0.198333,-0.204882,74
1429094597672,105,-0.28916,-0.182656,-0.175785,57
1429094597713,105,-0.20293,-0.105209,-0.10129,42
1429094597755,105,-0.0925531,-0.00803762,-0.00767807,33
1429094597796,105,0.07704,0.108144,0.127164,24
1429094597839,105,0.150943,0.183644,0.222137,66
1429094597853,105,0.196291,0.216077,0.276781,77
1429094597864,105,0.208393,0.172318,0.260125,74
1429094597905,105,0.193213,0.0905213,0.195403,50
1429094597946,105,0.190738,0.0439186,0.147285,37
1429094597988,105,0.163349,0.0265068,0.0856261,24
1429094598030,105,0.160581,0.0685317,0.0974766,21
1429094598072,105,0.133556,0.116229,0.129517,70
1429094598114,106,-0.0171752,0.050011,0.0297758,60
1429094598155,106,-0.134887,-0.0331273,-0.072682,40
1429094598196,106,-0.184659,-0.0922552,-0.135746,31
1429094598238,106,-0.198843,-0.125913,-0.177068,20
1429094598279,106,-0.202785,-0.123683,-0.203527,24
1429094598320,106,-0.208372,-0.142956,-0.242062,73
1429094598361,106,-0.194103,-0.154436,-0.256726,62
1429094598403,106,-0.150136,-0.159279,-0.243947,46
1429094598413,106,0.010077,-0.0578019,-0.0751535,43
1429094598455,106,0.200842,0.0599335,0.113947,32
1429094598466,106,0.360905,0.180015,0.288123,24
1429094598507,106,0.359028,0.189907,0.293961,27
1429094598519,106,0.233786,0.122184,0.186759,45
1429094598560,106,0.0230284,-0.0031664,-0.0160444,80
1429094598574,105,-0.140791,-0.121967,-0.200739,70
1429094598614,105,-0.182983,-0.152886,-0.256727,47
1429094598626,105,-0.153367,-0.107329,-0.195221,43
1429094598667,105,-0.0817066,-0.0169047,-0.0528544,32
1429094598678,105,-0.0305118,0.0763149,0.100051,27
1429094598720,105,0.045126,0.154571,0.229316,15
1429094598741,105,0.125411,0.185636,0.281006,37
1429094598774,105,0.179546,0.163011,0.255808,71
1429094598807,104,0.122153,0.0485086,0.11813,56
1429094598841,104,0.0464022,-0.0471151,-0.00124438,39
1429094598874,104,-0.00338899,-0.0729773,-0.0514041,31
1429094598908,104,0.0502392,0.0134951,0.0245693,23
1429094598948,104,0.0779699,0.103431,0.100494,12
1429094598974,104,0.0160825,0.134007,0.108041,41
1429094599008,104,-0.107185,0.0871135,0.0315876,76
1429094599041,104,-0.243275,-0.0287394,-0.1122,58
1429094599073,104,-0.269319,-0.125641,-0.205005,42
1429094599107,104,-0.224106,-0.19687,-0.263113,33
1429094599143,104,-0.124075,-0.191243,-0.218027,19
1429094599171,104,-0.0902259,-0.180359,-0.185561,13
1429094599207,104,-0.0882133,-0.153919,-0.149211,65
1429094599241,105,-0.1454,-0.162161,-0.171852,70
1429094599272,105,-0.159649,-0.165065,-0.174251,52
1429094599309,105,-0.142999,-0.143796,-0.140399,37
1429094599341,105,0.0171882,-0.0622475,-0.0155125,29
1429094599372,105,0.194672,0.0375432,0.126421,20
1429094599409,105,0.35559,0.142515,0.254321,53
1429094599441,105,0.422382,0.254372,0.354458,80
1429094599471,106,0.422793,0.337061,0.406029,64
1429094599509,106,0.349061,0.335149,0.352405,40
1429094599543,106,0.271862,0.315388,0.298555,35
1429094599571,106,0.126706,0.216928,0.171432,24
1429094599609,106,0.00023408,0.0965397,0.0310993,25
1429094599643,106,-0.138265,-0.00558423,-0.0907774,78
1429094599671,107,-0.266659,-0.080079,-0.18495,78
1429094599710,107,-0.310411,-0.112751,-0.207874,54
1429094599742,107,-0.308954,-0.126637,-0.179135,39
1429094599772,107,-0.321576,-0.197773,-0.212159,29
1429094599810,107,-0.170569,-0.182365,-0.135209,17
1429094599842,107,-0.0100288,-0.162522,-0.0727354,45
1429094599871,107,0.103566,-0.116452,-0.0189957,83
1429094599910,107,0.0734559,-0.110786,-0.0555332,64
1429094599954,107,-0.016358,-0.0683388,-0.0698866,40
1429094599971,107,-0.119889,-0.0331929,-0.0707867,34
1429094600011,107,-0.104747,-0.0157791,-0.0477572,30
1429094600039,107,-0.00407567,0.0256033,0.0239116,24
1429094600072,107,0.0520883,0.0212881,0.0365294,20
1429094600110,107,0.0431797,-0.002494,-0.00248848,15
1429094600139,107,-0.0349766,-0.0284645,-0.0711,11
1429094600176,107,-0.0572575,-0.0336844,-0.119038,11
1429094600212,107,-0.0232425,-0.0146969,-0.131855,24
1429094600240,107,0.142731,0.0692812,0.00111233,46
1429094600271,107,0.315795,0.170984,0.208634,68
1429094600310,107,0.414595,0.243882,0.388547,78
1429094600341,107,0.36086,0.266194,0.450574,75
1429094600371,107,0.161441,0.211223,0.365006,67
1429094600407,107,-0.143106,0.0243811,0.0848714,58
1429094600439,107,-0.353746,-0.155916,-0.179549,49
1429094600472,107,-0.373286,-0.244693,-0.292558,41
1429094600507,107,-0.237332,-0.208298,-0.242079,37
1429094600539,107,0.0299917,-0.0560675,-0.0436761,34
1429094600572,107,0.171201,0.0422554,0.0482787,30
1429094600607,107,0.234436,0.100991,0.0482401,25
1429094600639,107,0.156713,0.0584181,-0.0776462,21
1429094600671,107,-0.0201353,-0.048683,-0.241528,16
1429094600707,107,-0.193318,-0.14912,-0.351166,12
1429094600740,107,-0.26547,-0.156986,-0.28968,9
1429094600771,107,-0.22532,-0.0810534,-0.119321,10
1429094600807,107,-0.155208,0.0058137,0.0441539,24
1429094600839,107,-0.0806772,0.0676376,0.149551,47
1429094600880,107,-0.0417292,0.0840574,0.170955,75
1429094600922,107,0.0356049,0.0838331,0.165151,77
1429094600963,107,0.0532918,0.0538059,0.11877,66
1429094601004,107,0.0561603,0.00367661,0.0646556,57
1429094601046,107,0.0274476,-0.047686,0.00496321,44
1429094601087,107,-0.00178202,-0.082867,-0.0353426,40
1429094601129,107,0.0342095,-0.0643833,-0.00108372,34
1429094601171,107,0.115208,-0.00931394,0.0728996,29
1429094601212,107,0.216323,0.0482825,0.146668,21
1429094601253,107,0.190753,0.0487763,0.106781,17
1429094601294,107,0.0928643,0.0140149,-0.0041732,12
1429094601336,107,-0.0247693,-0.0272009,-0.113608,11
1429094601377,107,-0.10659,-0.0514063,-0.164226,22
1429094601419,107,-0.0970578,-0.011357,-0.102414,43
1429094601460,107,0.0216269,0.0866884,0.0808487,78
1429094601501,107,0.150707,0.188875,0.281912,86
1429094601542,106,0.243435,0.246267,0.400283,83
1429094601585,106,0.209855,0.232263,0.371785,70
1429094601626,106,0.0601417,0.105157,0.135272,60
1429094601668,106,-0.139739,-0.0728721,-0.191044,50
1429094601709,106,-0.291714,-0.230159,-0.44515,46
1429094601751,106,-0.353224,-0.307798,-0.542116,40
1429094601792,106,-0.293254,-0.27174,-0.429906,35
1429094601833,106,-0.151659,-0.134584,-0.178236,26
1429094601875,106,0.0331826,0.0269891,0.0836861,21
1429094601916,106,0.163764,0.1569,0.263491,15
1429094601958,106,0.246242,0.225576,0.346188,20
1429094601999,106,0.216792,0.184613,0.277801,48
1429094602040,106,0.145222,0.102952,0.157733,73
1429094602082,106,0.0266411,0.002578,0.0134287,85
1429094602123,106,-0.0452592,-0.0524556,-0.0672048,79
1429094602165,106,-0.0596577,-0.0504323,-0.0707954,65
1429094602206,106,-0.0381208,-0.0313164,-0.0448499,56
1429094602247,106,-0.0152282,-0.0477645,-0.0558145,45
1429094602289,106,-0.0394243,-0.11987,-0.1247,40
1429094602330,106,-0.107827,-0.202912,-0.209338,35
1429094602371,106,-0.16748,-0.239672,-0.273333,29
1429094602412,106,-0.142773,-0.1409,-0.15528,20
1429094602455,106,0.00636677,0.0650212,0.0927763,15
1429094602496,106,0.153264,0.26568,0.356705,10
1429094602537,106,0.280966,0.38038,0.516533,18
1429094602578,106,0.28895,0.349634,0.470926,39
1429094602620,106,0.131616,0.13542,0.150399,75
1429094602661,106,-0.111926,-0.156915,-0.280913,85
1429094602702,106,-0.233597,-0.322146,-0.512008,78
1429094602744,106,-0.165615,-0.293669,-0.451915,68
1429094602785,106,-0.0441654,-0.123821,-0.182648,52
1429094602827,106,0.0243329,0.0405729,0.0659486,44
1429094602868,106,0.0202622,0.116864,0.173105,36
1429094602909,106,-0.0491022,0.09196,0.1117,31
1429094602951,106,-0.0702006,0.0671734,0.0599533,23
1429094602992,106,-0.0465322,0.0623881,0.0513547,17
1429094603033,106,0.0395514,0.0908501,0.110103,11
1429094603074,106,0.0899228,0.0805214,0.127186,7
1429094603116,106,0.0669918,0.0195929,0.060428,6
1429094603157,106,-0.0789552,-0.133024,-0.150475,20
1429094603198,106,-0.293535,-0.289094,-0.382688,55
1429094603240,106,-0.360053,-0.33381,-0.476669,70
1429094603283,106,-0.253413,-0.220126,-0.342859,69
1429094603295,105,0.052443,0.0045227,-0.0176013,69
1429094603336,105,0.368793,0.225391,0.322505,57
1429094603377,105,0.559426,0.348015,0.536551,47
1429094603419,105,0.480556,0.28606,0.468017,37
1429094603431,105,0.236378,0.119859,0.2489,37
1429094603472,105,-0.104171,-0.09327,-0.0561932,30
1429094603483,105,-0.361804,-0.230261,-0.278812,29
1429094603524,105,-0.420921,-0.217285,-0.299619,24
1429094603566,105,-0.274908,-0.0853213,-0.153869,17
1429094603577,105,-0.010934,0.0905238,0.0718262,17
1429094603619,105,0.196094,0.196153,0.223346,10
1429094603631,105,0.266443,0.177112,0.205627,10
1429094603673,105,0.253927,0.112309,0.125818,4
1429094603685,105,0.148127,0.0387804,0.0222675,3
1429094603726,105,0.0277493,-0.0118867,-0.0569596,1
1429094603768,105,-0.0703125,-0.0656179,-0.131915,18
1429094603809,105,-0.0602897,-0.0495816,-0.0896517,40
1429094603821,105,-0.0446751,-0.0390818,-0.0573104,51
1429094603862,105,-0.0417692,-0.0348362,-0.0242501,64
1429094603873,105,-0.0728497,-0.02375,0.0058296,66
1429094603915,104,-0.132181,-0.0347398,-0.0289563,62
1429094603940,104,-0.138642,-0.0146632,-0.00527108,55
1429094603971,104,-0.0821225,0.0216118,0.0535279,47
1429094604013,104,-0.00988769,0.0111939,0.0755293,40
1429094604039,104,-0.0364114,-0.0894793,-0.0393878,35
1429094604081,104,-0.104803,-0.221412,-0.213071,32
1429094604109,104,-0.107276,-0.224021,-0.248908,29
1429094604139,104,-0.0983783,-0.143726,-0.197383,25
1429094604171,104,-0.00315826,0.026331,-0.0194315,21
1429094604207,104,0.0698668,0.161174,0.116197,17
1429094604242,104,0.0808016,0.197956,0.14303,13
1429094604271,104,0.0723783,0.156725,0.0942731,10
1429094604312,104,0.0540022,0.103493,0.0497097,7
1429094604339,104,0.0283243,0.0579705,0.0117493,5
1429094604381,104,0.0666769,0.0916782,0.0710217,9
1429094604407,104,0.112763,0.141389,0.153991,25
1429094604439,104,0.145684,0.167176,0.211986,47
1429094604472,104,0.126358,0.088514,0.165211,65
1429094604508,104,0.0233088,-0.0664908,0.0107028,69
1429094604541,102,-0.118762,-0.246253,-0.194909,64
1429094604572,102,-0.192313,-0.321488,-0.290091,57
1429094604607,102,-0.165558,-0.303779,-0.282206,49
1429094604639,102,-0.0287439,-0.165744,-0.127388,43
1429094604671,102,0.144008,0.00829703,0.0765831,40
1429094604707,102,0.252964,0.172528,0.265969,37
1429094604739,102,0.244207,0.231764,0.307337,34
1429094604771,102,0.160768,0.20453,0.241168,32
1429094604807,102,0.0122154,0.0981982,0.0828441,26
1429094604839,102,-0.0853666,0.0205336,-0.041303,21
1429094604871,102,-0.104319,-0.0166679,-0.102796,19
1429094604907,102,-0.0726521,-0.0285098,-0.131575,14
1429094604939,102,-0.0682139,-0.0563863,-0.173773,12
1429094604971,102,-0.109362,-0.0889813,-0.199586,12
1429094605007,102,-0.141984,-0.0977369,-0.172587,30
1429094605039,102,-0.105113,-0.0345377,-0.0504035,50
1429094605071,102,-0.0462755,0.0452636,0.0701497,67
1429094605112,102,0.00426747,0.0927406,0.129796,71
1429094605154,101,0.0311703,0.104357,0.146874,62
1429094605195,101,-0.0305343,0.0120439,0.0385571,55
1429094605241,101,-0.105847,-0.107891,-0.0825892,45
1429094605253,101,-0.106322,-0.161651,-0.122929,42
1429094605294,101,0.00990763,-0.0598333,0.0253642,40
1429094605335,101,0.146471,0.0842566,0.198672,36
1429094605376,101,0.229072,0.177207,0.276579,33
1429094605417,101,0.146055,0.125334,0.13927,28
1429094605458,101,-0.0602989,-0.0512505,-0.167031,22
1429094605500,101,-0.293229,-0.235336,-0.462971,18
1429094605546,101,-0.367744,-0.294815,-0.546327,16
1429094605557,101,-0.340307,-0.255462,-0.456596,20
1429094605599,101,-0.0734416,-0.0590435,-0.124197,37
1429094605640,101,0.242106,0.122211,0.196072,68
1429094605681,101,0.556955,0.309559,0.512526,76
1429094605722,101,0.613904,0.359722,0.603118,72
1429094605764,101,0.551318,0.364998,0.607626,65
1429094605805,101,0.222889,0.210179,0.368481,53
1429094605846,101,-0.0719438,0.0364286,0.110828,47
1429094605888,101,-0.245171,-0.120244,-0.116045,41
1429094605929,101,-0.356723,-0.240512,-0.285947,39
1429094605971,101,-0.430506,-0.31196,-0.403742,33
1429094606013,101,-0.446721,-0.327808,-0.45903,29
1429094606054,101,-0.366088,-0.249449,-0.386753,22
1429094606095,101,-0.187342,-0.0955849,-0.204895,18
1429094606137,101,-0.00252735,0.086839,0.0298829,21
1429094606178,101,0.193349,0.234762,0.238228,38
1429094606219,101,0.291526,0.300521,0.354261,60
1429094606260,101,0.292514,0.277328,0.360697,81
1429094606301,101,0.187821,0.158673,0.22608,80
1429094606342,101,0.119375,0.0462051,0.0865322,71
1429094606384,101,0.134924,-0.0268809,-0.00715027,64
1429094606425,101,0.113479,-0.112221,-0.137535,55
1429094606467,101,0.112617,-0.125933,-0.168528,50
1429094606508,101,0.00422731,-0.120306,-0.156348,44
1429094606550,101,-0.131064,-0.0989179,-0.106554,40
1429094606591,101,-0.20137,-0.0610511,-0.0246756,32
1429094606633,101,-0.172838,-0.0259716,0.028278,26
1429094606674,101,-0.0131808,-0.00106968,0.0471518,18
1429094606717,101,0.0758837,-0.0215531,-0.00992413,15
1429094606759,101,0.126167,-0.017152,-0.0445413,33
1429094606800,101,0.0594685,-0.00869415,-0.0680522,56
1429094606841,101,-0.137822,-0.0549735,-0.138582,80
1429094606882,101,-0.32255,-0.114554,-0.21805,80
1429094606923,101,-0.398207,-0.161366,-0.261369,71
1429094606968,101,-0.363724,-0.185228,-0.270054,63
1429094606980,101,-0.120864,-0.107151,-0.125548,59
1429094607021,101,0.158622,0.0564899,0.12334,52
1429094607062,101,0.382856,0.224946,0.352678,44
1429094607103,101,0.459723,0.353305,0.506019,41
1429094607144,101,0.356983,0.349219,0.481759,34
1429094607186,101,0.173627,0.219696,0.29875,30
1429094607227,101,-0.0329109,0.0559125,0.0643102,24
1429094607268,101,-0.105101,-0.0678541,-0.117802,20
1429094607309,101,-0.146763,-0.121412,-0.204706,20
1429094607350,101,-0.0821784,-0.110882,-0.18561,33
1429094607392,101,-0.0182185,-0.0438796,-0.0870683,68
1429094607434,101,0.0344054,0.0366803,0.0490663,85
1429094607476,101,-0.0172348,0.0442867,0.071484,86
1429094607518,101,-0.0980365,0.0178593,0.0308459,79
1429094607559,101,-0.220133,-0.0708217,-0.102526,65
1429094607570,101,-0.242048,-0.146407,-0.213184,65
1429094607612,101,-0.0488021,-0.0840435,-0.113917,53
1429094607654,101,0.171244,0.0184797,0.0632589,48
1429094607695,101,0.344532,0.0983145,0.222732,43
1429094607737,101,0.351733,0.0745725,0.228446,39
1429094607779,101,0.171429,-0.0478615,0.05405,31
1429094607821,101,-0.089868,-0.161388,-0.15361,25
1429094607834,101,-0.251445,-0.190154,-0.257944,23
1429094607845,101,-0.296845,-0.124793,-0.233057,21
1429094607886,101,-0.178056,0.0173595,-0.0734376,17
1429094607927,101,0.00444222,0.127117,0.0742232,29
1429094607969,101,0.144066,0.2004,0.172634,50
1429094607980,101,0.221474,0.235743,0.212618,62
1429094608022,101,0.1307,0.195715,0.147014,79
1429094608034,101,0.0417648,0.123103,0.0728606,82
1429094608075,101,-0.143984,-0.0342639,-0.0797478,76
1429094608087,101,-0.307346,-0.233676,-0.263612,76
1429094608128,101,-0.424873,-0.390912,-0.413252,61
1429094608140,101,-0.367537,-0.413061,-0.41271,61
1429094608181,101,-0.155014,-0.260863,-0.231309,47
1429094608209,101,0.0840913,-0.0317575,0.0213333,40
1429094608239,101,0.338593,0.217867,0.297847,38
1429094608280,101,0.420016,0.344926,0.411891,33
1429094608310,101,0.387258,0.34982,0.403491,30
1429094608339,101,0.325683,0.274934,0.302291,28
1429094608381,101,0.27972,0.196288,0.217677,22
1429094608409,101,0.262226,0.138575,0.165231,18
1429094608439,101,0.157078,0.0395618,0.0749217,17
1429094608480,101,-0.0777608,-0.109963,-0.0958304,23
1429094608508,101,-0.285282,-0.236826,-0.252515,31
1429094608540,101,-0.476544,-0.345295,-0.399275,54
1429094608572,101,-0.579244,-0.378046,-0.46212,76
1429094608607,101,-0.538283,-0.318047,-0.391826,86
1429094608639,101,-0.333645,-0.163704,-0.19134,84
1429094608671,101,-0.0719299,0.0262103,0.0435333,77
1429094608710,101,0.151991,0.175067,0.226842,63
1429094608739,101,0.280803,0.254785,0.313521,58
1429094608780,101,0.322142,0.25032,0.293186,46
1429094608807,101,0.383971,0.256943,0.286418,44
1429094608839,101,0.397556,0.25176,0.275307,40
1429094608871,101,0.439264,0.246169,0.271629,35
1429094608907,101,0.463069,0.219102,0.255292,29
1429094608939,101,0.310394,0.0996329,0.121883,22
1429094608971,101,0.129029,-0.0336582,-0.0323102,15
1429094609007,101,-0.231881,-0.235242,-0.278366,7
1429094609040,101,-0.569353,-0.380033,-0.475644,4
1429094609071,101,-0.772556,-0.447894,-0.588374,13
1429094609107,101,-0.67113,-0.337044,-0.467241,35
1429094609139,101,-0.328273,-0.107274,-0.177306,59
1429094609176,101,0.0234424,0.117023,0.125069,73
1429094609207,101,0.355533,0.293446,0.383532,74
1429094609239,102,0.368595,0.257398,0.369794,67
1429094609271,102,0.213094,0.098557,0.186767,58
1429094609307,102,0.00240886,-0.0915929,-0.0476949,48
1429094609348,102,-0.124116,-0.194056,-0.187735,37
1429094609392,102,-0.161815,-0.219534,-0.237442,30
1429094609408,102,-0.0624872,-0.103907,-0.119718,30
1429094609449,102,-0.0198766,-0.000171752,-0.0241729,23
1429094609490,102,0.0373085,0.0961263,0.0692692,19
1429094609531,102,0.108757,0.160499,0.139538,11
1429094609572,102,0.195598,0.19728,0.201632,7
1429094609614,102,0.21842,0.18486,0.197528,1
1429094609657,102,0.157252,0.117795,0.121246,1
1429094609701,102,0.0059409,0.010515,-0.0145885,23
1429094609713,102,-0.199095,-0.114484,-0.182334,36
1429094609754,102,-0.313548,-0.180309,-0.259711,60
1429094609795,102,-0.367612,-0.200358,-0.286713,75
1429094609836,102,-0.121974,-0.0781724,-0.107772,71
1429094609878,102,0.192837,0.0823555,0.135751,58
1429094609919,102,0.498327,0.24014,0.371029,48
1429094609961,102,0.516488,0.249798,0.398109,37
1429094610002,102,0.316598,0.154598,0.274027,32
1429094610043,102,-0.0327012,-0.017264,0.0296852,26
1429094610086,102,-0.342467,-0.183375,-0.208573,21
1429094610127,102,-0.533372,-0.282986,-0.348121,1
1429094610279,102,-0.442798,-0.236711,-0.299248,2
1429094610320,102,-0.219352,-0.104639,-0.141596,15
1429094610364,102,0.0160336,0.0379351,0.0143526,52
1429094610406,102,0.15061,0.124642,0.107046,73
1429094610447,102,0.175823,0.142745,0.117484,78
1429094610492,102,0.0541461,0.067046,0.0156211,72
1429094610504,102,-0.0771443,-0.0445976,-0.106684,68
1429094610544,102,-0.195285,-0.151637,-0.235582,59
1429094610588,102,-0.133894,-0.155404,-0.215215,47
1429094610601,102,0.0201747,-0.0866485,-0.0994417,44
1429094610643,102,0.198155,0.0214531,0.0663582,40
1429094610685,102,0.324944,0.12097,0.223224,34
1429094610726,102,0.336977,0.179758,0.298338,29
1429094610767,102,0.239054,0.172279,0.261895,19
1429094610809,102,0.0368681,0.105725,0.134279,14
1429094610850,102,-0.0943948,0.0524011,0.0288574,9
1429094610892,102,-0.15942,-0.00257381,-0.0440969,7
1429094610933,102,-0.166988,-0.0374797,-0.0731941,23
1429094610974,102,-0.135143,-0.0718854,-0.0853616,45
1429094611016,102,-0.107592,-0.10004,-0.100576,72
1429094611057,102,-0.130696,-0.131729,-0.140733,73
1429094611099,102,-0.0872387,-0.108434,-0.122866,62
1429094611140,102,0.0305388,-0.0413939,-0.0472695,52
1429094611181,102,0.223653,0.0672741,0.0938962,41
1429094611223,102,0.389209,0.149665,0.207175,38
1429094611264,102,0.483317,0.218888,0.307851,35
1429094611305,102,0.370836,0.167028,0.23603,32
1429094611346,102,0.128697,0.0707283,0.102763,28
1429094611388,102,-0.189546,-0.0849128,-0.101884,21
1429094611429,102,-0.441115,-0.203586,-0.253327,17
1429094611471,102,-0.569158,-0.262794,-0.320513,14
1429094611512,102,-0.554902,-0.238599,-0.297027,24
1429094611553,102,-0.442235,-0.155357,-0.224512,57
1429094611594,102,-0.254472,-0.0465249,-0.13476,78
1429094611636,102,-0.0259127,0.0759655,-0.0193656,84
1429094611677,103,0.18455,0.161595,0.0847379,77
1429094611719,103,0.370666,0.22075,0.188016,62
1429094611731,103,0.449555,0.238055,0.258825,62
1429094611773,103,0.437752,0.206767,0.282388,47
1429094611785,103,0.299832,0.123228,0.225099,44
1429094611826,103,0.0593339,-0.0309276,0.0572579,40
1429094611868,103,-0.147652,-0.176578,-0.128891,33
1429094611909,103,-0.146804,-0.166597,-0.130759,28
1429094611952,103,-0.0860663,-0.109018,-0.085506,20
1429094611964,103,0.0331402,-0.00163261,0.0340096,20
1429094612006,103,0.0886915,0.0804668,0.123648,12
1429094612018,103,0.0346304,0.086486,0.116172,10
1429094612059,103,-0.12418,-0.0189836,-0.0261307,13
1429094612071,103,-0.287831,-0.165644,-0.231884,19
1429094612113,103,-0.331009,-0.253438,-0.354114,40
1429094612155,103,-0.273743,-0.24644,-0.355723,75
1429094612167,103,-0.165333,-0.142043,-0.226103,80
1429094612208,103,-0.0614015,-0.0121705,-0.0605874,81
1429094612249,103,0.0622781,0.133345,0.133724,67
1429094612260,103,0.185788,0.249072,0.289813,67
1429094612303,103,0.269625,0.295866,0.357113,51
1429094612315,103,0.276313,0.25297,0.325932,51
1429094612357,103,0.252195,0.145906,0.21842,40
1429094612371,103,0.201396,0.016745,0.0886488,37
1429094612412,103,0.16553,-0.0677511,-0.000419041,32
1429094612439,103,0.10369,-0.0970826,-0.0481205,28
1429094612480,103,0.0332169,-0.0899007,-0.0766733,23
1429094612508,103,-0.0384233,-0.0729603,-0.0950399,18
1429094612539,103,-0.129066,-0.0891451,-0.154743,13
1429094612571,103,-0.206035,-0.111408,-0.208813,8
1429094612607,103,-0.275749,-0.112953,-0.230991,5
1429094612639,103,-0.256396,-0.0540722,-0.169589,9
1429094612680,103,-0.144895,0.0559765,-0.025098,26
1429094612708,103,0.0248064,0.1569,0.139264,52
1429094612739,103,0.0906768,0.155297,0.185564,76
1429094612780,103,0.12959,0.130938,0.196925,84
1429094612807,103,0.0517575,0.0356567,0.107717,79
1429094612839,103,-0.0287507,-0.0341176,0.033631,69
1429094612880,103,-0.0967774,-0.0863653,-0.0233908,58
1429094612908,103,-0.106565,-0.0913636,-0.0310707,49
1429094612939,103,-0.0803334,-0.0920988,-0.0473348,42
1429094612971,103,0.0310767,-0.0534064,-0.0166629,38
1429094613007,103,0.128726,-0.00775334,0.0190509,34
1429094613039,103,0.168468,-0.0160423,-0.00440506,29
1429094613071,103,0.132809,-0.036574,-0.052349,24
1429094613107,103,0.0319434,-0.0464401,-0.0864226,19
1429094613139,103,-0.0839749,-0.050246,-0.118246,14
1429094613171,103,-0.131787,-0.01742,-0.099051,10
1429094613209,103,0.00248673,0.0880271,0.0307785,7
1429094613239,103,0.114505,0.140555,0.111376,13
1429094613271,103,0.237246,0.195057,0.209496,22
1429094613307,103,0.286188,0.199978,0.25332,58
1429094613339,103,0.168926,0.109239,0.165643,74
1429094613371,103,-0.000192186,-0.019033,0.011761,77
1429094613407,103,-0.294548,-0.216148,-0.236114,69
1429094613439,103,-0.382892,-0.262602,-0.310523,65
1429094613471,103,-0.369677,-0.236636,-0.295457,57
1429094613507,103,-0.161108,-0.0871835,-0.106167,46
1429094613539,103,0.0373674,0.0347193,0.0609066,41
1429094613580,103,0.101574,0.0269786,0.0731624,37
1429094613626,103,0.0361458,-0.0317351,0.0040492,30
1429094613640,103,-0.146987,-0.170719,-0.185064,27
1429094613684,103,-0.237694,-0.162191,-0.205553,22
1429094613727,103,-0.151812,-0.0345613,-0.0753151,13
1429094613769,103,0.00329223,0.0969487,0.0728242,6
1429094613810,103,0.198369,0.204343,0.205847,5
1429094613851,103,0.337582,0.25638,0.280621,25
1429094613892,103,0.392757,0.259743,0.2949,49
1429094613933,103,0.336745,0.20913,0.237342,69
1429094613977,103,0.174281,0.125468,0.152013,73
1429094614022,103,0.0521313,0.0743185,0.116156,62
1429094614037,103,-0.0449197,0.0185515,0.0680525,57
1429094614051,103,-0.0377368,-7.96342e-05,0.0667016,57
1429094614098,103,-0.0662531,-0.0570973,0.00775148,44
1429094614111,103,-0.0622921,-0.126032,-0.0857377,41
1429094614153,103,-0.0821689,-0.182165,-0.178623,35
1429094614195,103,-0.115484,-0.203532,-0.23601,32
1429094614236,103,-0.134066,-0.159989,-0.213961,25
1429094614278,103,-0.143748,-0.102193,-0.160696,20
1429094614320,103,-0.127575,-0.0532593,-0.113378,12
1429094614362,103,-0.0296508,0.0187018,-0.0370028,8
1429094614404,103,0.0394604,0.0570278,0.00229864,10
1429094614445,103,0.142783,0.127328,0.0846684,26
1429094614488,103,0.0952065,0.0995632,0.0720117,59
1429094614529,103,0.0144435,0.066582,0.0531825,71
1429094614571,103,-0.154564,-0.0409309,-0.0577998,71
1429094614612,103,-0.20389,-0.0837281,-0.101436,59
1429094614654,103,-0.203332,-0.105709,-0.124154,46
1429094614696,103,-0.142786,-0.0953289,-0.105426,40
1429094614738,103,-0.0457684,-0.0556792,-0.0373119,37
1429094614779,103,0.0540507,0.0151984,0.0637522,34
1429094614820,103,0.0793375,0.0520338,0.12182,29
1429094614861,103,0.0451411,0.0457597,0.124096,24
1429094614903,103,-0.0168307,-0.0196653,0.0370314,20
1429094614944,103,-0.0490472,-0.0616526,-0.0330138,15
1429094614986,103,-0.0159634,-0.0772519,-0.0765292,19
1429094615027,103,0.0437627,-0.0433613,-0.044647,47
1429094615068,103,0.170259,0.0618862,0.0857258,69
1429094615110,103,0.254002,0.155524,0.19079,79
1429094615122,103,0.25237,0.188546,0.193837,78
1429094615163,103,0.267454,0.234339,0.194683,71
1429094615205,103,0.27906,0.233679,0.169845,57
1429094615246,103,0.26926,0.188533,0.126915,48
1429094615293,103,0.147319,0.0750006,0.032337,40
1429094615304,103,-0.0441862,-0.0616957,-0.0688311,40
1429094615348,103,-0.269218,-0.215514,-0.204258,35
1429094615359,103,-0.450962,-0.34016,-0.31771,33
1429094615401,103,-0.490406,-0.367973,-0.359752,29
1429094615443,103,-0.330357,-0.24678,-0.238525,22
1429094615484,103,-0.0922025,-0.0486124,-0.0281505,17
1429094615525,103,0.0490422,0.0781671,0.0990576,18
1429094615567,103,0.0802264,0.14621,0.161519,33
1429094615608,103,0.0777914,0.192627,0.195587,68
1429094615650,103,0.0799231,0.221273,0.202431,82
1429094615691,103,0.143496,0.245195,0.203675,80
1429094615733,103,0.184601,0.202065,0.144275,73
1429094615774,103,0.228371,0.132349,0.083462,59
1429094615815,103,0.213294,0.0112748,0.00702829,50
1429094615857,103,0.0902623,-0.158227,-0.108077,42
1429094615899,103,-0.016627,-0.258972,-0.171493,38
1429094615910,103,-0.194405,-0.327517,-0.253574,36
1429094615952,103,-0.288031,-0.31002,-0.285291,31
1429094615993,103,-0.286925,-0.211349,-0.238695,23
1429094616035,103,-0.220925,-0.0738708,-0.14301,17
1429094616046,103,-0.15694,0.0307755,-0.0500247,15
1429094616087,103,-0.0119669,0.147813,0.0915517,12
1429094616128,103,0.127653,0.239535,0.221925,24
1429094616169,103,0.284782,0.306658,0.328432,45
1429094616211,103,0.342222,0.299098,0.334288,74
1429094616253,103,0.182763,0.154628,0.170377,77
1429094616294,104,-0.0129873,-0.00670751,-0.0177109,68
1429094616336,104,-0.189257,-0.13436,-0.162467,59
1429094616347,104,-0.174757,-0.138019,-0.154375,55
1429094616389,104,-0.0746629,-0.106424,-0.0742318,46
1429094616400,104,0.00399902,-0.0601606,0.0117515,43
1429094616442,104,-0.020497,-0.0828982,0.00341155,37
1429094616453,104,-0.11846,-0.112344,-0.0491235,37
1429094616495,104,-0.187985,-0.114165,-0.105765,31
1429094616507,104,-0.113372,-0.0383807,-0.0671321,31
1429094616549,104,-0.0402653,0.00319347,-0.0474625,23
1429094616560,104,0.173276,0.116692,0.0912491,21
1429094616602,104,0.359835,0.211153,0.208687,17
1429094616613,104,0.503115,0.29263,0.298748,14
1429094616655,104,0.434899,0.260065,0.234663,11
1429094616675,104,0.16905,0.088864,0.0235196,8
1429094616716,104,-0.179633,-0.128946,-0.212175,10
1429094616739,104,-0.458397,-0.317869,-0.390214,16
1429094616780,104,-0.504906,-0.364701,-0.402585,46
1429094616807,104,-0.31641,-0.249111,-0.241635,57
1429094616839,104,-0.109235,-0.0861708,-0.0505388,71
1429094616880,104,0.0350837,0.0421152,0.0800251,70
1429094616907,104,0.0516109,0.12062,0.143425,67
1429094616939,104,-0.013921,0.116371,0.109468,60
1429094616980,104,-0.0244582,0.0926318,0.0764801,48
1429094617007,104,-0.00265296,0.0363007,0.0276309,45
1429094617048,104,0.188647,0.0792034,0.107877,39
1429094617076,104,0.395723,0.163183,0.22612,35
1429094617107,104,0.499647,0.209939,0.300239,33
1429094617148,104,0.403352,0.166378,0.25494,26
1429094617171,104,0.159505,0.0441126,0.108058,24
1429094617207,104,-0.105289,-0.071212,-0.0375013,19
1429094617239,104,-0.316011,-0.157093,-0.173087,15
1429094617276,104,-0.448511,-0.226943,-0.295402,11
1429094617307,104,-0.458766,-0.239173,-0.347649,8
1429094617339,104,-0.394956,-0.227117,-0.347871,5
1429094617371,104,-0.270443,-0.162974,-0.276014,8
1429094617406,104,-0.088119,-0.0256841,-0.0918206,23
1429094617439,104,0.106672,0.140797,0.133794,46
1429094617478,104,0.248003,0.244422,0.294138,65
1429094617507,104,0.222911,0.213855,0.283059,71
1429094617549,104,0.129439,0.112446,0.17982,65
1429094617572,104,0.0223158,0.0140816,0.0528633,62
1429094617607,104,0.00465085,-0.0405097,-0.0315633,55
1429094617639,104,0.157877,0.0150381,0.031868,49
1429094617674,104,0.267307,0.0567534,0.0920061,44
1429094617706,104,0.266215,0.0576681,0.103552,41
1429094617741,104,0.112881,-0.0127243,0.0215381,39
1429094617771,104,-0.118038,-0.0943681,-0.0959058,34
1429094617812,104,-0.295341,-0.14083,-0.183889,27
1429094617857,104,-0.353585,-0.115961,-0.187279,23
1429094617898,104,-0.254633,-0.0500359,-0.132937,18
1429094617940,104,-0.0695869,0.0359966,-0.0344979,15
1429094617982,104,0.126884,0.0840309,0.0434376,11
1429094618023,104,0.252454,0.0968645,0.0940112,16
1429094618064,104,0.253561,0.0857958,0.119979,42
1429094618105,104,0.136835,0.0429183,0.0846669,62
1429094618146,104,0.0268585,0.0310062,0.0729513,69
1429094618188,104,-0.0410434,0.0281766,0.0750719,64
1429094618229,104,-0.043511,0.0126672,0.0605488,54
1429094618273,104,-0.0429483,-0.0373475,0.00568638,47
1429094618285,104,-0.0201182,-0.0575219,-0.03143,44
1429094618325,104,0.0388519,-0.0446573,-0.0255906,40
1429094618367,104,0.0537063,-0.00342001,0.00369466,37
1429094618408,104,-0.00141201,0.00386136,-0.00527336,34
1429094618449,104,-0.0565372,0.0068447,-0.0139339,28
1429094618490,104,-0.145362,-0.0358635,-0.0830072,24
1429094618532,104,-0.208368,-0.114606,-0.163605,19
1429094618574,104,-0.310395,-0.22791,-0.274276,15
1429094618616,104,-0.300244,-0.259447,-0.272913,17
1429094618662,104,-0.175363,-0.187251,-0.180327,40
1429094618673,104,0.00567727,-0.0409742,-0.0297132,40
1429094618715,104,0.255797,0.148764,0.159937,68
1429094618756,104,0.387367,0.260527,0.25827,73
1429094618797,104,0.351814,0.280016,0.268456,66
1429094618838,104,0.191159,0.194184,0.186617,59
1429094618880,104,0.0222047,0.0663885,0.0573032,47
1429094618921,104,-0.0135604,0.00383256,0.000871198,41
1429094618964,104,0.109941,0.0880349,0.101573,37
1429094618975,104,0.246546,0.19073,0.210447,37
1429094619017,104,0.362811,0.298632,0.335865,31
1429094619058,104,0.240373,0.220445,0.250408,27
1429094619099,104,-0.0411025,0.0102537,0.0285396,19
1429094619140,104,-0.424666,-0.296863,-0.30785,15
1429094619182,104,-0.599523,-0.462539,-0.483581,11
1429094619223,104,-0.538048,-0.447821,-0.475392,13
1429094619265,104,-0.30193,-0.281749,-0.305281,38
1429094619306,104,-0.0571281,-0.0941245,-0.126385,59
1429094619348,104,0.148721,0.0735173,0.0349826,74
1429094619389,104,0.169067,0.0959746,0.0504747,72
1429094619431,104,0.00410454,0.00367334,-0.0435366,61
1429094619473,104,-0.157953,-0.0787076,-0.0981918,54
1429094619515,104,-0.202849,-0.0937896,-0.0562485,44
1429094619556,104,0.0351536,0.0628927,0.162995,40
1429094619598,104,0.471249,0.354564,0.508991,36
1429094619639,104,0.754456,0.514302,0.672347,32
1429094619682,104,0.764143,0.490143,0.615794,27
1429094619723,104,0.490826,0.249423,0.31411,23
1429094619765,104,0.0788943,-0.0489526,-0.0417715,17
1429094619806,104,-0.281243,-0.307412,-0.360803,15
1429094619847,104,-0.476367,-0.403046,-0.498103,31
1429094619888,104,-0.493761,-0.347169,-0.459708,53
1429094619931,104,-0.357596,-0.185845,-0.277914,79
1429094619942,104,-0.225862,-0.0180923,-0.0861536,79
1429094619985,104,-0.105863,0.0865662,0.0438822,78
1429094620028,104,-0.0562157,0.107799,0.0648224,71
1429094620040,104,-0.193378,-0.0148532,-0.0731977,67
1429094620082,104,-0.342333,-0.174819,-0.252459,55
1429094620123,104,-0.441651,-0.293725,-0.370545,48
1429094620165,104,-0.289518,-0.227418,-0.265918,43
1429094620177,104,-0.0812859,-0.0737923,-0.0713497,42
1429094620220,104,0.199087,0.0891905,0.149997,38
1429094620231,104,0.34733,0.15192,0.236665,38
1429094620273,104,0.362958,0.139684,0.225923,32
1429094620285,104,0.31981,0.108239,0.182364,30
1429094620326,104,0.302232,0.140196,0.20764,25
1429094620367,104,0.271837,0.185356,0.241889,19
1429094620379,104,0.223238,0.203713,0.23488,19
1429094620420,104,0.199326,0.192264,0.202605,15
1429094620431,104,0.139199,0.107205,0.108307,15
1429094620473,104,0.0512183,-0.0178769,-0.0219387,25
1429094620485,104,-0.0910683,-0.17204,-0.185445,34
1429094620526,104,-0.193312,-0.232104,-0.256447,57
1429094620539,104,-0.211966,-0.192592,-0.232196,69
1429094620580,104,-0.125739,-0.0405482,-0.0648389,83
1429094620607,104,0.0577541,0.120847,0.131352,85
1429094620649,104,0.129933,0.176431,0.237231,80
1429094620675,104,0.159124,0.139745,0.2278,71
1429094620716,104,0.0924436,0.0431821,0.118192,58
1429094620739,104,-0.0541032,-0.0616226,-0.0467783,54
1429094620781,104,-0.230576,-0.126217,-0.194842,49
1429094620822,104,-0.342824,-0.137382,-0.258113,44
1429094620863,104,-0.391484,-0.12854,-0.243905,40
1429094620904,104,-0.342643,-0.120385,-0.206662,33
1429094620916,104,-0.235942,-0.0997585,-0.13102,33
1429094620957,104,-0.0605989,-0.0721825,-0.0541919,25
1429094620976,104,0.17768,0.024878,0.0944374,23
1429094621017,104,0.333539,0.109147,0.189439,19
1429094621039,104,0.339521,0.137858,0.185069,16
1429094621080,104,0.245424,0.128058,0.120694,15
1429094621107,104,0.0461579,0.0667829,-0.0112726,24
1429094621148,104,-0.0530124,0.0846855,0.0225787,45
1429094621177,104,-0.0892905,0.110349,0.0884214,70
1429094621206,104,-0.0297512,0.119602,0.1586,85
1429094621247,104,0.101522,0.105563,0.201857,86
1429094621276,103,0.145953,-0.00290294,0.0837123,79
1429094621306,103,0.0985039,-0.161263,-0.12686,70
1429094621348,103,-0.0398273,-0.315684,-0.357439,61
1429094621377,103,-0.228966,-0.414452,-0.521897,53
1429094621406,103,-0.353644,-0.401507,-0.543882,48
1429094621447,103,-0.361345,-0.278141,-0.40945,45
1429094621474,103,-0.22179,-0.0714034,-0.150388,41
1429094621516,103,-0.0302103,0.120617,0.127172,38
1429094621539,103,0.147922,0.238413,0.317618,33
1429094621580,103,0.255431,0.262635,0.386608,28
1429094621607,103,0.271086,0.243707,0.362397,23
1429094621648,103,0.239557,0.225185,0.312658,19
1429094621674,103,0.168563,0.225654,0.275117,16
1429094621716,103,0.165596,0.269937,0.315029,18
1429094621739,103,0.147553,0.293995,0.32788,34
1429094621775,103,0.118769,0.251145,0.27569,59
1429094621807,103,0.00799591,0.122144,0.105383,82
1429094621838,103,-0.0557829,-0.0345068,-0.0811471,89
1429094621874,103,-0.140426,-0.212361,-0.285622,87
1429094621906,102,-0.185421,-0.355949,-0.422878,78
1429094621938,102,-0.212737,-0.435998,-0.494297,73
1429094621974,102,-0.216326,-0.391503,-0.426037,58
1429094622016,102,-0.159431,-0.273542,-0.288492,51
1429094622057,102,-0.0631417,-0.101108,-0.0763186,45
1429094622099,102,-0.0493068,-0.0411758,-0.015647,41
1429094622140,102,-0.0184142,0.0152007,0.0295219,34
1429094622182,102,0.0298401,0.0506786,0.0739314,28
1429094622223,102,0.0646607,0.0888082,0.110305,20
1429094622264,102,0.102084,0.124076,0.146343,16
1429094622305,102,0.138398,0.158534,0.167921,11
1429094622346,102,0.18667,0.179402,0.176574,19
1429094622387,102,0.233871,0.209702,0.213563,54
1429094622429,102,0.19178,0.18693,0.182888,80
1429094622471,102,0.187883,0.189457,0.191357,91
1429094622512,101,0.187548,0.198793,0.211193,85
1429094622554,101,0.122901,0.141596,0.134682,70
1429094622595,101,6.46733e-05,0.0301801,-0.00530856,59
1429094622637,101,-0.16514,-0.14943,-0.227091,47
1429094622678,101,-0.290372,-0.295272,-0.377328,41
1429094622720,101,-0.341476,-0.360988,-0.409392,36
1429094622762,101,-0.347503,-0.348987,-0.341068,31
1429094622804,101,-0.307309,-0.257638,-0.194522,22
1429094622845,101,-0.235445,-0.127529,-0.0383484,17
1429094622887,101,-0.0998842,0.0269307,0.0918225,10
1429094622928,101,0.0560533,0.153564,0.176669,7
1429094622969,101,0.246267,0.243082,0.227953,7
1429094623011,101,0.33889,0.230866,0.185099,21
1429094623052,101,0.280073,0.155891,0.105598,48
1429094623093,101,0.088971,0.0533457,-0.0018087,87
1429094623134,101,-0.174797,-0.0522667,-0.139992,93
1429094623175,101,-0.282207,-0.0822166,-0.176067,82
1429094623217,101,-0.212932,-0.0341763,-0.110898,70
1429094623258,101,-0.0500147,-0.00500209,-0.0461315,55
1429094623299,101,0.116251,0.0383957,0.0741419,47
1429094623340,101,0.21749,0.0353488,0.137404,40
1429094623382,101,0.237587,0.0457321,0.224393,36
1429094623423,101,0.211971,0.0419208,0.240429,29
1429094623465,101,0.0874769,-0.000878457,0.144466,23
1429094623506,101,-0.0124198,-0.0424376,0.0291382,15
1429094623548,101,-0.0898024,-0.0872296,-0.0859491,11
1429094623589,101,-0.195578,-0.170042,-0.261449,7
1429094623631,101,-0.296986,-0.218934,-0.390466,6
1429094623673,101,-0.288266,-0.156873,-0.32261,27
1429094623715,101,-0.0924169,0.0461412,-0.0270108,55
1429094623756,101,0.24481,0.277341,0.356295,89
1429094623798,101,0.497779,0.408653,0.571412,91
1429094623840,101,0.536881,0.334239,0.48049,78
1429094623881,101,0.293503,0.0946959,0.102582,67
1429094623922,101,0.00493211,-0.145256,-0.261887,57
1429094623963,101,-0.297188,-0.304192,-0.493905,46
1429094624004,101,-0.428447,-0.369453,-0.544851,42
1429094624045,101,-0.400503,-0.266303,-0.33988,35
1429094624087,101,-0.275145,-0.10048,-0.0776419,30
1429094624128,101,0.00919934,0.141323,0.261911,20
1429094624169,101,0.205502,0.276582,0.44626,15
1429094624211,101,0.32098,0.319193,0.489002,8
1429094624252,101,0.276058,0.260664,0.394558,5
1429094624293,101,0.121358,0.157689,0.212474,3
1429094624335,101,-0.0783544,0.0187953,-0.0230677,14
1429094624376,101,-0.133941,-0.0398631,-0.104339,55
1429094624418,101,-0.130869,-0.0746731,-0.154895,81
1429094624429,101,-0.0902987,-0.0788815,-0.147606,88
1429094624471,101,-0.0637773,-0.101964,-0.194467,89
1429094624483,101,-0.015436,-0.133118,-0.248282,86
1429094624525,101,-0.0388826,-0.181278,-0.316981,69
1429094624537,101,-0.0425881,-0.173753,-0.271046,69
1429094624578,101,0.0421403,-0.0816076,-0.0790222,52
1429094624589,101,0.0333745,-0.040486,0.0146729,52
1429094624631,101,0.0266932,-0.0126526,0.0742208,42
1429094624644,101,-0.0670699,-0.00296898,0.0573417,40
1429094624687,101,-0.156463,0.0030252,0.0203356,36
1429094624707,101,-0.253764,-0.00293435,-0.0317734,34
1429094624749,101,-0.243502,0.0194145,-0.00350565,26
1429094624774,101,-0.129472,0.0281709,0.044573,24
1429094624815,101,0.0501449,0.0296851,0.0873404,15
1429094624839,101,0.259543,0.0625956,0.149561,13
1429094624880,101,0.484516,0.136814,0.264144,7
1429094624906,101,0.600646,0.194023,0.322248,5
1429094624948,101,0.535413,0.217921,0.307366,1
1429094624974,101,0.346925,0.195337,0.22457,3
1429094625016,101,0.0604356,0.122052,0.0822572,31
1429094625039,101,-0.22791,-0.0209093,-0.133937,46
1429094625080,101,-0.439064,-0.168653,-0.336391,85
1429094625106,101,-0.52459,-0.260764,-0.446766,89
1429094625147,101,-0.473038,-0.300838,-0.477398,83
1429094625176,101,-0.310404,-0.222832,-0.317596,71
1429094625206,101,-0.0737632,-0.0619482,-0.0239591,65
1429094625247,101,0.188641,0.139094,0.341261,50
1429094625275,101,0.315503,0.249706,0.529396,46
1429094625316,101,0.258741,0.23878,0.462556,40
1429094625339,101,0.128655,0.149661,0.254016,40
1429094625380,101,-0.0710525,-0.0108477,-0.0739492,33
1429094625407,101,-0.181771,-0.140785,-0.31311,30
1429094625448,101,-0.166851,-0.174265,-0.344486,22
1429094625476,101,-0.0850247,-0.157966,-0.256368,16
1429094625506,101,-0.00623198,-0.117005,-0.130202,14
1429094625549,101,0.00620096,-0.0756224,-0.0562161,8
1429094625576,101,-0.0411564,-0.0349324,-0.040186,8
1429094625607,101,-0.0625436,0.0318183,-0.0157252,18
1429094625648,101,-0.0850956,0.0525028,-0.0394662,58
1429094625676,101,-0.0268696,0.0697713,-0.0168326,73
1429094625706,101,0.0495424,0.0751299,0.0255378,91
1429094625739,101,0.124681,0.0707306,0.0958384,92
1429094625777,101,0.157095,0.0435564,0.122018,82
1429094625806,101,0.189824,0.0198904,0.13484,69
1429094625847,101,0.205131,0.0122314,0.135172,52
1429094625874,101,0.210028,0.0484677,0.185346,48
1429094625906,101,0.113851,0.0393235,0.157544,42
1429094625939,101,-0.0306346,-0.00887261,0.0650088,39
1429094625974,101,-0.254233,-0.122116,-0.142691,35
1429094626006,101,-0.331532,-0.16187,-0.260843,31
1429094626038,101,-0.219661,-0.0895471,-0.206574,25
1429094626074,101,-0.0160217,0.0125371,-0.0831027,19
1429094626108,101,0.154537,0.079602,0.0132868,14
1429094626138,101,0.209843,0.0964856,0.0488003,9
1429094626174,101,0.0903925,0.042016,-0.0294484,7
1429094626206,101,-0.135773,-0.0618961,-0.185693,17
1429094626247,101,-0.271728,-0.0957921,-0.221246,59
1429094626289,101,-0.301791,-0.0935954,-0.190852,88
1429094626330,101,-0.191693,-0.0466648,-0.067074,98
1429094626371,101,-0.0117955,0.0456997,0.132177,65
1429094626412,101,0.163113,0.107865,0.286698,56
1429094626454,101,0.240071,0.0981231,0.311558,50
1429094626495,101,0.230313,0.0508275,0.244118,43
1429094626538,101,0.198168,0.0247652,0.170248,40
1429094626550,101,0.132628,-0.0134738,0.0486561,40
1429094626591,101,0.0751388,-0.0055307,-0.0249312,37
1429094626632,101,0.00180548,0.0164878,-0.05521,33
1429094626674,101,-0.0375024,0.0804728,0.0133529,30
1429094626715,101,-0.0930128,0.0825266,0.0405547,26
1429094626756,101,-0.198923,-0.00765947,-0.0380965,24
1429094626797,101,-0.225957,-0.087352,-0.115965,23
1429094626839,101,-0.181293,-0.0843828,-0.119166,31
1429094626880,101,-0.0749217,-0.0188073,-0.0484871,53
1429094626921,101,0.0316915,0.051188,0.0149304,66
1429094626963,101,0.113281,0.0772302,0.0304149,68
1429094627004,100,0.120087,0.0357532,-0.0375919,63
1429094627045,100,0.0786336,-0.0628395,-0.157702,54
1429094627087,100,0.0023342,-0.149139,-0.233575,48
1429094627129,100,-0.0615799,-0.202278,-0.258941,42
1429094627170,100,-0.00775137,-0.153485,-0.135948,40
1429094627211,100,0.0654363,-0.0746614,-0.0076372,37
1429094627253,100,0.132651,0.0105715,0.131227,34
1429094627294,100,0.129286,0.0600332,0.195677,31
1429094627336,100,0.0927626,0.117106,0.251674,27
1429094627379,100,0.0543092,0.141462,0.253264,24
1429094627420,100,0.0656142,0.17462,0.278039,22
1429094627462,100,0.0845029,0.161368,0.223076,28
1429094627504,100,0.0701659,0.124833,0.146051,41
1429094627546,100,0.0112937,0.0878094,0.0391037,64
1429094627588,100,-0.0905615,0.0504878,-0.0575617,70
1429094627628,98,-0.222531,-0.0340657,-0.1924,67
1429094627670,98,-0.321657,-0.13382,-0.292868,58
1429094627711,98,-0.360636,-0.230535,-0.354156,52
1429094627752,98,-0.207631,-0.183286,-0.219642,45
1429094627795,98,0.0323452,-0.0501151,0.015108,42
1429094627836,98,0.274135,0.0875674,0.239931,40
1429094627878,98,0.37171,0.140851,0.344575,37
1429094627919,98,0.322194,0.0874644,0.262155,32
1429094627960,98,0.121746,-0.0578066,0.0157808,29
1429094628001,98,-0.10118,-0.152744,-0.199169,25
1429094628043,98,-0.202391,-0.12885,-0.257671,23
1429094628084,98,-0.199059,-0.0249998,-0.199789,21
1429094628127,98,-0.136106,0.0586315,-0.0906539,26
1429094628139,98,-0.0723509,0.0427332,-0.080054,32
1429094628181,98,-0.0506212,-0.0443751,-0.129089,55
1429094628222,98,-0.0368759,-0.111198,-0.149882,67
1429094628264,98,0.024279,-0.09009,-0.0671733,66
1429094628307,97,0.0525953,-0.0256703,0.02864,60
1429094628319,97,0.105074,0.111657,0.181362,57
1429094628360,97,0.103932,0.187599,0.240999,51
1429094628402,97,0.079294,0.212746,0.239043,44
1429094628443,97,0.0120569,0.176238,0.155555,42
1429094628485,97,-0.109097,0.0301351,-0.0258035,40
1429094628527,97,-0.174006,-0.0959282,-0.149498,38
1429094628569,97,-0.246791,-0.250424,-0.280461,33
1429094628581,97,-0.262092,-0.341792,-0.324501,33
1429094628622,97,-0.226708,-0.385805,-0.346443,28
1429094628664,97,0.0291378,-0.177188,-0.0767467,26
1429094628705,97,0.359334,0.165993,0.293518,24
1429094628746,97,0.682381,0.544932,0.719098,29
1429094628788,97,0.715993,0.66301,0.807517,49
1429094628801,97,0.43579,0.467649,0.525915,57
1429094628843,97,0.047956,0.0915582,0.039505,68
1429094628885,97,-0.349261,-0.287304,-0.437666,67
1429094628896,97,-0.518541,-0.492764,-0.682893,67
1429094628938,97,-0.410154,-0.421547,-0.561329,57
1429094628979,97,-0.139895,-0.149046,-0.165622,51
1429094629021,97,0.0874971,0.0673513,0.160336,43
1429094629062,97,0.17327,0.190043,0.345239,41
1429094629104,97,0.119119,0.150035,0.302104,39
1429094629115,97,-0.0273412,0.00903517,0.0964828,39
1429094629156,97,-0.10779,-0.0436051,-0.00890442,35
1429094629198,97,-0.109345,-0.0409793,-0.0687119,31
1429094629209,97,0.0340551,0.131512,0.0709463,30
1429094629251,97,0.134137,0.245013,0.149921,25
1429094629262,97,0.0559069,0.179268,0.0300255,25
1429094629303,97,-0.108392,-0.0224107,-0.225812,23
1429094629315,97,-0.372746,-0.329713,-0.570093,23
1429094629356,97,-0.490496,-0.432409,-0.650784,36
1429094629397,97,-0.385594,-0.31913,-0.453108,52
1429094629408,97,-0.0192709,0.0224057,0.036065,60
1429094629450,97,0.300139,0.211341,0.334175,70
1429094629461,97,0.512952,0.239903,0.433713,70
1429094629503,97,0.486042,0.0849157,0.291381,64
1429094629519,97,0.272771,-0.0660848,0.0999109,61
1429094629538,97,-0.0263962,-0.163344,-0.0525666,58
1429094629580,97,-0.14911,-0.0210535,0.0967258,51
1429094629607,97,-0.111317,0.175711,0.313017,46
1429094629648,97,0.147339,0.380453,0.553448,42
1429094629675,97,0.408109,0.45932,0.629506,40
1429094629706,97,0.417908,0.305793,0.387982,39
1429094629748,97,0.165838,-0.0341349,-0.0857409,36
1429094629774,97,-0.277993,-0.446662,-0.647261,33
1429094629816,97,-0.57593,-0.709171,-0.986704,30
1429094629842,97,-0.661079,-0.771231,-1.08279,27
1429094629874,97,-0.388637,-0.47732,-0.676681,25
1429094629915,97,0.00445665,-0.0439594,-0.0817753,23
1429094629939,97,0.424261,0.461635,0.589332,28
1429094629974,97,0.586525,0.734358,0.919302,40
1429094630006,97,0.460716,0.685318,0.817153,57
1429094630038,97,0.175388,0.364973,0.376227,69
1429094630074,97,-0.177763,-0.052577,-0.168025,72
1429094630106,97,-0.421316,-0.364751,-0.555441,68
1429094630138,97,-0.523584,-0.488317,-0.702252,61
1429094630174,97,-0.504694,-0.415933,-0.583287,55
1429094630206,97,-0.355919,-0.163467,-0.219499,49
1429094630238,97,-0.214445,0.0561585,0.132387,44
1429094630274,97,0.0359644,0.278105,0.509894,40
1429094630306,97,0.303093,0.378103,0.696158,39
1429094630338,97,0.582659,0.464312,0.793912,37
1429094630374,97,0.610554,0.305943,0.533204,34
1429094630406,97,0.416879,0.0542605,0.107,30
1429094630438,97,0.114859,-0.200094,-0.30474,28
1429094630480,97,-0.0944229,-0.294476,-0.472482,25
1429094630521,97,-0.20769,-0.257769,-0.445626,24
1429094630563,97,-0.259938,-0.178479,-0.355505,30
1429094630605,97,-0.293984,-0.105617,-0.258614,51
1429094630647,97,-0.283146,-0.0372082,-0.132047,66
1429094630692,97,-0.143047,0.0703408,0.0573792,69
1429094630704,97,0.0483193,0.147092,0.240711,67
1429094630745,97,0.174988,0.111151,0.261108,61
1429094630786,97,0.234572,0.0547451,0.22322,52
1429094630827,97,0.137959,-0.0751034,0.0271438,46
1429094630868,97,0.0274648,-0.127607,-0.0912929,40
1429094630910,97,-0.0782927,-0.117409,-0.13191,39
1429094630951,97,-0.119463,-0.0492054,-0.0786377,36
1429094630992,97,-0.11549,0.033873,0.000496121,32
1429094631033,97,-0.151794,-0.0135513,-0.0967522,29
1429094631074,97,-0.0964295,-0.0423397,-0.164992,26
1429094631116,97,0.0347866,0.00028055,-0.10908,24
1429094631127,97,0.115769,0.0469208,-0.0246429,23
1429094631168,97,0.108699,0.048223,0.0216738,27
1429094631210,97,0.0148212,0.0320346,0.0266929,46
1429094631251,97,-0.0446448,0.00562923,0.0318966,62
1429094631292,97,-0.0668086,-0.0342397,-0.0167438,71
1429094631334,97,-0.0508294,-0.0695505,-0.0650563,68
1429094631375,97,-0.0321275,-0.130972,-0.153115,59
1429094631417,97,-0.0937814,-0.213203,-0.270531,52
1429094631458,97,-0.15582,-0.277118,-0.361017,44
1429094631499,97,-0.181416,-0.277728,-0.360692,41
1429094631541,97,-0.00706043,-0.116372,-0.124679,38
1429094631584,97,0.202179,0.0942047,0.181371,35
1429094631626,97,0.273218,0.217603,0.347209,31
1429094631668,97,0.149189,0.224369,0.331625,28
1429094631709,97,0.0260046,0.228927,0.291877,24
1429094631751,97,-0.11561,0.155065,0.165511,25
1429094631792,97,-0.103165,0.190798,0.21254,39
1429094631834,97,-0.0471983,0.215812,0.266962,53
1429094631875,97,0.153667,0.318266,0.439848,66
1429094631917,98,0.27402,0.331427,0.470184,64
1429094631959,98,0.294611,0.275192,0.342349,54
1429094632006,98,0.156605,0.157829,0.106156,45
1429094632018,98,-0.0588714,-0.0388696,-0.210896,45
1429094632062,98,-0.125735,-0.139233,-0.334111,40
1429094632076,98,-0.0986716,-0.211018,-0.354596,38
1429094632117,98,-0.0205132,-0.251878,-0.284541,36
1429094632159,98,0.0169911,-0.267802,-0.206445,33
1429094632200,98,0.0245397,-0.237991,-0.10291,30
1429094632242,98,-0.0014774,-0.160083,-0.011643,26
1429094632284,98,0.0126774,-0.0739665,0.0616112,23
1429094632328,98,0.017766,0.00750467,0.0784731,25
1429094632370,98,-0.0738472,-0.0304853,-0.0609187,36
1429094632411,98,-0.180093,-0.0813559,-0.200002,57
1429094632452,98,-0.20312,-0.121888,-0.288952,65
1429094632494,98,-0.0608212,-0.0439554,-0.174342,61
1429094632535,98,0.0951698,0.0438105,-0.0393417,54
1429094632578,98,0.230119,0.14625,0.100735,44
1429094632589,98,0.21856,0.162114,0.120013,41
1429094632631,98,0.0927653,0.12095,0.095063,37
1429094632674,98,-0.119946,-0.0126143,-0.0644376,34
1429094632715,98,-0.230349,-0.0746682,-0.0661414,32
1429094632757,98,-0.122315,-0.0349237,0.0833579,28
1429094632798,98,0.0454122,0.0540139,0.263587,25
1429094632839,98,0.0948999,0.0485686,0.24127,23
1429094632881,98,-0.00676824,-0.0344986,0.0397172,20
1429094632922,98,-0.228735,-0.1913,-0.277501,24
1429094632964,98,-0.355338,-0.254005,-0.427159,43
1429094633005,98,-0.290879,-0.207097,-0.369148,58
1429094633047,98,-0.0934273,-0.0347226,-0.119158,64
1429094633058,98,0.136906,0.169329,0.176539,62
1429094633100,100,0.222455,0.220214,0.270487,57
1429094633111,100,0.160158,0.17708,0.206105,53
1429094633152,100,-0.00798085,0.00870426,-0.00429836,47
1429094633194,100,-0.160637,-0.16764,-0.215497,40
1429094633236,100,-0.163846,-0.23551,-0.261364,37
1429094633277,100,-0.0849829,-0.173908,-0.154165,33
1429094633319,100,-0.0419763,-0.0554713,-0.00543743,31
1429094633360,100,0.00876658,0.103011,0.170448,27
1429094633401,100,0.0909302,0.204642,0.280193,25
1429094633443,100,0.268805,0.32991,0.437841,21
1429094633484,100,0.39706,0.315622,0.426676,22
1429094633526,100,0.415652,0.213602,0.317439,36
1429094633539,100,0.32715,0.105548,0.157643,36
1429094633580,100,0.175783,0.0625368,0.0589702,57
1429094633592,100,-0.0165047,0.0649731,-0.00667962,57
1429094633633,100,-0.149138,0.0792278,-0.0232734,63
1429094633645,100,-0.226054,0.0153167,-0.10017,62
1429094633690,101,-0.139942,-0.117374,-0.203161,58
1429094633702,101,0.00924549,-0.211167,-0.252218,55
1429094633747,101,0.0784639,-0.324336,-0.327206,46
1429094633761,101,0.161576,-0.202571,-0.154058,43
1429094633779,101,0.0874354,-0.0826648,-0.0181183,41
1429094633806,101,-0.0172776,0.0441619,0.124456,40
1429094633847,101,-0.123515,0.06809,0.129008,35
1429094633875,101,-0.246089,-0.0213846,-0.0165939,34
1429094633906,101,-0.41477,-0.213754,-0.294715,31
1429094633948,101,-0.507727,-0.357955,-0.516011,25
1429094633975,101,-0.436192,-0.348768,-0.505973,24
1429094634006,101,-0.318794,-0.233451,-0.366591,21
1429094634048,101,-0.0623551,0.034561,0.0126452,17
1429094634074,101,0.15586,0.31517,0.395433,16
1429094634116,101,0.374337,0.505922,0.67481,25
1429094634138,101,0.442388,0.476504,0.654741,31
1429094634179,101,0.387568,0.235924,0.343434,48
1429094634206,101,0.239033,-0.0250384,-0.016159,51
1429094634248,101,0.0645059,-0.243143,-0.329544,50
1429094634275,101,-0.0880669,-0.326252,-0.460927,48
1429094634306,101,-0.133434,-0.238039,-0.362305,43
1429094634347,101,-0.0497429,-0.0343577,-0.0927131,38
1429094634374,101,0.0351034,0.13687,0.15411,36
1429094634416,101,0.140916,0.236272,0.325753,32
1429094634438,101,0.177447,0.257995,0.383975,31
1429094634479,101,0.265082,0.276975,0.409043,28
1429094634509,101,0.297755,0.258867,0.355826,27
1429094634538,101,0.175239,0.164175,0.188098,25
1429094634574,101,-0.0250309,0.0182859,-0.0205236,22
1429094634606,101,-0.260438,-0.153989,-0.250597,20
1429094634638,101,-0.401722,-0.265579,-0.390051,18
1429094634674,101,-0.434702,-0.297958,-0.419467,17
1429094634715,101,-0.322721,-0.275543,-0.358798,24
1429094634757,101,-0.130341,-0.166452,-0.193553,35
1429094634798,101,0.0225011,-0.0650907,-0.0554969,47
1429094634842,101,0.106992,-0.00166032,0.0310362,47
1429094634855,101,0.0710114,0.0118634,0.0450514,52
1429094634896,101,-0.025544,0.00539248,0.0504324,41
1429094634937,101,-0.164768,-0.0494064,-0.0194563,35
1429094634979,101,-0.12826,-0.0115177,0.0644263,27
1429094635020,101,0.0559968,0.0699679,0.214149,24
1429094635062,101,0.233572,0.136331,0.312753,21
1429094635104,101,0.352192,0.154921,0.300133,18
1429094635145,101,0.279893,0.102219,0.149382,12
1429094635186,101,0.0999219,0.0128284,-0.073258,8
1429094635227,101,-0.146245,-0.0802856,-0.263001,4
1429094635269,101,-0.286331,-0.1292,-0.345539,5
1429094635316,101,-0.296861,-0.10366,-0.283583,27
1429094635329,101,-0.1054,0.0220124,-0.0757182,37
1429094635371,101,0.0668177,0.126415,0.0998292,52
1429094635412,101,0.155186,0.173218,0.177282,54
1429094635453,101,0.109894,0.147132,0.177151,49
1429094635498,101,0.0339209,0.0689305,0.111857,40
1429094635509,101,0.0041362,-0.011574,0.0442522,40
1429094635550,101,-0.0273802,-0.0948977,-0.040755,32
1429094635591,101,-0.0778998,-0.187404,-0.154708,29
1429094635633,101,-0.0844319,-0.216867,-0.200474,27
1429094635674,101,-0.0181658,-0.143649,-0.134655,24
1429094635716,101,0.0840358,0.016151,0.0225229,18
1429094635760,101,0.146031,0.153369,0.154516,14
1429094635771,101,0.217133,0.229463,0.230556,12
1429094635814,101,0.190083,0.184751,0.189502,9
1429094635856,101,0.100714,0.0659108,0.065744,18
1429094635897,101,0.0361115,-0.0318693,-0.0390633,45
1429094635939,101,-0.0171561,-0.0869428,-0.121542,57
1429094635980,102,-0.0646208,-0.081347,-0.133737,55
1429094636021,102,-0.0412195,0.0113155,0.00182074,49
1429094636063,102,-0.0580175,0.0919981,0.151792,43
1429094636105,102,-0.132291,0.0915704,0.201911,36
1429094636146,102,-0.163351,0.0257325,0.146519,31
1429094636188,102,-0.152577,-0.0800311,-0.000711787,29
1429094636235,102,-0.115293,-0.165726,-0.158581,25
1429094636248,102,0.0372248,-0.146027,-0.17049,24
1429094636289,102,0.243012,-0.0228707,-0.0298284,20
1429094636331,102,0.399502,0.129158,0.158452,14
1429094636372,102,0.335306,0.166496,0.160919,12
1429094636413,102,0.124798,0.103457,0.0197856,20
1429094636454,102,-0.167887,-0.016984,-0.186201,44
1429094636496,102,-0.362938,-0.11656,-0.314632,57
1429094636537,102,-0.381292,-0.136211,-0.27645,58
1429094636578,103,-0.291457,-0.172277,-0.237165,53
1429094636620,103,-0.207412,-0.209269,-0.222793,43
1429094636661,103,-0.169531,-0.240588,-0.244851,38
1429094636702,103,-0.184052,-0.174002,-0.189991,33
1429094636743,103,-0.0856058,0.000182663,0.0351909,31
1429094636785,103,0.0954829,0.213604,0.333879,27
1429094636826,103,0.306565,0.368236,0.572628,24
1429094636868,103,0.474037,0.40252,0.639101,18
1429094636909,103,0.504462,0.333844,0.543742,14
1429094636950,103,0.337216,0.165145,0.264044,18
1429094636991,103,0.118029,-0.0042774,-0.0113237,32
1429094637033,103,-0.127641,-0.143381,-0.256828,57
1429094637079,103,-0.255126,-0.178497,-0.338807,63
1429094637090,103,-0.315227,-0.177971,-0.373474,62
1429094637131,104,-0.248417,-0.115391,-0.28859,58
1429094637172,104,-0.167233,-0.108416,-0.248774,50
1429094637214,104,-0.106343,-0.121228,-0.196644,46
1429094637255,104,-0.0625072,-0.108123,-0.110503,40
1429094637297,104,-0.00702636,-0.0382556,0.0418059,39
1429094637339,104,0.0227798,0.0326642,0.171474,35
1429094637380,104,0.0160943,0.0586554,0.200527,31
1429094637422,104,-0.0617814,0.00587129,0.0658209,25
1429094637464,104,-0.00623156,-0.00144412,0.0228411,21
1429094637506,104,0.0916135,0.0225594,0.0354268,16
1429094637547,104,0.2511,0.10253,0.152869,21
1429094637558,104,0.376369,0.205262,0.298685,28
1429094637600,104,0.280796,0.197375,0.24648,53
1429094637611,104,0.109677,0.13495,0.0964389,53
1429094637652,104,-0.0576736,0.0145302,-0.109277,65
1429094637694,104,-0.16953,-0.131687,-0.314764,62
1429094637705,104,-0.157753,-0.183521,-0.340531,59
1429094637747,104,-0.00979126,-0.0890454,-0.124419,53
1429094637758,104,0.173002,0.090313,0.198103,50
1429094637799,104,0.240425,0.196152,0.385745,45
1429094637810,104,0.178554,0.176961,0.356382,42
1429094637852,104,-0.041668,0.027688,0.119702,38
1429094637874,104,-0.265914,-0.137609,-0.153059,37
1429094637915,104,-0.435177,-0.273995,-0.376994,34
1429094637938,104,-0.489109,-0.308507,-0.472668,30
1429094637979,104,-0.460016,-0.282237,-0.481536,26
1429094638006,104,-0.25366,-0.154423,-0.271539,23
1429094638047,104,0.067494,0.0286419,0.0590253,19
1429094638074,104,0.28485,0.1107,0.235084,16
1429094638115,104,0.360153,0.138462,0.281413,16
1429094638139,104,0.196374,0.014742,0.0398643,24
1429094638180,104,0.00761476,-0.0742537,-0.154913,40
1429094638206,104,0.0297565,0.0112045,-0.0133516,55
1429094638247,104,0.188952,0.211196,0.325008,61
1429094638274,104,0.406703,0.42021,0.684671,58
1429094638315,104,0.434825,0.442281,0.695673,53
1429094638338,104,0.200279,0.183804,0.224955,48
1429094638379,104,-0.0819892,-0.110041,-0.273323,43
1429094638406,104,-0.360936,-0.344226,-0.642513,40
1429094638447,104,-0.522412,-0.411467,-0.718293,38
1429094638474,104,-0.516877,-0.345664,-0.56721,37
1429094638515,104,-0.394289,-0.207505,-0.32373,35
1429094638538,104,-0.136386,-0.0313352,-0.0597201,32
1429094638579,104,0.108235,0.0976467,0.116856,28
1429094638606,104,0.315135,0.190614,0.253165,25
1429094638647,104,0.392442,0.214318,0.299326,22
1429094638674,104,0.36536,0.184046,0.280151,21
1429094638715,104,0.268633,0.15003,0.254777,30
1429094638738,104,0.132722,0.106024,0.214519,46
1429094638779,104,-0.0301865,0.0490311,0.138822,64
1429094638806,104,-0.224552,-0.0576531,-0.0147854,73
1429094638848,104,-0.36125,-0.152386,-0.150408,71
1429094638874,104,-0.414642,-0.229422,-0.257242,66
1429094638915,104,-0.355622,-0.258567,-0.304108,60
1429094638956,104,-0.19374,-0.224628,-0.293211,51
1429094638997,104,0.0133043,-0.111856,-0.143298,46
1429094639042,104,0.24784,0.0545219,0.106828,42
1429094639054,104,0.399469,0.190718,0.307136,40
1429094639095,104,0.558138,0.33402,0.544194,38
1429094639136,104,0.537751,0.350075,0.56889,30
1429094639178,104,0.376713,0.25826,0.419844,25
1429094639219,104,0.0725858,0.083835,0.160225,21
1429094639260,104,-0.277025,-0.112569,-0.157327,30
1429094639305,104,-0.552115,-0.230539,-0.379908,56
1429094639317,104,-0.62389,-0.225672,-0.455931,56
1429094639358,104,-0.567955,-0.213857,-0.502128,73
1429094639399,104,-0.37021,-0.195047,-0.509939,73
1429094639441,105,-0.0916514,-0.149953,-0.414155,64
1429094639482,105,0.137961,-0.103655,-0.292512,57
1429094639523,105,0.33795,-0.0225721,-0.0889227,47
1429094639564,105,0.406716,0.0681205,0.132107,42
1429094639605,105,0.344918,0.150823,0.311619,38
1429094639649,105,0.226095,0.182527,0.390513,34
1429094639661,105,0.0648241,0.13141,0.304642,32
1429094639702,105,-0.0410713,0.0726318,0.191516,27
1429094639744,105,-0.140404,-0.0199977,0.0221704,21
1429094639785,105,-0.136308,-0.0487857,-0.0132927,19
1429094639827,105,-0.173714,-0.0905384,-0.0619956,34
1429094639868,105,-0.179474,-0.0866148,-0.0548611,55
1429094639909,105,-0.145458,-0.041372,-0.0292763,78
1429094639950,105,-0.0679822,0.0355485,0.00369094,79
1429094639992,105,0.0626909,0.11809,0.0535407,70
1429094640033,105,0.123605,0.143407,0.0969156,62
1429094640075,105,0.111825,0.0938864,0.0884825,51
1429094640116,105,-0.0375267,-0.0161027,0.0189541,46
1429094640158,105,-0.0627674,-0.0479193,0.0421133,40
1429094640200,105,-0.0253542,-0.044191,0.0662284,37
1429094640241,105,0.0745277,-0.00483595,0.10122,29
1429094640283,105,0.220057,0.0657484,0.141982,24
1429094640324,105,0.22468,0.0504213,0.0577487,18
1429094640366,105,0.144509,-0.00189025,-0.0604924,21
1429094640408,105,-0.00203763,-0.0807902,-0.189593,45
1429094640420,105,-0.0390453,-0.0699422,-0.175154,45
1429094640462,105,-0.044598,-0.0260552,-0.120802,70
1429094640474,105,0.0388418,0.0533651,-0.0149044,73
1429094640515,106,0.0607565,0.0648874,0.0183048,71
1429094640556,106,0.0660342,0.0772634,0.0646833,60
1429094640598,106,0.00502759,0.0401441,0.0639697,52
1429094640643,106,-0.0776287,-0.0320078,0.0295428,42
1429094640655,106,-0.130358,-0.0705004,-0.00736193,42
1429094640696,106,-0.0801247,-0.0559167,0.00708203,36
1429094640737,106,-0.0199404,-0.0334624,-0.000491542,32
1429094640778,106,0.0160607,-0.0303055,-0.0338887,25
1429094640820,106,0.00293777,-0.026581,-0.0492289,21
1429094640861,106,-0.111479,-0.0719313,-0.118297,14
1429094640902,106,-0.181496,-0.102783,-0.153237,10
1429094640943,106,-0.118395,-0.0393608,-0.0491194,18
1429094640984,106,-0.0331526,0.0265356,0.0353941,35
1429094641026,106,0.091768,0.110491,0.144562,58
1429094641067,106,0.108767,0.0951594,0.108687,60
1429094641109,107,0.0896421,0.041626,0.0389385,51
1429094641150,107,-0.0743134,-0.0875919,-0.133178,43
1429094641192,107,-0.176988,-0.177311,-0.23572,35
1429094641233,107,-0.207795,-0.199633,-0.234968,31
1429094641275,107,-0.110259,-0.126371,-0.124617,28
1429094641316,107,0.0592359,0.0222389,0.0601318,25
1429094641357,107,0.241922,0.169179,0.253825,19
1429094641399,107,0.380277,0.284692,0.403419,14
1429094641440,107,0.384652,0.284112,0.421727,10
1429094641482,107,0.242127,0.162421,0.269553,9
1429094641493,107,0.0514666,0.0347126,0.0851158,13
1429094641534,107,-0.13586,-0.0786625,-0.113777,28
1429094641576,107,-0.224692,-0.0856339,-0.188568,51
1429094641587,107,-0.23377,-0.0199422,-0.162,51
1429094641629,107,-0.130204,0.097839,-0.0360144,54
1429094641671,107,-0.0141994,0.170406,0.0676496,49
1429094641684,107,-0.00576268,0.127282,0.0518428,46
1429094641725,107,-0.0043031,0.0493215,0.0294582,38
1429094641766,107,-0.0476006,-0.105987,-0.0719224,33
1429094641807,107,-0.0640254,-0.221321,-0.141345,30
1429094641848,107,-0.0727199,-0.296522,-0.205569,26
1429094641860,107,-0.0637116,-0.306573,-0.252177,25
1429094641901,107,-0.00664832,-0.22096,-0.20965,21
1429094641913,107,-0.0276365,-0.163056,-0.199583,19
1429094641955,107,-0.0311415,-0.10759,-0.157589,15
1429094641998,107,0.0345756,-0.0241924,-0.0528664,10
1429094642011,107,0.141651,0.113704,0.105314,10
1429094642052,107,0.240576,0.273303,0.288831,17
1429094642064,107,0.210945,0.334818,0.33627,24
1429094642105,107,0.0308574,0.256437,0.224753,41
1429094642117,107,-0.137388,0.117737,0.0711778,50
1429094642158,107,-0.219519,0.00709438,-0.0172124,59
1429094642173,107,-0.148067,-0.040845,-0.0223965,59
1429094642215,107,-0.0104732,-0.0266893,0.0354863,53
1429094642238,107,0.0537477,-0.0660065,0.024866,50
1429094642279,107,0.128716,-0.02385,0.0691238,40
1429094642306,107,0.0895644,-0.0145062,0.0507189,38
1429094642347,107,0.0426459,0.0040025,0.0289851,32
1429094642374,107,0.00295232,0.046767,0.0156129,30
1429094642415,107,-0.0506619,0.0138931,-0.0401961,27
1429094642438,107,0.0250912,-0.00732638,-0.0513731,25
1429094642479,107,0.122235,0.00310091,-0.0112136,21
1429094642505,107,0.141319,0.0112332,0.0231136,19
1429094642547,107,-0.0770041,-0.0731292,-0.0924895,13
1429094642573,107,-0.259277,-0.0893612,-0.130916,12
1429094642616,107,-0.416492,-0.144693,-0.214616,23
1429094642638,107,-0.328173,-0.110583,-0.173729,31
1429094642679,107,-0.0926732,-0.0245667,-0.0612863,56
1429094642705,107,0.342758,0.230738,0.260797,60
1429094642747,107,0.548118,0.334457,0.385353,58
1429094642773,107,0.476626,0.29521,0.334649,55
1429094642815,107,0.171507,0.0884004,0.109407,46
1429094642837,107,-0.226049,-0.200593,-0.205284,43
1429094642880,107,-0.416728,-0.365875,-0.381771,38
1429094642905,107,-0.357493,-0.355207,-0.356204,34
1429094642947,107,-0.0521003,-0.130709,-0.0843228,30
1429094642974,107,0.307576,0.193337,0.290193,28
1429094643015,107,0.49256,0.368414,0.495166,23
1429094643037,107,0.408131,0.297784,0.39379,21
1429094643079,107,0.152939,0.0570347,0.0813218,16
1429094643106,107,-0.178322,-0.191445,-0.262474,14
1429094643147,107,-0.440892,-0.372537,-0.543094,10
1429094643194,107,-0.490077,-0.330245,-0.549968,24
1429094643206,107,-0.418652,-0.194948,-0.415492,24
1429094643247,107,-0.210576,0.0248489,-0.10248,53
1429094643288,107,0.0653735,0.267455,0.266835,65
1429094643330,107,0.327734,0.428208,0.601502,62
1429094643371,107,0.319874,0.367595,0.635222,56
1429094643412,107,0.116084,0.137439,0.380772,47
1429094643454,107,-0.228006,-0.173201,-0.0476856,42
1429094643497,107,-0.430618,-0.415956,-0.457909,39
1429094643539,107,-0.352726,-0.416058,-0.530959,37
1429094643581,107,-0.0961546,-0.273138,-0.358774,32
1429094643622,107,0.227541,-0.0484167,-0.0442172,28
1429094643663,107,0.532783,0.167564,0.233402,21
1429094643705,107,0.587268,0.236619,0.294963,17
1429094643748,107,0.39889,0.11494,0.107512,14
1429094643761,107,-0.022304,-0.112187,-0.230705,17
1429094643803,107,-0.433394,-0.307721,-0.520349,32
1429094643853,107,-0.659479,-0.337538,-0.587458,63
1429094643865,107,-0.49203,-0.125701,-0.332377,70
1429094643907,107,-0.099389,0.24218,0.137905,74
1429094643948,107,0.324296,0.513211,0.494494,65
1429094643989,107,0.546016,0.5865,0.673667,58
1429094644032,107,0.438657,0.399054,0.565949,48
1429094644043,107,0.163488,0.111104,0.323719,48
1429094644084,107,-0.0613364,-0.127707,0.0797244,43
1429094644126,107,-0.20408,-0.281705,-0.141579,40
1429094644167,107,-0.12688,-0.229637,-0.146341,37
1429094644211,107,-0.0224533,-0.124625,-0.0887111,32
1429094644253,107,-0.00854352,-0.0505562,-0.0300974,24
1429094644294,107,-0.0767263,-0.0584229,-0.0489191,19
1429094644338,107,-0.125864,-0.0626732,-0.0755287,14
1429094644350,107,-0.0827837,-0.0865922,-0.127445,16
1429094644391,107,0.0222331,-0.0487625,-0.116027,28
1429094644432,107,0.146968,0.0323782,-0.0580417,60
1429094644473,107,0.119596,0.0362619,-0.0573425,75
1429094644515,107,0.0333702,0.0367671,-0.0430253,74
1429094644556,106,-0.0935122,-0.00708602,-0.0636827,66
1429094644597,106,-0.185909,-0.0420293,-0.0955673,53
1429094644639,106,-0.146748,-0.0200636,-0.0428696,47
1429094644680,106,-0.0692333,-0.00657476,0.00755588,42
1429094644721,106,0.0865566,0.0161318,0.0774975,40
1429094644763,106,0.206278,0.0345807,0.139134,36
1429094644804,106,0.244626,0.0514488,0.166878,29
1429094644845,106,0.123079,0.0146637,0.11163,24
1429094644887,106,-0.101505,-0.0327704,0.00588997,18
1429094644928,106,-0.246808,-0.069637,-0.0924305,16
1429094644969,106,-0.364993,-0.137329,-0.220383,36
1429094645010,106,-0.212202,-0.0380851,-0.134994,59
1429094645053,106,-0.0146338,0.08929,0.00891505,83
1429094645095,106,0.239646,0.277152,0.215605,82
1429094645136,105,0.423253,0.372757,0.335289,70
1429094645179,105,0.326761,0.298413,0.264796,60
1429094645222,105,0.0991069,0.111633,0.0914182,49
1429094645234,105,-0.20168,-0.136847,-0.136016,46
1429094645275,105,-0.363157,-0.340981,-0.295269,43
1429094645317,105,-0.216716,-0.330843,-0.244762,39
1429094645358,105,0.114412,-0.175507,-0.0741482,34
1429094645402,105,0.398731,0.0426604,0.14955,27
1429094645416,105,0.518733,0.232653,0.323814,24
1429094645457,105,0.318563,0.223492,0.293526,20
1429094645498,105,-0.0748826,0.048492,0.071435,17
1429094645540,105,-0.358899,-0.131035,-0.163985,34
