1429179205777,97,-0.0339393,-0.0370769,0.0200525,40
1429179205808,97,-0.0292169,-0.0806234,0.0265314,39
1429179205840,97,-0.0558443,-0.197253,-0.0124428,36
1429179205872,97,-0.0845921,-0.317471,-0.0901767,33
1429179205908,97,-0.0972301,-0.423038,-0.174606,30
1429179205940,97,-0.0658424,-0.391929,-0.2215,28
1429179205977,97,-0.0128174,-0.292601,-0.224694,26
1429179206008,97,0.0339139,-0.19439,-0.205443,28
1429179206049,97,0.0507074,-0.165049,-0.201046,41
1429179206072,97,0.0693846,-0.145332,-0.191882,47
1429179206113,97,0.0608356,-0.165382,-0.183206,55
1429179206140,97,0.0295935,-0.146847,-0.126803,54
1429179206176,97,-0.0137795,-0.0731296,-0.0223806,58
1429179206208,97,-0.051406,0.0376559,0.101203,44
1429179206240,97,-0.0590502,0.1464,0.197455,31
1429179206272,97,-0.0152076,0.247911,0.253965,20
1429179206308,97,0.0600991,0.302207,0.242912,17
1429179206340,97,0.144272,0.359804,0.242722,18
1429179206376,97,0.20068,0.378252,0.231776,18
1429179206408,97,0.211361,0.356731,0.23363,17
1429179206440,97,0.173708,0.27668,0.201035,17
1429179206471,97,0.0940704,0.131857,0.115192,14
1429179206508,97,0.00929777,-0.0421874,-0.0195358,10
1429179206540,97,-0.0619044,-0.193142,-0.158599,5
1429179206581,97,-0.08664,-0.258654,-0.248375,0
1429179206622,97,-0.0783629,-0.245343,-0.274951,0
1429179206664,97,-0.0470328,-0.181844,-0.245518,0
1429179206705,97,-0.0207945,-0.134721,-0.216605,17
1429179206747,97,0.0018409,-0.0897302,-0.166485,54
1429179206788,97,0.0221519,-0.0304081,-0.0887997,63
1429179206830,96,0.0339625,0.0339607,-0.0137614,52
1429179206871,96,0.0383184,0.0947894,0.0534011,42
1429179206913,96,0.0298833,0.122855,0.0913377,28
1429179206954,96,-0.000603645,0.0929701,0.0789857,19
1429179206996,96,-0.0515531,0.0125904,0.0297514,16
1429179207038,96,-0.120832,-0.120952,-0.05814,17
1429179207079,96,-0.161831,-0.191949,-0.0907809,16
1429179207121,96,-0.166354,-0.20256,-0.0818573,12
1429179207162,96,-0.119175,-0.146846,-0.0293669,10
1429179207204,96,-0.0468215,-0.061417,0.034438,11
1429179207246,96,0.0141891,0.00117084,0.0792105,10
1429179207288,96,0.0376543,0.0320398,0.0857546,7
1429179207335,96,0.017595,0.0129673,0.0568517,11
1429179207346,96,-0.0171654,-0.00376137,0.0230549,19
1429179207388,96,-0.032638,0.00513444,0.00780337,44
1429179207430,96,0.00328033,0.0596814,0.0401414,76
1429179207477,94,0.0600076,0.124024,0.0871071,78
1429179207488,94,0.123128,0.177908,0.129815,74
1429179207532,94,0.140614,0.184718,0.142097,62
1429179207546,94,0.125454,0.146731,0.124375,58
1429179207587,94,0.0834796,0.0824499,0.0929219,51
1429179207629,94,0.048923,0.0250808,0.062313,46
1429179207670,94,0.03452,-0.00587308,0.0451299,43
1429179207711,94,0.056182,-0.00385492,0.0354129,42
1429179207753,94,0.073999,0.0101929,0.0245198,39
1429179207794,94,0.0760562,0.0236617,0.0143349,33
1429179207837,94,0.0541019,0.0301422,-0.0074259,25
1429179207878,94,0.0150372,0.00906365,-0.0442157,21
1429179207919,94,-0.0185196,-0.0117135,-0.0702425,10
1429179207961,94,-0.0461307,-0.0259623,-0.0766339,3
1429179208003,94,-0.0597429,-0.0212352,-0.0512247,0
1429179208044,94,-0.0658687,-0.0118804,-0.020375,9
1429179208086,94,-0.0599529,0.00999042,0.0165073,42
1429179208128,94,-0.0465508,0.0293894,0.0354601,60
1429179208169,93,-0.0293098,0.0414232,0.0302249,58
1429179208211,93,-0.0149583,0.0353638,0.00909169,49
1429179208252,93,-0.0114775,0.018603,-0.0182618,32
1429179208293,93,-0.0158602,-0.00572345,-0.0294842,24
1429179208335,93,-0.0285368,-0.0246211,-0.0354714,20
1429179208377,93,-0.0271582,-0.0204126,-0.0107186,20
1429179208418,93,-0.044975,-0.0429549,-0.0131584,15
1429179208460,93,-0.0719963,-0.0926104,-0.0415154,10
1429179208502,93,-0.107418,-0.169404,-0.0911231,4
1429179208544,93,-0.132919,-0.229714,-0.136031,0
1429179208585,93,-0.114108,-0.234107,-0.140588,0
1429179208627,93,-0.0909351,-0.189358,-0.120136,0
1429179208669,93,-0.0447372,-0.102024,-0.0707222,9
1429179208711,93,0.00551282,-0.00836832,-0.015578,29
1429179208753,93,0.0699054,0.0785536,0.0431441,58
1429179208765,93,0.160441,0.15991,0.112682,58
1429179208808,92,0.241261,0.215981,0.165049,60
1429179208820,92,0.297744,0.246629,0.190981,56
1429179208862,92,0.303497,0.234656,0.174121,44
1429179208874,92,0.250622,0.163693,0.10474,39
1429179208915,92,0.166919,0.0523291,0.00758876,27
1429179208957,92,0.0552628,-0.0860077,-0.100432,20
1429179208969,92,-0.0411695,-0.183399,-0.17022,19
1429179209011,92,-0.131708,-0.23315,-0.197081,19
1429179209052,92,-0.198361,-0.216239,-0.175668,19
1429179209095,92,-0.218915,-0.130365,-0.108787,19
1429179209109,92,-0.20925,-0.023854,-0.0292703,19
1429179209150,92,-0.166912,0.0768263,0.042135,15
1429179209192,92,-0.103046,0.146305,0.0921086,11
1429179209233,92,-0.033177,0.166111,0.110056,7
1429179209246,92,0.0207315,0.143123,0.100502,6
1429179209288,92,0.0423872,0.0945421,0.0694279,20
1429179209299,92,0.0431284,0.0424695,0.0366041,20
1429179209341,92,0.0317692,0.00219718,0.00894543,53
1429179209353,92,0.014916,-0.024145,-0.00462393,62
1429179209395,92,0.0130624,-0.0308707,-0.00238786,68
1429179209408,92,0.0132106,-0.037769,0.0024678,64
1429179209451,92,0.0109943,-0.0453641,0.00664771,48
1429179209476,92,0.000256584,-0.0535163,0.004338,42
1429179209517,92,-0.0169858,-0.0625183,-0.00475844,28
1429179209540,92,-0.0346942,-0.0692137,-0.0225204,23
1429179209582,92,-0.0495163,-0.0707718,-0.0447035,16
1429179209623,92,-0.0591128,-0.0712416,-0.0656401,12
1429179209640,92,-0.0588755,-0.0639423,-0.0806095,11
1429179209681,92,-0.0417006,-0.0402973,-0.0785368,10
1429179209723,92,-0.00550056,-0.000984284,-0.0615441,4
1429179209740,92,0.0368403,0.0431158,-0.040574,2
1429179209782,92,0.0729702,0.0798307,-0.0220081,0
1429179209808,92,0.0897032,0.0962858,-0.00664438,0
1429179209849,92,0.0840141,0.0902346,0.00360427,1
1429179209875,92,0.0649854,0.0719253,0.0140883,14
1429179209917,92,0.055148,0.0648569,0.0269478,38
1429179209959,92,0.0408177,0.0488484,0.0312006,67
1429179209976,92,0.0219683,0.0282909,0.0294861,70
1429179210017,92,0.00555186,0.0106378,0.0309405,65
1429179210040,92,-0.00839774,-0.010154,0.034719,56
1429179210081,92,-0.0218851,-0.0294139,0.040216,42
1429179210107,92,-0.0363304,-0.0517218,0.0426396,28
1429179210149,92,-0.0441823,-0.0592456,0.0436864,17
1429179210176,92,-0.042078,-0.0518853,0.0444616,11
1429179210208,92,-0.0330343,-0.0390513,0.0406888,10
1429179210249,92,-0.027459,-0.0256829,0.0284194,7
1429179210276,92,-0.0231018,-0.0187236,0.0130563,5
1429179210317,92,-0.0192677,-0.0161164,-0.0025859,4
1429179210340,92,-0.00874901,-0.00291281,-0.00925501,2
1429179210381,92,-0.00478638,0.0144187,-0.010125,0
1429179210408,92,-0.0173732,0.0399563,-0.00242241,0
1429179210449,92,-0.0450964,0.0478231,-0.00348688,2
1429179210476,92,-0.0736702,0.0246569,-0.0176305,22
1429179210508,92,-0.0886644,-0.0255886,-0.0463826,46
1429179210540,92,-0.0697188,-0.0697899,-0.0664816,57
1429179210576,94,-0.0254015,-0.0911352,-0.0717768,54
1429179210608,94,0.0252832,-0.0810932,-0.0566692,43
1429179210640,94,0.0717906,-0.036121,-0.0215471,31
1429179210676,94,0.108644,0.033246,0.0268116,20
1429179210708,94,0.119846,0.0908758,0.0655582,11
1429179210740,94,0.102232,0.107408,0.0740056,6
1429179210776,94,0.0636266,0.0811926,0.0565249,6
1429179210817,94,0.0182263,0.029409,0.0186264,8
1429179210862,94,-0.0156341,-0.01302,-0.0156964,9
1429179210904,94,-0.0355635,-0.0387625,-0.0415998,9
1429179210947,94,-0.0407657,-0.0416981,-0.0511539,9
1429179210999,94,-0.0421194,-0.0415803,-0.0555198,6
1429179211013,94,-0.0382322,-0.0358624,-0.0492003,6
1429179211055,94,-0.0362788,-0.0318065,-0.0408477,25
1429179211098,94,-0.021976,-0.0146656,-0.0218396,46
1429179211140,94,-0.000279218,0.00872526,0.002721,60
1429179211181,95,0.0450547,0.0601897,0.0482738,52
1429179211223,95,0.0596042,0.0719081,0.0666253,31
1429179211264,95,0.0310173,0.0250645,0.0485364,16
1429179211306,95,-0.0477972,-0.0858712,-0.0192899,0
1429179211347,95,-0.149162,-0.220558,-0.110298,0
1429179211389,95,-0.241414,-0.333332,-0.191134,0
1429179211431,95,-0.295372,-0.391044,-0.240686,0
1429179211474,95,-0.275578,-0.3589,-0.228412,0
1429179211515,95,-0.190783,-0.249709,-0.163147,0
1429179211557,95,-0.0577413,-0.0936394,-0.0595271,0
1429179211599,95,0.0806439,0.0632849,0.0538958,0
1429179211641,95,0.197579,0.197262,0.157145,0
1429179211682,95,0.264664,0.284603,0.229697,0
1429179211723,95,0.284941,0.334535,0.268236,21
1429179211765,95,0.265965,0.336103,0.26685,18
1429179211807,95,0.226452,0.303746,0.238031,1
1429179211849,95,0.178238,0.251699,0.191621,0
1429179211891,95,0.125052,0.187011,0.13627,0
1429179211933,95,0.0760256,0.127585,0.0856753,0
1429179211975,95,0.0231928,0.0635987,0.0352056,21
1429179212017,95,-0.0284836,0.00177968,-0.0102613,34
1429179212059,95,-0.0750162,-0.0624553,-0.0534382,42
1429179212101,95,-0.110177,-0.112564,-0.0870211,42
1429179212143,95,-0.12717,-0.13546,-0.104886,41
1429179212185,95,-0.131738,-0.134091,-0.108747,39
1429179212226,95,-0.118942,-0.102715,-0.0953927,40
1429179212268,95,-0.102802,-0.0644375,-0.0796839,57
1429179212280,95,-0.0833274,-0.0290014,-0.0701113,70
1429179212321,95,-0.0574942,-0.00666093,-0.0635804,95
1429179212363,95,-0.0329797,-0.00885806,-0.0692959,107
1429179212407,95,-0.0176136,-0.0379532,-0.0817955,90
1429179212418,95,-0.00812676,-0.0717034,-0.0943578,90
1429179212460,95,0.0068247,-0.0914376,-0.093774,64
1429179212502,95,0.024822,-0.0842452,-0.0751703,47
1429179212544,95,0.0554767,-0.0404317,-0.0304338,34
1429179212585,95,0.0843516,0.0202435,0.0281662,33
1429179212626,95,0.100549,0.0722797,0.0779715,36
1429179212668,95,0.106233,0.105653,0.114679,37
1429179212709,95,0.0927496,0.110448,0.124519,32
1429179212750,95,0.0641827,0.0864355,0.105094,28
1429179212792,95,0.032469,0.0549246,0.0749643,20
1429179212834,95,0.00974796,0.0288637,0.0443376,18
1429179212876,95,-0.00820747,0.0123913,0.0224076,37
1429179212917,95,-0.0136664,0.00685832,0.0146601,57
1429179212959,95,-0.0171197,0.00214584,0.0128407,70
1429179213001,95,-0.0240534,-0.00999874,0.00503798,62
1429179213042,95,-0.0342343,-0.0253791,-0.0153563,40
1429179213083,95,-0.0506361,-0.0445426,-0.04543,24
1429179213125,95,-0.0652516,-0.0581702,-0.0695446,4
1429179213167,95,-0.0736288,-0.0641275,-0.0811977,0
1429179213208,95,-0.0689971,-0.0563511,-0.0714987,0
1429179213250,95,-0.0581291,-0.0423407,-0.0490294,0
1429179213291,95,-0.037116,-0.0204368,-0.0188638,0
1429179213333,95,-0.0151251,0.000860824,-0.00047678,0
1429179213375,95,-0.000581357,0.0137404,0.00510819,0
1429179213417,95,0.0121597,0.0221852,0.0103075,0
1429179213429,95,0.0262512,0.0309202,0.0278547,5
1429179213470,95,0.034682,0.033964,0.0485953,26
1429179213512,95,0.0347845,0.0306587,0.0588687,57
1429179213553,95,0.0335844,0.0321324,0.0603159,61
1429179213595,97,0.0286886,0.0317465,0.0472366,48
1429179213637,97,0.0180578,0.0257715,0.0224609,37
1429179213678,97,0.0104037,0.0168445,-0.000340894,19
1429179213720,97,0.00630387,0.00684779,-0.0168369,12
1429179213731,97,0.0104584,0.00180944,-0.0177877,10
1429179213773,97,0.0133515,-0.00504872,-0.0119487,10
1429179213784,97,0.00469737,-0.0167116,-0.0135515,10
1429179213826,97,0.00300758,-0.0209379,-0.0106418,9
1429179213867,97,-0.00925725,-0.0281853,-0.0194518,7
1429179213879,97,-0.0104959,-0.0245882,-0.0217679,6
1429179213920,97,-0.00848522,-0.0192423,-0.0218583,4
1429179213962,97,-0.00266179,-0.011317,-0.0142164,5
1429179214003,97,0.00115199,-0.00765398,-0.00726762,18
1429179214015,97,-0.00861203,-0.00945685,-0.010364,29
1429179214056,97,-0.0306282,-0.0180537,-0.0271806,50
1429179214075,97,-0.0485836,-0.0207775,-0.0434444,59
1429179214086,97,-0.0531526,-0.0178322,-0.0526743,64
1429179214128,99,-0.0412851,-0.00801712,-0.0491467,55
1429179214140,99,-0.0162261,0.0050206,-0.0253888,55
1429179214182,99,0.00763582,0.0150335,0.00959976,33
1429179214223,99,0.0183381,0.0166942,0.0421858,19
1429179214240,99,0.0271537,0.02063,0.0763947,13
1429179214281,99,0.0328988,0.0248238,0.0974708,4
1429179214308,99,0.0424195,0.0316213,0.101363,3
1429179214349,99,0.0535324,0.0376866,0.0901746,5
1429179214377,99,0.0562951,0.0337146,0.0607607,4
1429179214408,99,0.047937,0.0227235,0.024165,1
1429179214449,99,0.0246754,0.00863433,-0.01128,0
1429179214476,99,-0.00637604,-0.00297757,-0.0372243,0
1429179214517,99,-0.0346871,-0.006763,-0.0463339,0
1429179214540,99,-0.0566651,-0.00464163,-0.0421565,0
1429179214581,99,-0.0561714,-0.00132634,-0.0286587,0
1429179214623,99,-0.0444154,0.00264108,-0.0138593,6
1429179214640,99,-0.0268204,0.00941111,0.00214527,10
1429179214682,99,-0.0109911,0.0118962,0.00791376,7
1429179214709,99,-0.00320425,0.00817152,0.0021126,4
1429179214754,99,0.0041123,-0.00866369,-0.0214445,0
1429179214796,99,0.01339,-0.0294256,-0.047247,0
1429179214808,99,0.0263019,-0.0464231,-0.0710477,0
1429179214849,99,0.0403569,-0.0476356,-0.0724023,0
1429179214876,99,0.044226,-0.0337223,-0.0541038,0
1429179214917,99,0.0452285,-0.0109942,-0.0190018,0
1429179214940,99,0.0418589,0.0118905,0.0186188,0
1429179214982,99,0.0420477,0.0288077,0.0512698,0
1429179215008,99,0.0424709,0.0353834,0.067373,0
1429179215049,99,0.04064,0.032768,0.0696062,0
1429179215091,99,0.0390865,0.0314497,0.0697468,0
1429179215132,99,0.037731,0.0344248,0.0686667,0
1429179215174,99,0.0322622,0.0411194,0.0704264,31
1429179215215,99,0.0249127,0.0465524,0.0704586,64
1429179215257,99,0.0107745,0.0434814,0.062199,69
1429179215298,99,-0.00726119,0.0311462,0.0417312,66
1429179215340,99,-0.0278318,0.0148542,0.0175185,64
1429179215381,99,-0.046908,-0.00235355,-0.00906276,70
1429179215423,99,-0.0624166,-0.0186615,-0.0314688,75
1429179215464,99,-0.0718373,-0.0348838,-0.0503743,79
1429179215506,99,-0.0712082,-0.0433425,-0.0588852,77
1429179215547,99,-0.0688687,-0.0520709,-0.0688892,53
1429179215589,99,-0.0647272,-0.0579871,-0.0760228,49
1429179215631,99,-0.0584154,-0.0578418,-0.078722,43
1429179215674,99,-0.0520283,-0.0545806,-0.0806324,42
1429179215720,99,-0.0378134,-0.0442983,-0.0735251,52
1429179215732,99,-0.0191666,-0.0282351,-0.0546654,57
1429179215774,99,0.00548007,-0.00458575,-0.0209714,65
1429179215815,99,0.0254834,0.0164337,0.0143387,65
1429179215863,99,0.0393597,0.0349464,0.0469283,56
1429179215875,99,0.0451365,0.0433541,0.0638433,56
1429179215916,99,0.0460187,0.0437685,0.0651329,47
1429179215958,99,0.0492482,0.0415699,0.0601153,43
1429179216003,99,0.054993,0.0402434,0.0512291,41
1429179216014,99,0.060514,0.0387076,0.0451055,41
1429179216057,99,0.0555557,0.0302745,0.0336431,42
1429179216100,99,0.0434343,0.0185147,0.022598,44
1429179216112,99,0.0256049,0.00336062,0.0116005,44
1429179216153,99,0.0084001,-0.0106741,0.000176634,45
1429179216195,99,-0.00450923,-0.0213532,-0.00733684,46
1429179216236,99,-0.0107295,-0.026281,-0.0161331,49
1429179216278,99,-0.0175766,-0.0286368,-0.0281971,59
1429179216320,99,-0.0210384,-0.0252676,-0.0400615,80
1429179216361,99,-0.0250812,-0.0214166,-0.0483781,89
1429179216403,99,-0.0323178,-0.020449,-0.0523942,89
1429179216444,99,-0.0406914,-0.0202943,-0.0445383,83
1429179216486,99,-0.0423329,-0.0184395,-0.0272664,73
1429179216527,99,-0.0444504,-0.0197829,-0.0119701,68
1429179216569,99,-0.0420652,-0.0218168,-0.00667747,63
1429179216610,99,-0.0347473,-0.0238355,-0.0115044,61
1429179216652,99,-0.0222455,-0.019125,-0.0205176,58
1429179216694,99,-0.00862636,-0.00820994,-0.026401,56
1429179216735,99,0.000186771,0.002013,-0.0285013,50
1429179216777,99,-0.00210207,0.00266915,-0.0336448,45
1429179216818,99,-0.00998883,-0.00562164,-0.0341601,40
1429179216860,99,-0.0167975,-0.0166948,-0.0322403,45
1429179216901,99,-0.0132744,-0.0197359,-0.0211928,61
1429179216943,99,6.47163e-05,-0.0100173,-0.000878565,67
1429179216985,99,0.0235754,0.0132289,0.0220145,63
1429179217026,99,0.0403007,0.034345,0.0359508,57
1429179217067,99,0.0493807,0.049009,0.0405734,50
1429179217109,99,0.0496854,0.0522141,0.0397347,46
1429179217151,99,0.0485949,0.049547,0.0415639,42
1429179217192,99,0.0485504,0.0445763,0.0483958,41
1429179217233,99,0.0468122,0.037645,0.0568104,41
1429179217275,99,0.0438924,0.0319131,0.0650667,40
1429179217318,99,0.0358125,0.023458,0.0651433,38
1429179217360,99,0.019181,0.013343,0.0538795,38
1429179217401,99,-0.00442966,0.00161005,0.035636,38
1429179217445,99,-0.0299701,-0.0095538,0.0100205,43
1429179217457,99,-0.0497792,-0.0189481,-0.0106936,48
1429179217498,99,-0.0622444,-0.029077,-0.0288014,61
1429179217540,99,-0.0621741,-0.0364607,-0.0331125,74
1429179217581,99,-0.0531346,-0.041185,-0.0313763,73
1429179217622,99,-0.0443401,-0.0478167,-0.0265845,65
1429179217664,99,-0.0383319,-0.0548921,-0.022058,57
1429179217705,99,-0.0345359,-0.0597986,-0.0237873,48
1429179217746,99,-0.0251107,-0.0545837,-0.0225121,44
1429179217788,99,-0.0107548,-0.036725,-0.0167233,41
1429179217799,99,0.00864995,-0.0111126,-0.00924521,41
1429179217840,99,0.0218432,0.0111634,-0.0041069,40
1429179217882,99,0.0270379,0.022667,-0.00522753,38
1429179217923,99,0.0211736,0.0219014,-0.0110029,34
1429179217934,99,0.00638496,0.0119428,-0.0245708,34
1429179217976,99,-0.00408135,0.00324581,-0.0353701,32
1429179218017,99,-0.0101402,-0.0030645,-0.044208,30
1429179218058,99,-0.00895646,-0.000610685,-0.0436004,28
1429179218100,99,-0.00623883,0.00314235,-0.0353062,30
1429179218141,99,-0.00253512,0.00822344,-0.0176491,43
1429179218183,99,0.0081986,0.0162179,0.011107,57
1429179218224,99,0.01997,0.0225437,0.0363006,64
1429179218236,99,0.0297061,0.0271329,0.0518355,63
1429179218247,99,0.0347584,0.0277283,0.0509563,63
1429179218288,99,0.0389753,0.0289746,0.0412435,54
1429179218300,99,0.0350327,0.0241669,0.0234752,54
1429179218341,99,0.02282,0.0122964,0.00109231,42
1429179218353,99,-0.00020777,-0.00748716,-0.0224101,40
1429179218395,99,-0.0295903,-0.0291017,-0.0397363,35
1429179218408,99,-0.0494993,-0.041055,-0.0413034,32
1429179218449,99,-0.0523516,-0.0392496,-0.0283373,29
1429179218491,99,-0.0401731,-0.0282256,-0.0108516,27
1429179218508,99,-0.0143716,-0.00857073,0.00858083,26
1429179218549,99,0.0119416,0.0116167,0.0228444,26
1429179218576,99,0.0209614,0.0194383,0.0230032,24
1429179218617,99,0.0161313,0.0190995,0.0143193,22
1429179218640,99,0.000262567,0.00937508,0.00102884,19
1429179218681,99,-0.0130698,0.00173729,-0.00529906,16
1429179218708,99,-0.0119777,0.0044839,0.00142715,16
1429179218749,99,-0.000180412,0.0141118,0.0162914,16
1429179218776,99,0.0107716,0.0216137,0.0253858,21
1429179218817,99,0.0150518,0.0181197,0.0246449,31
1429179218840,99,0.0139489,0.00797713,0.0172239,40
1429179218881,99,0.0121107,-0.00197173,0.0101269,45
1429179218908,99,0.00850588,-0.00846443,0.00272509,41
1429179218949,99,0.00200666,-0.00918567,-0.00347213,33
1429179218976,99,-0.00665393,-0.007859,-0.00936261,23
1429179219017,99,-0.0150688,-0.00660487,-0.00942971,10
1429179219040,99,-0.0167478,-0.00506896,-0.00521301,0
1429179219081,99,-0.0166166,-0.00674114,-0.00386292,0
1429179219108,99,-0.016897,-0.0101973,-0.00902335,0
1429179219149,99,-0.0214576,-0.00551364,-0.015104,0
1429179219176,99,-0.0224699,0.0138008,-0.00667471,0
1429179219217,99,-0.008954,0.049466,0.026576,0
1429179219240,99,0.0143156,0.0827795,0.0703873,0
1429179219281,99,0.0464412,0.10572,0.114951,0
1429179219323,99,0.0762964,0.108885,0.142131,0
1429179219365,99,0.0997388,0.0931215,0.14478,0
1429179219407,99,0.109207,0.062763,0.12009,0
1429179219448,99,0.102624,0.0208267,0.0667351,0
1429179219490,99,0.0782763,-0.0258932,-0.00589638,0
1429179219532,99,0.0410712,-0.072736,-0.0836471,14
1429179219573,99,-0.0076157,-0.113748,-0.152733,32
1429179219615,99,-0.053001,-0.135037,-0.187345,39
1429179219657,99,-0.0883723,-0.135203,-0.186639,43
1429179219699,99,-0.100196,-0.109604,-0.148466,46
1429179219741,99,-0.0922941,-0.0690789,-0.0901161,54
1429179219783,99,-0.0718486,-0.0224306,-0.0281789,57
1429179219824,99,-0.0516667,0.0129429,0.014259,57
1429179219866,99,-0.0375755,0.0288464,0.0331564,56
1429179219908,99,-0.0325897,0.0273043,0.0288339,51
1429179219949,99,-0.0328494,0.0176921,0.0121382,48
1429179219995,99,-0.0306004,0.00753471,-0.00707262,42
1429179220007,99,-0.0214899,0.00142453,-0.0195409,40
1429179220049,99,-0.00394593,0.00204488,-0.0194557,37
1429179220091,99,0.0187634,0.00520022,-0.00794585,44
1429179220132,99,0.0452201,0.0172384,0.0216913,57
1429179220175,99,0.0684903,0.0342866,0.0586782,67
1429179220217,99,0.0793707,0.0499761,0.0891194,64
1429179220259,99,0.0703276,0.0555895,0.092381,54
1429179220300,99,0.0541837,0.0531548,0.0793642,48
1429179220342,99,0.0355723,0.0419602,0.0520128,41
1429179220383,99,0.0257985,0.0299876,0.0314552,39
1429179220425,99,0.0174465,0.0129673,0.011604,37
1429179220466,99,0.0104538,-0.00279206,-0.00322169,36
1429179220508,99,-0.00295245,-0.0200362,-0.0266998,37
1429179220549,99,-0.0194884,-0.0350386,-0.0519853,36
1429179220591,99,-0.0325851,-0.0440873,-0.0699741,34
1429179220633,99,-0.0354684,-0.0430793,-0.0672026,33
1429179220675,99,-0.0323941,-0.0364602,-0.0476088,36
1429179220716,99,-0.0224832,-0.0239872,-0.0171064,45
1429179220758,99,-0.0122856,-0.0112375,0.00882168,68
1429179220799,99,-0.00173201,0.00239088,0.0271143,77
1429179220841,99,0.00399524,0.0102567,0.0275677,76
1429179220882,99,0.000629527,0.00633746,0.00767013,71
1429179220924,99,-0.00932283,-0.00648197,-0.0172921,62
1429179220965,99,-0.0240964,-0.0220578,-0.0345101,57
1429179221007,99,-0.0317702,-0.0266608,-0.0250739,54
1429179221048,99,-0.0322724,-0.024051,-0.00705714,54
1429179221090,99,-0.0275547,-0.0156622,0.00843982,54
1429179221132,99,-0.0166195,-0.00635277,0.00667629,53
1429179221173,99,-0.00850819,-0.00268493,-0.00952737,50
1429179221215,99,-0.00711608,-0.00436643,-0.0307093,45
1429179221257,99,-0.00847791,-0.00753803,-0.0432465,42
1429179221299,99,-0.0083435,-0.00564651,-0.0344512,50
1429179221341,99,-0.00103671,0.00203637,-0.00808435,70
1429179221382,99,0.00899963,0.00991862,0.0182746,81
1429179221424,99,0.0190269,0.0185517,0.0371701,83
1429179221465,99,0.0267656,0.0235379,0.0385756,78
1429179221506,99,0.0338077,0.0288156,0.0255484,70
1429179221548,99,0.03677,0.0304428,0.00401858,60
1429179221589,99,0.0340451,0.0298732,-0.0108302,56
1429179221631,99,0.0253544,0.0259872,-0.0135785,57
1429179221672,99,0.0144751,0.0207597,-0.00264353,57
1429179221714,99,0.00347372,0.012883,0.0112128,55
1429179221757,99,-0.00446508,0.00350625,0.0216385,51
1429179221768,99,-0.0151068,-0.0112857,0.0156672,49
1429179221810,99,-0.0190928,-0.0197464,0.00505326,45
1429179221851,99,-0.0213599,-0.0227475,-0.00356739,44
1429179221894,99,-0.0177668,-0.0182534,-0.00641751,50
1429179221935,99,-0.0114264,-0.00897643,0.000889349,61
1429179221977,99,-0.00697746,-0.00202223,0.00996714,80
1429179222018,99,-0.00659668,-0.000751815,0.0167403,84
1429179222059,99,-0.0103004,-0.00500491,0.0191338,78
1429179222101,99,-0.0156961,-0.0108727,0.0120443,71
1429179222143,99,-0.015391,-0.0118352,0.000984324,61
1429179222185,99,-0.0176204,-0.0134902,-0.0167078,55
1429179222197,99,-0.0103046,-0.00788904,-0.0182889,53
1429179222238,99,0.00159787,0.00280281,-0.00245992,51
1429179222250,99,0.0113412,0.0116909,0.0141007,51
1429179222292,99,0.0161333,0.0182411,0.0263591,50
1429179222304,99,0.00833251,0.0148606,0.016799,48
1429179222345,99,-0.00265996,0.00535243,-0.0046607,44
1429179222386,99,-0.0123727,-0.00484703,-0.0244549,41
1429179222428,99,-0.0140969,-0.0104082,-0.0315632,38
1429179222441,99,-0.00577931,-0.00778861,-0.0214652,38
1429179222482,99,0.00461325,-0.00217746,-0.0113601,34
1429179222523,99,0.0106006,0.00237953,-0.00953021,32
1429179222564,99,0.00986794,0.00123994,-0.017907,39
1429179222608,99,0.0122882,0.00361612,-0.0193979,53
1429179222619,99,0.0188273,0.010373,-0.00893453,61
1429179222660,99,0.0278621,0.0219405,0.0118965,72
1429179222702,99,0.0305621,0.0261793,0.0324438,71
1429179222743,99,0.024159,0.0208853,0.051768,63
1429179222784,99,0.00370078,0.00207352,0.0498883,49
1429179222796,99,-0.0274157,-0.0280798,0.0235116,44
1429179222839,99,-0.0526233,-0.0548765,-0.0164336,35
1429179222850,99,-0.0634495,-0.0660415,-0.0464118,32
1429179222892,99,-0.0517868,-0.0539025,-0.0499785,27
1429179222903,99,-0.0227606,-0.0252527,-0.0252002,26
1429179222944,99,0.00355647,0.00318935,0.00183295,24
1429179222956,99,0.0124174,0.0191627,0.00976011,22
1429179222998,99,-0.00281935,0.0129408,-0.00904737,15
1429179223009,99,-0.020561,0.00236829,-0.0304651,15
1429179223051,99,-0.0339739,-0.00454791,-0.04485,7
1429179223075,99,-0.0271761,-0.002814,-0.0406257,6
1429179223117,99,-0.0015008,0.0193432,-0.00908226,0
1429179223140,99,0.0289927,0.0463553,0.0341748,0
1429179223181,99,0.0488392,0.0659216,0.071283,0
1429179223207,99,0.0553419,0.0694689,0.0966848,0
1429179223249,99,0.0540436,0.0626754,0.114252,0
1429179223276,99,0.055882,0.0519855,0.122146,0
1429179223317,99,0.059008,0.0435592,0.12168,11
1429179223340,99,0.0611513,0.0392225,0.111023,21
1429179223381,99,0.0546481,0.032467,0.0858246,46
1429179223408,99,0.0364002,0.0214527,0.0494411,49
1429179223449,99,0.0144928,0.00938872,0.0133139,47
1429179223475,99,-0.00890615,-0.00507007,-0.0227008,45
1429179223517,99,-0.0232787,-0.0171824,-0.0497075,40
1429179223558,99,-0.0298596,-0.0270216,-0.0678716,36
1429179223599,99,-0.0325151,-0.0381807,-0.083339,30
1429179223641,99,-0.0288281,-0.0465472,-0.090878,24
1429179223682,99,-0.0328328,-0.0544568,-0.101328,18
1429179223724,99,-0.0357473,-0.0554182,-0.101057,16
1429179223765,99,-0.0384876,-0.0521787,-0.0915759,14
1429179223806,99,-0.0368826,-0.0461241,-0.0712924,15
1429179223848,99,-0.0316613,-0.0402081,-0.0485656,20
1429179223890,99,-0.0165141,-0.0279515,-0.0194552,22
1429179223931,99,-0.0015761,-0.0158884,0.00208574,20
1429179223972,99,0.0119572,-0.000808999,0.0186665,27
1429179224013,99,0.0180762,0.0119609,0.0268158,51
1429179224055,99,0.0168983,0.020323,0.0279122,63
1429179224097,99,0.010169,0.0202909,0.0203436,59
1429179224138,99,0.00137848,0.0147591,0.0105146,54
1429179224180,99,-0.00479276,0.00875141,0.00413445,49
1429179224227,99,-0.00910901,0.00291854,0.00137715,44
1429179224238,99,-0.00980115,-0.00340425,0.00249549,43
1429179224279,99,-0.0154964,-0.0101799,-0.000882745,42
1429179224321,99,-0.0257768,-0.0158035,-0.00938774,44
1429179224363,99,-0.0301563,-0.0168416,-0.0198235,45
1429179224406,99,-0.0265802,-0.0135477,-0.0290287,42
1429179224447,99,-0.0128001,-0.00772507,-0.0306242,40
1429179224488,99,0.0105669,-0.00780513,-0.0255072,40
1429179224530,99,0.0377758,-0.00504829,-0.00821467,40
1429179224571,99,0.058596,0.00273172,0.0140015,39
1429179224613,99,0.077713,0.0182305,0.0397947,39
1429179224654,99,0.0863805,0.0344385,0.0549165,38
1429179224696,99,0.0720985,0.0361387,0.0439297,43
1429179224737,99,0.0510087,0.029497,0.022948,65
1429179224779,99,0.0287139,0.0158482,-0.00421269,78
1429179224820,99,0.00963132,0.00420994,-0.0311375,81
1429179224861,99,-0.00473226,-0.00370595,-0.0475721,76
1429179224903,99,-0.0314866,-0.0120846,-0.0560832,67
1429179224945,99,-0.0713921,-0.0273138,-0.0587625,63
1429179224987,99,-0.110677,-0.0450497,-0.0536459,61
1429179225030,99,-0.129387,-0.0527441,-0.0343367,63
1429179225042,99,-0.119268,-0.0497655,-0.00864991,65
1429179225083,99,-0.0817658,-0.0348697,0.019532,67
1429179225125,99,-0.0327774,-0.014149,0.0413122,66
1429179225167,99,0.0143477,0.00753923,0.0566965,60
1429179225209,99,0.0519517,0.0270501,0.0622267,56
1429179225250,99,0.0721234,0.0362279,0.0573343,50
1429179225292,99,0.067971,0.0300145,0.0433033,48
1429179225333,99,0.0550024,0.0204071,0.0317098,45
1429179225376,99,0.0352137,0.00988397,0.0157328,44
1429179225417,99,0.0228075,0.00875987,0.00317899,52
1429179225459,99,0.0254032,0.020035,-0.00294353,65
1429179225504,99,0.0411603,0.0404629,0.0041807,85
1429179225515,99,0.0596679,0.0595122,0.019139,85
1429179225556,99,0.067891,0.0678994,0.0310746,87
1429179225598,99,0.0499872,0.0514929,0.0252983,82
1429179225639,99,0.011486,0.0172832,0.00256077,73
1429179225681,99,-0.0399263,-0.0301205,-0.0373718,67
1429179225722,99,-0.0836543,-0.0693894,-0.0720298,61
1429179225764,99,-0.112724,-0.094885,-0.0933991,60
1429179225806,99,-0.111644,-0.0949804,-0.0957201,59
1429179225847,99,-0.0856358,-0.0725457,-0.0708245,57
1429179225889,99,-0.0437499,-0.0378147,-0.0315612,53
1429179225931,99,-0.00460479,-0.00669367,0.00698954,50
1429179225972,99,0.0164515,0.013516,0.031678,45
1429179226014,99,0.0203629,0.0201014,0.0340885,41
1429179226056,99,0.0215906,0.0255268,0.0298857,37
1429179226097,99,0.0215853,0.0266674,0.0179942,34
1429179226138,99,0.0186266,0.0253602,0.0104469,40
1429179226180,99,0.0205012,0.0263356,0.00793706,50
1429179226224,99,0.014603,0.0233965,0.00954519,67
1429179226235,99,0.0122993,0.0258585,0.0220723,69
1429179226276,99,0.0228726,0.036569,0.0420782,67
1429179226318,99,0.044741,0.0520506,0.0668264,61
1429179226359,99,0.0713608,0.0667539,0.0838479,52
1429179226401,99,0.0721299,0.0568821,0.0765918,44
1429179226443,99,0.0526765,0.032005,0.0520286,41
1429179226484,99,0.00820911,-0.00743189,0.00907859,40
1429179226526,99,-0.0316278,-0.036561,-0.0262042,40
1429179226567,99,-0.0606395,-0.0537897,-0.0535628,39
1429179226609,99,-0.0624118,-0.0480989,-0.0535888,37
1429179226622,99,-0.0452005,-0.0302498,-0.0416652,36
1429179226664,99,-0.0138076,-0.00345724,-0.0179799,34
1429179226705,99,0.0108952,0.0174285,0.00233573,31
1429179226747,99,0.0298184,0.030597,0.0178627,29
1429179226789,99,0.0196788,0.0221342,0.0145212,30
1429179226830,99,-0.00465838,-0.00138363,-0.00294664,39
1429179226872,99,-0.0304681,-0.0250922,-0.0203605,55
1429179226883,99,-0.0358295,-0.0326892,-0.024068,55
1429179226925,99,-0.0250071,-0.0260563,-0.0183496,59
1429179226966,99,-0.0130446,-0.0216395,-0.0176584,54
1429179227008,99,-0.00257402,-0.0183633,-0.0177995,45
1429179227019,99,0.00583885,-0.00828347,-0.00716832,45
1429179227061,99,0.00207981,-0.00269044,-0.00136093,36
1429179227102,99,-0.00579044,0.00111472,0.000727755,30
1429179227144,99,-0.00409325,0.0010797,-0.00585094,26
1429179227185,99,0.00753506,0.00338101,-0.0101208,23
1429179227226,99,0.00987082,-0.00421915,-0.0203532,20
1429179227239,99,0.00575616,-0.0124133,-0.0232441,19
1429179227281,99,-0.000160847,-0.0175621,-0.0149326,17
1429179227293,99,-0.00850136,-0.0157978,-0.000289317,15
1429179227335,99,-0.0226859,-0.0100634,0.0113869,11
1429179227346,99,-0.0304323,0.00166099,0.0147961,9
1429179227389,99,-0.0300171,0.00994789,0.00368027,3
1429179227400,99,-0.0195591,0.0141986,-0.00826569,3
1429179227442,99,-0.00987552,0.0131126,-0.017137,4
1429179227454,99,0.00374667,0.0164601,-0.00825538,4
1429179227495,99,0.0334061,0.0408313,0.0320112,19
1429179227508,99,0.0616373,0.0685307,0.0718439,24
1429179227550,99,0.0882875,0.0884691,0.107963,27
1429179227576,99,0.0874155,0.0876507,0.126768,24
1429179227617,99,0.0699513,0.0569954,0.113076,19
1429179227640,99,0.0381062,0.0135506,0.0834655,16
1429179227681,99,0.00637682,-0.026121,0.0495308,15
1429179227708,99,-0.0137742,-0.0423714,0.0275893,16
1429179227749,99,-0.0197161,-0.0325581,0.0273826,18
1429179227775,99,-0.0320872,-0.0236131,0.0095909,21
1429179227817,99,-0.0392182,-0.00982283,-0.0137313,24
1429179227859,99,-0.0403167,-0.00261407,-0.0423868,29
1429179227900,99,-0.0219939,0.00636253,-0.0630487,31
1429179227941,99,-0.0127618,0.00119865,-0.0863986,31
1429179227983,99,-0.0222883,-0.0242117,-0.120998,31
1429179228024,99,-0.0507748,-0.066383,-0.167726,32
1429179228066,99,-0.0566891,-0.106314,-0.20295,40
1429179228108,99,-0.0362098,-0.124837,-0.21052,55
1429179228149,99,0.0111445,-0.11891,-0.182074,62
1429179228191,99,0.0585114,-0.0987285,-0.131072,62
1429179228232,99,0.0932835,-0.070394,-0.0630869,59
1429179228274,99,0.086842,-0.0488702,-0.00392068,50
1429179228315,99,0.0560906,-0.0285179,0.0466094,45
1429179228357,99,0.00358387,-0.00814843,0.0811744,41
1429179228399,99,-0.0278084,0.0240022,0.111921,40
1429179228441,99,-0.0430969,0.054574,0.132839,36
1429179228482,99,-0.0393232,0.0865284,0.146341,33
1429179228524,99,-0.0182772,0.112093,0.149549,29
1429179228565,99,-0.00157062,0.128685,0.143108,27
1429179228606,99,0.00558374,0.128701,0.121677,26
1429179228648,99,-0.0202054,0.100437,0.0804844,29
1429179228690,99,-0.0590884,0.0549053,0.0314475,44
1429179228737,99,-0.0740682,0.0147759,-0.00598981,56
1429179228749,99,-0.0431741,0.00370525,-0.0138361,60
1429179228791,99,0.00986664,0.00959605,-0.00540798,60
1429179228832,99,0.0407126,0.0106459,-0.00404421,54
1429179228875,99,0.0394926,-0.00587663,-0.0160168,42
1429179228919,99,0.0187694,-0.0328843,-0.0345179,36
1429179228931,99,-0.0199037,-0.0672743,-0.0590556,32
1429179228977,99,-0.0462976,-0.0861086,-0.0746979,27
1429179228989,99,-0.0476434,-0.0794517,-0.0711935,27
1429179229032,99,-0.0145353,-0.0445668,-0.0491204,24
1429179229085,99,0.00832572,-0.0100852,-0.0269375,23
1429179229100,99,0.00967988,0.00846647,-0.0196518,23
1429179229141,99,-0.0121547,0.00956665,-0.0197108,28
1429179229186,99,-0.0339196,0.0121463,-0.00247192,31
1429179229197,99,-0.0476116,0.0184841,0.0226332,31
1429179229239,99,-0.0324459,0.0430533,0.0604899,29
1429179229281,99,0.00432819,0.0684913,0.0865295,31
1429179229322,99,0.0548145,0.0917075,0.103178,40
1429179229364,99,0.0998601,0.0916605,0.0924663,50
1429179229405,99,0.112341,0.0572836,0.048309,56
1429179229447,99,0.0893288,-0.00524089,-0.0240545,29
1429179229489,99,0.0500688,-0.0700159,-0.0908697,6
1429179229531,99,-0.00769345,-0.131417,-0.145084,0
1429179229574,99,-0.0466037,-0.156637,-0.158693,0
1429179229615,99,-0.0460408,-0.13835,-0.125707,0
1429179229657,99,-0.0373091,-0.101512,-0.0777812,0
1429179229699,99,-0.00826213,-0.0467196,-0.0211014,0
1429179229741,99,0.0078699,0.000285234,0.0216626,0
1429179229783,99,0.0106978,0.0317515,0.0486179,0
1429179229829,99,-0.00464358,0.0424492,0.0587089,0
1429179229841,99,-0.0288163,0.0398068,0.0618559,0
1429179229882,99,-0.0520879,0.0324504,0.052483,0
1429179229924,99,-0.0600622,0.0248475,0.0295191,21
1429179229966,99,-0.0402115,0.0350205,0.00811764,51
1429179230008,99,0.000823503,0.054327,-0.00581274,56
1429179230050,99,0.0407259,0.0753917,-0.00304922,53
1429179230092,99,0.0679868,0.0844268,0.0206926,40
1429179230133,99,0.0712304,0.0693095,0.0489298,29
1429179230175,99,0.0606618,0.0400073,0.0722802,23
1429179230216,99,0.0556184,0.0145058,0.0896576,23
1429179230258,99,0.0522445,0.00265941,0.0912126,24
1429179230299,99,0.042429,-0.00150141,0.0689778,24
1429179230341,99,0.0101313,-0.010891,0.0222887,23
1429179230383,99,-0.034058,-0.0221703,-0.0358433,14
1429179230425,99,-0.0760408,-0.0399987,-0.0855768,6
1429179230467,99,-0.104256,-0.0541348,-0.109641,4
1429179230508,99,-0.0949598,-0.0497984,-0.106624,23
1429179230550,99,-0.065269,-0.037079,-0.081701,70
1429179230592,99,-0.0237275,-0.0175499,-0.0467966,90
1429179230633,99,0.0293402,1.6058e-05,-0.0105555,90
1429179230675,99,0.0779564,0.0109957,0.0142213,61
1429179230717,99,0.118286,0.0136508,0.0257579,54
1429179230759,99,0.143076,0.0186348,0.0371672,49
1429179230800,99,0.133397,0.0158194,0.0387702,45
1429179230842,99,0.106845,0.0221281,0.0442607,44
1429179230884,99,0.0568994,0.0229333,0.0457494,42
1429179230896,99,-0.0124207,0.00631045,0.0285338,42
1429179230937,99,-0.0809302,-0.0145432,-7.78927e-06,42
1429179230979,99,-0.119502,-0.024065,-0.0171354,43
1429179231022,99,-0.117453,-0.0144337,-0.0135774,43
1429179231064,99,-0.0797127,0.00939015,0.0100898,46
1429179231076,99,-0.0285354,0.0340502,0.0396297,46
1429179231117,99,0.0154309,0.0482205,0.0581249,58
1429179231158,99,0.0394731,0.0455043,0.0466811,68
1429179231200,99,0.0363383,0.0278166,0.00985039,77
1429179231242,99,0.0235636,0.0126988,-0.0317364,75
1429179231253,99,-0.00159365,-0.00667008,-0.0644858,74
1429179231295,99,-0.0429023,-0.0303405,-0.0772851,70
1429179231307,99,-0.083807,-0.0565607,-0.0748422,68
1429179231350,99,-0.114956,-0.07621,-0.0575849,50
1429179231548,99,-0.126466,-0.0923335,-0.0443476,48
1429179231590,99,-0.140283,-0.102024,-0.0415452,45
1429179231601,99,-0.156415,-0.105332,-0.0466588,44
1429179231643,99,-0.172184,-0.102745,-0.054267,42
1429179231655,99,-0.173381,-0.102651,-0.072483,41
1429179231697,99,-0.198845,-0.0984521,-0.0877476,39
1429179231709,99,-0.222524,-0.070676,-0.0790376,39
1429179231751,99,-0.230217,-0.0126332,-0.0348382,42
1429179231763,99,-0.161091,0.0879766,0.0451745,42
1429179231804,99,0.0102911,0.208698,0.148592,58
1429179231815,99,0.200751,0.283179,0.218298,63
1429179231858,99,0.373305,0.294802,0.24227,67
1429179231876,99,0.448067,0.221794,0.193939,68
1429179231917,99,0.432406,0.128291,0.124619,63
1429179231939,99,0.357263,0.0512627,0.0639357,61
1429179231981,99,0.279496,0.0263166,0.0409952,52
1429179232008,99,0.210889,0.0336636,0.0488713,49
1429179232049,99,0.15546,0.0469355,0.0616079,42
1429179232091,99,0.115583,0.0453997,0.0635271,40
1429179232132,99,0.032785,-0.011706,0.0193945,39
1429179232173,99,-0.0519173,-0.0773247,-0.0389819,40
1429179232215,99,-0.129578,-0.133832,-0.0974241,41
1429179232256,99,-0.189371,-0.162469,-0.135781,41
1429179232302,99,-0.199761,-0.154073,-0.14084,39
1429179232314,99,-0.17976,-0.127226,-0.12747,38
1429179232355,99,-0.150298,-0.103511,-0.11072,36
1429179232396,99,-0.140372,-0.0978041,-0.107227,34
1429179232443,99,-0.141247,-0.106316,-0.111879,32
1429179232455,99,-0.135703,-0.106157,-0.109249,33
1429179232499,99,-0.118285,-0.0844152,-0.0933247,45
1429179232512,99,-0.0795139,-0.041451,-0.0632899,45
1429179232553,99,-0.0520772,0.0103176,-0.0253849,61
1429179232595,99,-0.0315455,0.0479989,0.0110514,62
1429179232636,99,-0.0136508,0.045549,0.0274937,56
1429179232678,99,-0.00105299,0.0205094,0.0238329,50
1429179232720,99,0.0413064,-0.00831526,0.00907504,43
1429179232762,99,0.0556629,-0.0322272,-0.0172049,40
1429179232804,99,0.0476696,-0.0391828,-0.0358865,40
1429179232845,99,0.0390092,-0.0315335,-0.0323272,40
1429179232887,99,0.0474379,-0.015389,-0.00647841,39
1429179232928,99,0.110405,0.010663,0.031985,37
1429179232970,99,0.207566,0.0434672,0.0764711,36
1429179233012,99,0.289514,0.0728126,0.10384,34
1429179233053,99,0.30789,0.0967189,0.11155,30
1429179233095,99,0.236835,0.102248,0.0996308,29
1429179233137,99,0.116506,0.0929155,0.0714051,27
1429179233178,99,-0.0113906,0.0768459,0.0427526,30
1429179233219,99,-0.12854,0.0550537,0.020888,45
1429179233261,99,-0.217901,0.027008,0.00119867,58
1429179233303,99,-0.268086,-0.00154277,-0.0117831,65
1429179233346,99,-0.288091,-0.0239558,-0.0232603,64
1429179233388,99,-0.235655,-0.0281361,-0.0181533,58
1429179233429,99,-0.123318,-0.00961816,0.00212031,51
1429179233470,99,0.0114415,0.0209379,0.0294538,42
1429179233511,99,0.0892073,0.0370355,0.0441546,39
1429179233553,99,0.151508,0.0473975,0.0535349,38
1429179233594,99,0.133181,0.0261186,0.0383586,37
1429179233635,99,0.101146,-0.00276693,0.0157033,34
1429179233677,99,0.026257,-0.0449787,-0.0189113,33
1429179233718,99,-0.030672,-0.0757686,-0.0525479,29
1429179233761,99,-0.105088,-0.0994846,-0.0857705,28
1429179233773,99,-0.119198,-0.086708,-0.0939658,26
1429179233814,99,-0.103986,-0.0545525,-0.0864353,24
1429179233860,99,-0.063907,-0.0186458,-0.0650807,20
1429179233872,99,-0.0292123,0.00735707,-0.0375892,19
1429179233913,99,0.000464527,0.0142599,-0.0155035,21
1429179233955,99,0.00186803,0.000447302,-0.00896729,39
1429179233996,99,-0.0269009,-0.0181717,-0.015686,54
1429179234042,99,-0.0354349,-0.0223561,-0.0122151,63
1429179234053,99,-0.0355985,-0.00263539,0.00653923,62
1429179234095,99,-0.0421941,0.0245741,0.0369997,56
1429179234143,99,-0.0968953,0.0482509,0.0686963,46
1429179234155,99,-0.169721,0.0444758,0.0782988,43
1429179234196,99,-0.196458,0.0345627,0.0760885,39
1429179234238,99,-0.154575,0.0190996,0.0561217,34
1429179234279,99,-0.0257112,0.0214894,0.0411885,32
1429179234321,99,0.13648,0.0409326,0.0354241,30
1429179234363,99,0.294234,0.0682441,0.0422769,28
1429179234404,99,0.386084,0.0840825,0.0524861,21
1429179234446,99,0.393072,0.0815419,0.0597177,17
1429179234488,99,0.282239,0.036572,0.0383213,11
1429179234529,99,0.124893,-0.0251706,-0.00884911,8
1429179234571,99,-0.0335755,-0.0890778,-0.0756911,4
1429179234612,99,-0.161572,-0.141764,-0.145134,4
1429179234654,99,-0.204392,-0.151986,-0.16876,17
1429179234696,99,-0.191877,-0.135602,-0.159708,30
1429179234738,99,-0.117059,-0.0978899,-0.117678,36
1429179234780,99,-0.00806678,-0.0469252,-0.0570355,21
1429179234791,99,0.0990007,-0.00170612,-0.00291206,14
1429179234833,99,0.189685,0.034892,0.0440578,1
1429179234875,99,0.261955,0.07033,0.0819006,0
1429179234886,99,0.267598,0.0852638,0.0917254,0
1429179234928,99,0.247286,0.106256,0.102062,0
1429179234969,99,0.175407,0.115719,0.0962893,0
1429179235010,99,0.0870501,0.112289,0.0877726,0
1429179235052,99,-0.0174831,0.0893877,0.0679958,0
1429179235093,99,-0.0964726,0.065136,0.0558744,0
1429179235135,99,-0.135847,0.0462039,0.0504018,0
1429179235176,99,-0.142174,0.0326135,0.0481987,0
1429179235217,99,-0.102653,0.038191,0.0489849,0
1429179235259,99,-0.0778733,0.0352898,0.0388765,0
1429179235270,99,-0.0576375,0.0327332,0.0252624,0
1429179235315,99,-0.0661447,0.0122696,0.003155,0
1429179235330,99,-0.0937574,-0.0224987,-0.0256267,0
1429179235345,99,-0.1259,-0.0681417,-0.061444,0
1429179235358,99,-0.139574,-0.107185,-0.0938936,0
1429179235399,99,-0.102263,-0.109093,-0.0978969,14
1429179235441,99,-0.0219876,-0.0717118,-0.0661738,41
1429179235482,99,0.0611059,-0.0165441,-0.0155657,39
1429179235524,99,0.1047,0.0174967,0.022103,23
1429179235565,99,0.102209,0.017996,0.0294872,12
1429179235607,99,0.0761392,-0.00254153,0.00983671,0
1429179235648,99,0.0278374,-0.0475265,-0.0382829,1
1429179235690,99,-0.0134249,-0.0824296,-0.0808347,16
1429179235732,99,-0.0379117,-0.0921903,-0.0975073,25
1429179235744,99,-0.040768,-0.069102,-0.0862348,28
1429179235785,99,-0.0336852,-0.0335877,-0.0558165,34
1429179235796,99,-0.044349,-0.0210224,-0.0347323,36
1429179235838,99,-0.0641993,-0.0353062,-0.0290517,40
1429179235849,99,-0.0737384,-0.0518265,-0.0236452,40
1429179235891,99,-0.0574492,-0.0490564,-0.0153317,34
1429179235902,99,-0.0116187,-0.0119063,0.0120265,34
1429179235944,99,0.0283348,0.0307586,0.0351926,25
1429179235955,99,0.0323608,0.0478525,0.0280704,23
1429179235997,99,0.00360372,0.0330338,-0.00690799,22
1429179236009,99,-0.0506681,-0.019501,-0.0610264,25
1429179236050,99,-0.105838,-0.0875476,-0.116589,41
1429179236076,99,-0.157964,-0.160419,-0.160568,65
1429179236117,99,-0.187362,-0.21114,-0.190225,82
1429179236140,99,-0.188396,-0.238974,-0.188106,81
1429179236182,99,-0.16857,-0.231506,-0.179409,69
1429179236208,99,-0.134856,-0.189287,-0.140917,56
1429179236249,99,-0.100578,-0.106224,-0.0845011,41
1429179236276,99,-0.0857437,-0.0247526,-0.0122375,23
1429179236317,99,-0.0633478,0.0742654,0.0810824,3
1429179236359,99,-0.0318516,0.16374,0.175629,0
1429179236400,99,0.0111744,0.219271,0.237345,0
1429179236443,99,0.070405,0.247187,0.2641,0
1429179236484,99,0.138044,0.25191,0.266248,0
1429179236526,99,0.162344,0.204269,0.220158,0
1429179236567,99,0.166418,0.134221,0.162819,14
1429179236718,99,0.145522,0.0592086,0.0985094,26
1429179236775,99,0.114345,0.00174361,0.031081,70
1429179236818,99,0.0913671,-0.0487107,-0.0473614,81
1429179236859,99,0.0923088,-0.0754666,-0.114321,68
1429179236901,99,0.102893,-0.0979846,-0.167721,55
1429179236943,99,0.12038,-0.0929722,-0.191005,38
1429179236990,99,0.132016,-0.0674112,-0.169529,17
1429179237002,99,0.133151,-0.0202421,-0.107606,17
1429179237048,99,0.139409,0.0552568,0.00590441,17
1429179237065,99,0.125044,0.111594,0.113799,22
1429179237078,99,0.0898249,0.139829,0.183245,28
1429179237119,99,0.0313296,0.123637,0.194636,38
1429179237161,99,-0.0339826,0.0837636,0.156404,41
1429179237202,99,-0.0881745,0.0409457,0.0975469,41
1429179237244,99,-0.120103,0.00853401,0.0468568,45
1429179237285,99,-0.127902,-0.00444041,0.013783,48
1429179237329,99,-0.10262,0.0144347,0.0167062,50
1429179237343,99,-0.0627564,0.0378387,0.0366795,54
1429179237384,99,-0.0402944,0.0447887,0.0391939,75
1429179237426,99,-0.0380295,0.0290471,0.0128906,127
1429179237467,99,-0.0471492,0.000911073,-0.0234159,127
1429179237509,99,-0.0593404,-0.037654,-0.0696078,127
1429179237550,99,-0.0583519,-0.0624845,-0.0874622,127
1429179237592,99,-0.0398923,-0.0676946,-0.0720408,80
1429179237634,99,-0.0169793,-0.0599477,-0.041203,72
1429179237676,99,0.00986009,-0.0474639,-0.00982303,63
1429179237717,99,0.0211251,-0.0409066,0.00418722,58
1429179237760,99,0.0248408,-0.036373,0.00557862,53
1429179237801,99,0.0194437,-0.0331714,-0.00327211,50
1429179237846,99,0.0199055,-0.0216427,-0.00875729,48
1429179237858,99,0.013847,-0.0112717,-0.018038,47
1429179237900,99,0.0161787,0.0033113,-0.0193291,45
1429179237942,99,0.013412,0.00908272,-0.0243467,40
1429179237983,99,0.0166738,0.0120001,-0.0269854,38
1429179238026,99,0.0176049,0.0105948,-0.0281617,40
1429179238069,99,0.0276644,0.00983471,-0.0206423,49
1429179238080,99,0.0390924,0.0124667,-0.00685351,56
1429179238122,99,0.0451868,0.014383,0.00689209,68
1429179238164,99,0.0485044,0.02853,0.0297105,71
1429179238205,99,0.0344034,0.0395184,0.0449472,68
1429179238247,99,0.0194189,0.0478093,0.0500794,63
1429179238258,99,0.00610316,0.044577,0.0409811,61
1429179238300,99,0.010553,0.0370626,0.0319915,56
1429179238341,99,0.0081385,0.0196342,0.0129079,51
1429179238382,99,-0.00369378,-0.0015,-0.00643172,47
1429179238424,99,-0.0268839,-0.0178745,-0.0126395,48
1429179238465,99,-0.0467268,-0.0204456,0.000182156,53
1429179238509,99,-0.059969,-0.017949,0.00875757,56
1429179238522,99,-0.0755375,-0.0218816,-0.00556079,57
1429179238563,99,-0.0917822,-0.0381434,-0.0443757,56
1429179238605,99,-0.103544,-0.0617528,-0.0919404,54
1429179238646,99,-0.0888606,-0.0663221,-0.104797,52
1429179238692,99,-0.0477984,-0.047015,-0.077748,55
1429179238704,99,-0.00538436,-0.0128497,-0.0263359,60
1429179238748,99,0.0170014,0.0185448,0.0199103,80
1429179238760,99,0.0190905,0.0471854,0.0597866,86
1429179238802,99,0.00352919,0.060048,0.0780893,92
1429179238847,99,-0.0094478,0.067959,0.0927373,89
1429179238858,99,-1.3362e-05,0.0616413,0.0922147,89
1429179238900,99,0.0280633,0.0321756,0.0592938,82
1429179238941,99,0.0546116,-0.021514,-0.00954534,77
1429179238983,99,0.067536,-0.0801728,-0.0908213,72
1429179239024,99,0.0600322,-0.131826,-0.154252,71
1429179239066,99,0.0287143,-0.162628,-0.187373,70
1429179239108,99,-0.00504456,-0.161744,-0.175507,68
1429179239119,99,-0.0274226,-0.127256,-0.128726,66
1429179239160,99,-0.0211483,-0.0547708,-0.0501273,59
1429179239202,99,-0.00415735,0.0203936,0.0272205,54
1429179239243,99,0.0174595,0.0860196,0.0901965,49
1429179239255,99,0.0301831,0.119255,0.117664,46
1429179239297,99,0.0358783,0.121677,0.11773,39
1429179239339,99,0.0335163,0.101535,0.0931028,39
1429179239381,99,0.0326752,0.0793767,0.0619952,50
1429179239393,99,0.030303,0.060747,0.0299874,50
1429179239435,99,0.0343854,0.0565104,0.0191759,61
1429179239446,99,0.0397468,0.0562086,0.0233793,61
1429179239487,99,0.0415391,0.0504409,0.0361351,56
1429179239499,99,0.0362415,0.0326675,0.0467376,52
1429179239540,99,0.0257114,0.00768351,0.0477821,45
1429179239552,99,0.00708627,-0.0163701,0.043362,41
1429179239593,99,-0.0208415,-0.0358078,0.0293184,35
1429179239608,99,-0.0503394,-0.0481677,0.00446346,32
1429179239649,99,-0.0713506,-0.0515509,-0.022144,25
1429179239676,99,-0.0777553,-0.0491315,-0.0491815,23
1429179239717,99,-0.0749487,-0.0491166,-0.0712371,18
1429179239740,99,-0.0552296,-0.042594,-0.0729237,17
1429179239781,99,-0.0202636,-0.023247,-0.0435188,13
1429179239808,99,0.0160485,0.00793552,0.000658512,11
1429179239849,99,0.0418867,0.0411716,0.0430014,3
1429179239875,99,0.0437131,0.0560873,0.0623046,1
1429179239917,99,0.0284588,0.0491658,0.0493835,0
1429179239940,99,-0.00318605,0.0161603,0.0141286,0
1429179239981,99,-0.0344602,-0.0262448,-0.0257603,10
1429179240009,99,-0.0509385,-0.06008,-0.0511399,18
1429179240044,99,-0.0445398,-0.0680252,-0.0472271,33
1429179240075,99,-0.0283483,-0.0572185,-0.0259446,41
1429179240117,99,-0.00588911,-0.0326929,0.00327021,37
1429179240139,99,0.0010615,-0.021596,0.00224904,34
1429179240181,99,0.000191774,-0.0150789,-0.0121604,23
1429179240207,99,-0.00950932,-0.0192778,-0.0403491,20
1429179240249,99,-0.0184034,-0.0241221,-0.0529663,13
1429179240276,99,-0.0165892,-0.0166455,-0.0503047,12
1429179240317,99,-0.00208812,0.00160746,-0.0303836,12
1429179240339,99,0.0133629,0.0188395,-0.0130357,13
1429179240380,99,0.018605,0.0213012,-0.0104973,16
1429179240407,99,0.0148403,0.0142929,-0.0140935,15
1429179240449,99,0.00560712,0.000982965,-0.0181973,12
1429179240476,99,-0.0128003,-0.0143317,-0.0220555,11
1429179240517,99,-0.0384961,-0.0359405,-0.0288112,8
1429179240559,99,-0.0674541,-0.0571021,-0.041243,5
1429179240600,99,-0.0862482,-0.0661195,-0.0539534,5
1429179240642,99,-0.0944493,-0.0707291,-0.0662194,17
1429179240683,99,-0.0764416,-0.0576608,-0.0575606,41
1429179240726,99,-0.0422656,-0.0271797,-0.0233648,52
1429179240768,99,0.00751538,0.0180684,0.0309124,50
1429179240811,99,0.0591203,0.0685959,0.0914902,43
1429179240855,99,0.0933437,0.0964757,0.125826,33
1429179240867,99,0.0947276,0.0926094,0.121073,30
1429179240908,99,0.0709297,0.0762228,0.0967557,27
1429179240949,99,0.0278757,0.0464393,0.0508716,28
1429179240991,99,0.00450894,0.0350345,0.030695,30
1429179241033,99,0.00696659,0.0347684,0.0329765,32
1429179241075,99,0.0323117,0.0517039,0.0612974,32
1429179241117,99,0.0559777,0.0676846,0.0862975,29
1429179241159,99,0.0634295,0.0718996,0.090166,25
1429179241200,99,0.0579676,0.0658699,0.0706627,19
1429179241242,99,0.0449475,0.0437522,0.0345607,21
1429179241283,99,0.0395278,0.0294043,0.00907186,39
1429179241324,99,0.034634,0.0250657,-0.00056974,51
1429179241366,99,0.0378515,0.0314454,0.0085107,56
1429179241409,99,0.0343403,0.0285385,0.0110014,54
1429179241451,99,0.0169998,0.000467192,-0.00798289,46
1429179241493,99,-0.0210929,-0.054132,-0.0562797,40
1429179241536,99,-0.0729157,-0.125411,-0.126828,35
1429179241578,99,-0.112917,-0.173577,-0.175227,34
1429179241619,99,-0.128939,-0.175364,-0.176078,36
1429179241661,99,-0.0975465,-0.122893,-0.115846,37
1429179241703,99,-0.0318018,-0.0357118,-0.0173799,37
1429179241747,99,0.0427695,0.0506549,0.0811354,37
1429179241759,99,0.110136,0.122225,0.159629,37
1429179241800,99,0.133654,0.153052,0.183774,37
1429179241843,99,0.109158,0.142579,0.150962,42
1429179241885,99,0.055336,0.0975705,0.0765183,58
1429179241926,99,0.00728077,0.0390481,-0.0033716,65
1429179241968,101,-0.0291811,-0.0287282,-0.082078,62
1429179242009,101,-0.0356789,-0.0794108,-0.13038,55
1429179242055,101,-0.0326532,-0.112234,-0.147719,44
1429179242066,101,-0.0187787,-0.109357,-0.127554,41
1429179242108,101,0.00162854,-0.0726213,-0.0759415,39
1429179242150,101,0.0193734,-0.0209707,-0.0197586,37
1429179242192,101,0.0316163,0.0283339,0.033049,37
1429179242234,101,0.0177127,0.0486958,0.0528304,36
1429179242275,101,-0.0189205,0.0387251,0.0422205,35
1429179242321,101,-0.0597512,0.0171816,0.020367,34
1429179242332,101,-0.0857846,-0.000607127,0.00674874,34
1429179242374,101,-0.0832829,-0.00636148,0.0108408,38
1429179242415,101,-0.0564799,0.000656296,0.0307618,46
1429179242458,101,-0.0171683,0.0150816,0.047074,61
1429179242500,101,0.0226175,0.0306005,0.0553432,64
1429179242542,103,0.0468396,0.0424661,0.048771,59
1429179242584,103,0.0404241,0.0375805,0.0255077,50
1429179242626,103,0.0104517,0.0190603,-0.00351912,44
1429179242668,103,-0.028009,-0.0105402,-0.0316821,40
1429179242709,103,-0.0597098,-0.0394086,-0.0565713,38
1429179242751,103,-0.0551704,-0.0461398,-0.0527701,36
1429179242793,103,-0.0368773,-0.0380929,-0.0373539,35
1429179242804,103,0.00656896,-0.00542088,2.43631e-06,35
1429179242816,103,0.0434437,0.0261334,0.0331208,35
1429179242857,103,0.0588253,0.047551,0.0543934,33
1429179242898,103,0.0420961,0.049674,0.0544461,34
1429179242940,103,0.0173145,0.041928,0.0436303,47
1429179242982,103,-0.00450289,0.0388856,0.0382473,60
1429179243024,103,-0.0127701,0.0311258,0.0284236,64
1429179243066,103,-0.00267249,0.0171435,0.013288,59
1429179243078,103,0.00959035,-0.00576831,-0.0134077,56
1429179243120,103,0.0247689,-0.047597,-0.0610628,46
1429179243162,103,0.0285473,-0.0902365,-0.105893,40
1429179243204,103,0.0276357,-0.108064,-0.118814,37
1429179243246,103,0.00852667,-0.0986327,-0.098328,40
1429179243287,103,-0.0149762,-0.0737124,-0.0601718,40
1429179243329,103,-0.025376,-0.0439105,-0.012292,40
1429179243370,103,-0.0261931,-0.0317208,0.0104202,36
1429179243412,103,-0.0127695,-0.0355227,-0.00149162,36
1429179243453,103,0.00266468,-0.0338018,-0.0203315,47
1429179243495,103,0.010028,-0.0279634,-0.0399514,58
1429179243539,103,0.00281753,-0.0130851,-0.0406484,62
1429179243552,103,-0.017293,0.0109177,-0.0111695,60
1429179243594,103,-0.0382708,0.0402095,0.0428463,54
1429179243635,103,-0.0490152,0.0669864,0.0910161,46
1429179243678,103,-0.0348861,0.0939747,0.120079,38
1429179243690,103,-0.00593975,0.110333,0.115658,36
1429179243732,103,0.0230065,0.107549,0.0797623,34
1429179243774,103,0.0403469,0.0849377,0.0302476,33
1429179243785,103,0.0380985,0.0480013,-0.0153898,33
1429179243827,103,0.0208054,0.0096844,-0.046722,31
1429179243839,103,0.00441856,-0.0137772,-0.0532135,30
1429179243881,103,-0.00372948,-0.0203626,-0.0477296,29
1429179243922,103,-0.000875435,-0.0164099,-0.0380521,26
1429179243934,103,0.00649116,-0.0135686,-0.0307386,26
1429179243975,103,0.0167652,-0.0122792,-0.0184101,34
1429179243987,103,0.0224589,-0.016121,0.000909061,34
1429179244028,103,0.0237591,-0.0211185,0.0229176,53
1429179244040,103,0.02468,-0.0187494,0.0435456,57
1429179244082,103,0.0200626,-0.014024,0.0472218,59
1429179244094,103,0.0133143,-0.00804215,0.0357269,57
1429179244136,105,0.00603901,-0.00788885,0.0109606,51
1429179244177,105,-0.0067793,-0.0208617,-0.0204846,40
1429179244189,105,-0.0259604,-0.0461288,-0.049007,38
1429179244231,105,-0.0507868,-0.0762507,-0.0679924,33
1429179244273,105,-0.0717238,-0.0979307,-0.0743866,29
1429179244285,105,-0.0775509,-0.102233,-0.0710401,29
1429179244328,105,-0.0620551,-0.0767211,-0.0532035,27
1429179244344,105,-0.0302246,-0.030996,-0.0273675,26
1429179244386,105,0.00885835,0.0169064,0.00195074,23
1429179244408,105,0.0366484,0.0508118,0.0198766,19
1429179244449,105,0.0441808,0.0566659,0.0229156,16
1429179244476,105,0.0349425,0.0469467,0.0235578,12
1429179244517,105,0.012082,0.0299208,0.0250444,10
1429179244543,105,-0.010815,0.0192102,0.0367538,16
1429179244585,105,-0.0279779,0.0149005,0.044981,29
1429179244607,105,-0.039743,0.00898996,0.0411999,44
1429179244643,105,-0.0478348,-0.00589224,0.0247583,53
1429179244676,105,-0.0509822,-0.020389,0.00625088,55
1429179244708,105,-0.0442474,-0.0262494,-0.000662157,53
1429179244749,105,-0.0304846,-0.0150477,0.00968666,50
1429179244790,105,-0.0126535,0.0125283,0.0304282,48
1429179244832,105,-0.00707767,0.0374768,0.040453,50
1429179244874,105,-0.000742922,0.057523,0.0412828,57
1429179244916,105,0.0117647,0.0620594,0.0304079,59
1429179244957,105,0.0349462,0.0528957,0.0194556,57
1429179244999,105,0.073061,0.0374711,0.0130485,54
1429179245041,105,0.108273,0.0270227,0.00848312,47
1429179245082,105,0.128418,0.0266372,0.00373558,44
1429179245124,105,0.128543,0.0321362,-0.000564123,41
1429179245165,105,0.107921,0.042007,-0.000511859,41
1429179245207,105,0.0781142,0.0414793,-0.00104796,56
1429179245249,105,0.0420443,0.0222942,-0.0120512,70
1429179245290,105,0.00933014,-0.0140153,-0.0343898,79
1429179245332,105,-0.0152432,-0.0514152,-0.0594034,73
1429179245373,105,-0.0346422,-0.0810737,-0.0766353,60
1429179245415,105,-0.0497849,-0.0915469,-0.0739021,52
1429179245456,105,-0.078477,-0.101748,-0.069809,45
1429179245504,105,-0.109394,-0.103536,-0.0586748,43
1429179245515,105,-0.130784,-0.0976191,-0.0430855,43
1429179245556,105,-0.131727,-0.0812891,-0.0247782,43
1429179245598,105,-0.101697,-0.0431669,0.00545484,43
1429179245639,105,-0.0668701,-0.00271279,0.0235929,42
1429179245681,105,-0.0329785,0.0386337,0.0413059,40
1429179245724,105,-0.0117611,0.0631321,0.0454543,36
1429179245765,105,0.005619,0.0727293,0.0476316,33
1429179245809,105,0.0264244,0.0711874,0.0526945,31
1429179245821,105,0.0497917,0.0621348,0.0599318,31
1429179245863,105,0.0698984,0.0526246,0.0641062,40
1429179245905,105,0.0769357,0.0479091,0.0558938,54
1429179245946,105,0.0624114,0.0398889,0.0350823,68
1429179245987,105,0.0344315,0.0319428,0.0110568,67
1429179246029,105,0.00702715,0.0197952,-0.00842769,59
1429179246070,105,-0.00589665,0.00766325,-0.0178673,52
1429179246112,105,-0.00569034,-0.00994571,-0.0279202,41
1429179246153,105,-0.00572441,-0.0346472,-0.0501816,36
1429179246195,105,-0.0040846,-0.0530519,-0.0688981,33
1429179246237,105,-0.0109223,-0.0640945,-0.0793982,32
1429179246278,105,-0.0133783,-0.0584613,-0.0707893,28
1429179246320,105,-0.0289564,-0.0574463,-0.0672368,25
1429179246362,105,-0.0408421,-0.0528638,-0.0596601,17
1429179246405,105,-0.0427226,-0.0460207,-0.0468052,12
1429179246448,105,-0.0315425,-0.0278365,-0.0257206,5
1429179246490,105,0.00172031,0.00903422,0.0198206,5
1429179246532,105,0.026516,0.0389228,0.0532015,16
1429179246574,105,0.0416054,0.0558852,0.0694656,25
1429179246615,105,0.0470722,0.0578908,0.0661111,24
1429179246657,105,0.0538612,0.0599,0.062422,20
1429179246698,105,0.0659655,0.0662549,0.0623062,14
1429179246744,105,0.0708808,0.0705695,0.0690607,9
1429179246757,105,0.0543552,0.05322,0.0669644,9
1429179246800,105,0.0196523,0.0187228,0.0498045,7
1429179246812,105,-0.0163615,-0.0168156,0.0262316,8
1429179246854,105,-0.0314623,-0.0300194,0.00556437,9
1429179246895,105,-0.0335531,-0.0294376,-0.0156897,10
1429179246937,105,-0.0112324,-0.004551,-0.0139138,8
1429179246978,105,0.0131487,0.0195854,-0.00484024,6
1429179247022,105,0.018142,0.0286289,-0.00460679,4
1429179247034,105,-0.00202445,0.0158739,-0.014318,3
1429179247075,105,-0.0463753,-0.0138656,-0.0387233,1
1429179247117,105,-0.0850365,-0.0493571,-0.0708929,9
1429179247159,105,-0.0974617,-0.0653349,-0.0768124,25
1429179247200,105,-0.0891282,-0.0633855,-0.0590949,46
1429179247244,105,-0.0573344,-0.0327741,-0.00326201,47
1429179247256,105,-0.0128172,0.0174011,0.077354,47
1429179247297,105,0.0155376,0.0661516,0.140235,40
1429179247339,105,0.0306428,0.0963078,0.164123,34
1429179247381,105,0.0238488,0.0866843,0.119915,27
1429179247423,105,-0.00095117,0.0342887,0.0131079,26
1429179247465,105,-0.0250983,-0.0332845,-0.102106,27
1429179247507,105,-0.0452987,-0.100493,-0.198717,27
1429179247548,105,-0.0373262,-0.130433,-0.231123,25
1429179247590,105,-0.0053786,-0.122375,-0.199023,23
1429179247631,105,0.0367931,-0.0742912,-0.123546,22
1429179247674,105,0.0848911,-0.00958861,-0.034548,20
1429179247685,105,0.117927,0.0438831,0.0389996,20
1429179247727,105,0.14337,0.0767211,0.0926138,24
1429179247769,105,0.147348,0.0791288,0.117104,42
1429179247780,105,0.142036,0.0698323,0.1257,49
1429179247822,105,0.113254,0.0538103,0.112903,59
1429179247863,105,0.0702778,0.041597,0.0912924,55
1429179247905,105,0.0194703,0.037431,0.0721588,48
1429179247917,105,-0.0250177,0.0400773,0.0620315,45
1429179247958,105,-0.0541801,0.0404859,0.0561324,42
1429179248000,105,-0.0661515,0.0382184,0.0524356,42
1429179248041,105,-0.0659214,0.0228363,0.0354195,44
1429179248083,105,-0.064357,-0.000182057,0.0072923,48
1429179248125,105,-0.0566887,-0.0117299,-0.0155893,51
1429179248166,105,-0.0531633,-0.0124833,-0.0299154,55
1429179248208,105,-0.0421658,-0.000224221,-0.0284398,54
1429179248219,105,-0.0414872,0.00138474,-0.0332298,52
1429179248261,105,-0.0368422,-0.00121125,-0.0330499,49
1429179248273,105,-0.0385579,-0.0134416,-0.0375436,48
1429179248314,105,-0.049196,-0.0354817,-0.0487464,45
1429179248326,105,-0.0529114,-0.0506969,-0.0473225,45
1429179248367,105,-0.0461104,-0.0539071,-0.0387584,49
1429179248409,105,-0.0254381,-0.0442578,-0.0207595,60
1429179248450,105,0.00573725,-0.0182299,0.00197839,80
1429179248492,105,0.0311777,0.00704513,0.0139114,87
1429179248504,105,0.0470469,0.0270407,0.0200077,86
1429179248547,105,0.0474569,0.031702,0.0167017,78
1429179248559,105,0.0442689,0.0294916,0.0198763,78
1429179248601,105,0.0438124,0.0283997,0.0284303,68
1429179248612,105,0.0387292,0.0218589,0.0323312,68
1429179248653,105,0.02961,0.00941979,0.0284375,58
1429179248665,105,0.0125976,-0.00501994,0.0123273,56
1429179248707,105,-0.0100992,-0.0211763,-0.0114666,54
1429179248718,105,-0.0310042,-0.0345024,-0.0365785,54
1429179248760,105,-0.0348644,-0.0328512,-0.051966,56
1429179248776,105,-0.0292592,-0.0261135,-0.0551987,57
1429179248817,105,-0.0220318,-0.0183008,-0.0532664,56
1429179248844,105,-0.0106197,-0.00833944,-0.0509691,55
1429179248885,105,0.00850163,0.00783855,-0.035767,52
1429179248907,105,0.0166064,0.0141308,-0.0306455,51
1429179248944,105,0.0224223,0.0149083,-0.0259816,49
1429179248975,105,0.0212599,0.0124363,-0.0127833,48
1429179249018,105,0.0185199,0.00852783,-0.000391782,45
1429179249060,105,0.021424,0.00928844,0.00978056,44
1429179249102,105,0.026773,0.0194362,0.0220255,54
1429179249143,105,0.0255254,0.0220766,0.0287721,68
1429179249185,105,0.0172518,0.023002,0.0346993,80
1429179249227,105,-0.0060503,0.0190603,0.0426491,78
1429179249270,105,-0.0438052,0.014672,0.053527,70
1429179249312,105,-0.0787596,-0.000803289,0.0511638,65
1429179249355,105,-0.0972314,-0.0328311,0.0224555,60
1429179249396,105,-0.0755277,-0.0680551,-0.0180682,59
1429179249438,105,-0.0179602,-0.0917069,-0.0582834,61
1429179249479,105,0.0496168,-0.0871931,-0.0734798,62
1429179249521,105,0.0953912,-0.063394,-0.0582074,61
1429179249562,105,0.103444,-0.0293034,-0.0178138,59
1429179249604,105,0.0706304,-0.000136283,0.0203628,55
1429179249645,105,0.0278946,0.0251337,0.0505325,52
1429179249687,105,-0.0142412,0.0409306,0.0534205,49
1429179249729,105,-0.0335258,0.053854,0.0427373,45
1429179249771,105,-0.0397854,0.0566326,0.0175731,38
1429179249814,105,-0.0445657,0.0495,-0.00436004,36
1429179249856,105,-0.0538709,0.0307299,-0.021243,47
1429179249898,105,-0.063198,0.00543319,-0.029844,60
1429179249946,105,-0.0592286,-0.0144882,-0.0271934,70
1429179249958,105,-0.0366233,-0.0198147,-0.0162985,69
1429179250000,105,-0.00577314,-0.0153801,-0.00971518,63
1429179250042,105,0.00651479,-0.0203436,-0.0232474,57
1429179250083,105,0.00401786,-0.0319948,-0.0467226,49
1429179250125,105,-0.0126838,-0.0482611,-0.0690654,45
1429179250166,105,-0.0347687,-0.0637675,-0.0801807,46
1429179250207,105,-0.0449802,-0.0673314,-0.0662606,49
1429179250249,105,-0.0469469,-0.0614175,-0.0492392,49
1429179250293,105,-0.0272993,-0.0391436,-0.0197099,48
1429179250305,105,-0.00631314,-0.0150177,0.00606298,46
1429179250347,105,0.0149472,0.00792723,0.0298348,44
1429179250389,105,0.0279657,0.0244403,0.0481921,40
1429179250430,105,0.0313304,0.0278249,0.0523903,37
1429179250481,105,0.0309777,0.0252923,0.0418058,32
1429179250492,105,0.024225,0.0168081,0.0185368,32
1429179250534,105,0.0210422,0.0151225,0.00247395,29
1429179250576,105,0.0224978,0.02175,-0.00116359,29
1429179250617,105,0.0237177,0.0330788,0.00620961,42
1429179250659,105,0.0220929,0.039234,0.0182723,55
1429179250700,105,0.0205379,0.0390985,0.0319895,62
1429179250741,105,0.0129763,0.025762,0.0271044,59
1429179250783,105,0.0123919,0.0142886,0.0301052,52
1429179250824,105,0.00944812,0.00359267,0.0269009,41
1429179250866,105,0.00849033,-0.00109124,0.0301504,34
1429179250907,105,-0.0137056,-0.0186624,0.0202884,28
1429179250949,105,-0.0372947,-0.0346724,0.00368229,28
1429179250990,105,-0.0606524,-0.0509199,-0.0167559,27
1429179251032,105,-0.0623211,-0.0517755,-0.0222072,24
1429179251073,105,-0.049343,-0.0414788,-0.00853866,19
1429179251115,105,-0.0422947,-0.0368967,-0.0120471,17
1429179251157,105,-0.0579834,-0.0521146,-0.0370304,14
1429179251198,105,-0.0708011,-0.0625161,-0.0599284,13
1429179251240,105,-0.0582739,-0.0537753,-0.0619478,13
1429179251281,105,-0.0311961,-0.0253293,-0.0419601,20
1429179251323,105,0.00172355,0.00347759,-0.0220575,38
1429179251366,105,0.0107399,0.0154392,-0.0190795,47
1429179251408,105,0.0129803,0.0143663,-0.0249184,48
1429179251449,105,-0.00382611,0.00849757,-0.0368132,45
1429179251490,105,-0.0244156,0.0066873,-0.0405169,39
1429179251531,105,-0.0386433,0.00842956,-0.0325657,34
1429179251573,105,-0.0435826,0.0167857,-0.0101394,29
1429179251614,105,-0.0359345,0.0283828,0.01454,28
1429179251656,105,-0.00728629,0.0495074,0.0419824,30
1429179251702,105,0.0425187,0.0759709,0.0726889,30
1429179251743,105,0.10807,0.0997044,0.10076,28
1429179251786,105,0.160109,0.106733,0.110639,27
1429179251799,105,0.197944,0.0999284,0.106814,27
1429179251841,105,0.207725,0.0805603,0.0914899,27
1429179251882,105,0.195073,0.0598834,0.0747047,27
1429179251924,105,0.153601,0.0370118,0.0563872,38
1429179251966,105,0.0901281,0.0164369,0.040054,49
1429179252008,105,0.0407941,0.0107189,0.0379475,58
1429179252020,105,0.0200818,0.0197097,0.0505127,58
1429179252061,105,0.0190676,0.035512,0.0668074,51
1429179252073,105,0.0231217,0.0435202,0.0745159,48
1429179252115,105,0.00629776,0.0300919,0.0594872,42
1429179252128,105,-0.0348629,-0.00668979,0.0121712,40
1429179252140,105,-0.087783,-0.0497618,-0.0479872,39
1429179252182,105,-0.135439,-0.0860198,-0.101804,37
1429179252194,105,-0.162908,-0.104923,-0.137504,37
1429179252235,105,-0.159789,-0.100029,-0.138497,37
1429179252277,105,-0.130118,-0.0771536,-0.106654,38
1429179252319,105,-0.0985292,-0.0556544,-0.0737112,36
1429179252361,105,-0.069076,-0.0426298,-0.0498459,31
1429179252373,105,-0.0503053,-0.0393372,-0.039823,30
1429179252414,105,-0.0291001,-0.028849,-0.0274921,26
1429179252456,105,-0.0134067,-0.0209608,-0.0219197,22
1429179252468,105,0.00323476,-0.00367872,-0.00967406,22
1429179252510,105,0.00890732,0.00434085,-0.00944312,28
1429179252522,105,0.00979944,0.0097464,-0.0118866,33
1429179252564,105,0.0159284,0.0158453,-0.00782929,45
1429179252606,105,0.0271798,0.0231994,0.00286912,57
1429179252647,105,0.0363791,0.0248414,0.0158902,55
1429179252659,105,0.043343,0.0254859,0.0321711,52
1429179252701,105,0.047666,0.0234005,0.0450254,46
1429179252712,105,0.0547347,0.0267056,0.0570046,43
1429179252754,105,0.0609253,0.0331119,0.0611481,37
1429179252776,105,0.068606,0.0445882,0.0627465,33
1429179252818,105,0.0614596,0.0459305,0.0511192,33
1429179252844,105,0.041653,0.03853,0.0357308,35
1429179252885,105,0.0154492,0.0245922,0.0191216,37
1429179252907,105,-0.0122551,0.00499364,-0.000809877,37
1429179252949,105,-0.0255153,-0.00528406,-0.00884423,36
1429179252975,105,-0.0238251,-0.00670349,-0.012028,34
1429179253017,105,-0.013204,-0.00133279,-0.0066563,31
1429179253044,105,0.00199054,0.00712306,0.00213075,29
1429179253085,105,0.00734725,0.00913003,0.00297432,28
1429179253109,105,0.00183119,0.00431247,-0.00281456,30
1429179253150,105,-0.0154941,-0.0112927,-0.0180335,41
1429179253176,105,-0.0354588,-0.0292341,-0.0336887,57
1429179253218,105,-0.0540222,-0.0453383,-0.0465704,71
1429179253243,105,-0.0655404,-0.0540026,-0.0540417,77
1429179253285,105,-0.0682914,-0.0537145,-0.0540417,76
1429179253327,105,-0.0708188,-0.0519706,-0.0531928,68
1429179253369,105,-0.0651408,-0.0471691,-0.0482676,62
1429179253411,105,-0.0489921,-0.0374248,-0.0385556,57
1429179253453,105,-0.0176487,-0.0200054,-0.0165627,56
1429179253494,105,0.01993,0.00178947,0.0105604,56
1429179253536,105,0.0505068,0.0211263,0.0362873,56
1429179253577,105,0.0553985,0.0259561,0.0396178,54
1429179253619,105,0.0411905,0.0240044,0.0357712,52
1429179253660,105,0.0185186,0.018537,0.0205832,51
1429179253702,105,0.00220802,0.0154316,0.0140562,49
1429179253743,105,-0.000777397,0.0171432,0.011531,48
1429179253785,105,0.0118173,0.0260807,0.0230063,56
1429179253826,105,0.0298113,0.0370943,0.0398727,75
1429179253867,105,0.0379581,0.0414062,0.0505377,83
1429179253909,105,0.0420932,0.0422009,0.0560985,80
1429179253950,105,0.0428333,0.0395618,0.053226,73
1429179253993,105,0.039013,0.0288288,0.035135,60
1429179254005,105,0.0268826,0.0107772,0.0103577,60
1429179254046,105,0.00352271,-0.0174852,-0.0270299,49
1429179254087,105,-0.0375312,-0.0614838,-0.080596,46
1429179254129,105,-0.077012,-0.112277,-0.142171,43
1429179254172,105,-0.104864,-0.15715,-0.194162,40
1429179254184,105,-0.106505,-0.178103,-0.217051,38
1429179254225,105,-0.0779967,-0.159554,-0.192913,30
1429179254267,105,-0.032609,-0.108136,-0.132696,27
1429179254308,105,0.0168146,-0.030393,-0.0450425,23
1429179254349,105,0.0600076,0.0530315,0.0499612,20
1429179254391,105,0.0856537,0.121479,0.128728,21
1429179254432,105,0.097452,0.166388,0.189979,31
1429179254474,105,0.0902912,0.1775,0.210828,44
1429179254515,105,0.0740349,0.165321,0.20472,56
1429179254557,105,0.0533754,0.140303,0.172991,54
1429179254598,105,0.0299117,0.105655,0.126976,45
1429179254640,105,0.00734691,0.0661385,0.0740592,40
1429179254681,105,-0.0186949,0.0187644,0.0162395,35
1429179254723,105,-0.0425436,-0.028489,-0.0332577,33
1429179254764,105,-0.0785433,-0.0823938,-0.0873047,33
1429179254805,105,-0.123057,-0.132042,-0.137048,33
1429179254847,105,-0.160725,-0.168984,-0.177236,33
1429179254888,105,-0.177398,-0.179294,-0.188059,32
1429179254930,105,-0.158884,-0.156528,-0.162178,30
1429179254972,105,-0.116454,-0.112373,-0.115603,28
1429179255014,105,-0.0575381,-0.0564873,-0.0527546,30
1429179255057,105,-0.00259411,-0.00707549,-0.00141101,32
1429179255099,105,0.0391687,0.0290547,0.0352203,44
1429179255140,105,0.0580776,0.0465545,0.0452723,57
1429179255181,105,0.0716087,0.054509,0.0490211,70
1429179255224,105,0.0789707,0.0616713,0.0591203,70
1429179255265,105,0.0879297,0.0726477,0.081036,63
1429179255306,105,0.107128,0.0955815,0.12301,57
1429179255348,105,0.129293,0.113692,0.156237,51
1429179255389,105,0.13504,0.116655,0.159361,48
1429179255431,105,0.125361,0.10563,0.138275,49
1429179255472,105,0.108009,0.0862117,0.105935,48
1429179255519,105,0.0901893,0.0636449,0.0817087,44
1429179255530,105,0.0701156,0.037465,0.0564179,43
1429179255572,105,0.0495174,0.014107,0.0298046,41
1429179255613,105,0.0253813,-0.00520168,-0.00578912,38
1429179255655,105,-0.00464975,-0.0203405,-0.0472264,36
1429179255696,105,-0.0397721,-0.0348614,-0.0929005,34
1429179255738,105,-0.0654127,-0.0458962,-0.125711,34
1429179255779,105,-0.0811278,-0.0588614,-0.140596,33
1429179255821,105,-0.0885895,-0.0731791,-0.143822,38
1429179255862,105,-0.0875439,-0.0850233,-0.13716,57
1429179255903,105,-0.0813705,-0.0869534,-0.12019,71
1429179255944,105,-0.0703802,-0.0784441,-0.0962229,76
1429179255986,105,-0.0570449,-0.0585574,-0.0669665,73
1429179256028,105,-0.0391945,-0.0326754,-0.031151,70
1429179256071,105,-0.0270605,-0.0126763,-0.000140539,63
1429179256083,105,-0.0146356,0.00413735,0.0345149,61
1429179256125,105,-0.00898275,0.00983026,0.0571449,57
1429179256167,105,0.00243189,0.0216923,0.0817751,56
1429179256208,105,0.0127285,0.0357414,0.0946566,56
1429179256250,105,0.0177642,0.0435514,0.0926036,53
1429179256291,105,0.0175802,0.0464468,0.079927,51
1429179256333,105,0.0165191,0.0449007,0.0606962,46
1429179256374,105,0.0193032,0.0447471,0.04877,43
1429179256416,105,0.0255427,0.04559,0.0390341,40
1429179256458,105,0.031374,0.0460163,0.0319171,40
1429179256500,105,0.0492392,0.0533737,0.039442,39
1429179256542,105,0.0626884,0.0563593,0.0496371,44
1429179256554,105,0.0604712,0.0416299,0.0424759,50
1429179256596,105,0.0359287,0.0155648,0.0247422,65
1429179256639,105,0.0148092,-0.0122239,-0.00597432,79
1429179256651,105,0.00674368,-0.0320097,-0.0353112,79
1429179256692,105,0.02317,-0.0330175,-0.0512577,76
1429179256734,105,0.0516544,-0.0213459,-0.0484177,66
1429179256777,105,0.0729362,-0.00682324,-0.0349272,60
1429179256789,105,0.0758641,0.00517878,-0.0158216,57
1429179256831,105,0.0499513,0.00247822,-0.00671599,52
1429179256872,105,0.00310971,-0.0127058,-0.00645088,51
1429179256914,105,-0.0435711,-0.0310768,-0.0123753,51
1429179256925,105,-0.0807644,-0.0468765,-0.0286694,51
1429179256967,105,-0.0996761,-0.0527822,-0.0432679,48
1429179257008,105,-0.0978783,-0.0433578,-0.0470581,44
1429179257050,105,-0.0899456,-0.0310246,-0.0462553,40
1429179257091,105,-0.0680176,-0.0193143,-0.0430383,37
1429179257104,105,-0.055592,-0.0159916,-0.0406628,35
1429179257146,105,-0.0682817,-0.0264464,-0.0422266,32
1429179257158,105,-0.109265,-0.0402579,-0.0412232,30
1429179257199,105,-0.137267,-0.0278061,-0.00920953,26
1429179257210,105,-0.136556,0.000327706,0.0308678,26
1429179257252,105,-0.0959962,0.0314364,0.0591072,26
1429179257263,105,-0.0248198,0.0477351,0.0536109,26
1429179257306,105,0.0491376,0.0392736,0.0203076,40
1429179257318,105,0.108387,0.0191045,-0.0137689,45
1429179257360,105,0.14138,0.00322896,-0.0236106,52
1429179257376,105,0.147769,-8.74635e-05,-0.00815545,53
1429179257418,105,0.132725,0.00791448,0.0213977,57
1429179257443,105,0.102941,0.0164676,0.0450199,52
1429179257485,105,0.0744084,0.0224396,0.0543308,33
1429179257527,105,0.0530511,0.019135,0.0547863,19
1429179257568,105,0.0445712,0.0150543,0.0433322,6
1429179257610,105,0.046501,0.0127498,0.0291074,4
1429179257652,105,0.0459606,0.0108927,0.0112283,2
1429179257693,105,0.0335403,0.00413207,-0.0125847,0
1429179257735,105,0.0110202,-0.00464278,-0.0341343,0
1429179257777,105,-0.0131202,-0.00924096,-0.0436444,0
1429179257818,105,-0.0308995,-0.00698441,-0.0402428,0
1429179257859,105,-0.041272,-0.00267485,-0.0323574,0
1429179257901,105,-0.0480557,-0.00354877,-0.0251573,0
1429179257942,105,-0.0544557,-0.0102487,-0.0223747,0
1429179257984,105,-0.0570088,-0.0155285,-0.0157703,12
1429179258025,105,-0.0600482,-0.0181187,-0.00901471,39
1429179258067,105,-0.0608499,-0.0203363,-0.00636064,58
1429179258108,105,-0.0614652,-0.0229836,-0.00912086,54
1429179258149,105,-0.0539863,-0.0206402,-0.00895537,38
1429179258191,105,-0.0413367,-0.0143414,-0.00388419,24
1429179258232,105,-0.022601,-0.00143558,0.0105737,11
1429179258274,105,-0.00604435,0.00691263,0.0208385,8
1429179258315,105,0.00278588,0.00546465,0.0243688,7
1429179258357,105,0.00295511,-0.00306752,0.0174821,1
1429179258398,105,-0.00138144,-0.0179467,-0.0013186,0
1429179258440,105,0.00227826,-0.0234901,-0.016564,0
1429179258482,105,0.0121867,-0.0211677,-0.0245956,0
1429179258525,105,0.0250708,-0.0130558,-0.0262455,0
1429179258567,105,0.0371561,-0.00469577,-0.0223041,0
1429179258608,105,0.0431719,0.00355318,-0.0111036,0
1429179258649,105,0.0457057,0.0143186,0.00473297,4
1429179258691,105,0.0497404,0.030141,0.0310989,25
1429179258732,105,0.0471147,0.042888,0.0485244,30
1429179258774,105,0.0323469,0.0440158,0.048277,18
1429179258815,105,0.0107038,0.0341434,0.0299166,4
1429179258856,105,-0.00666992,0.0196417,0.00709264,0
1429179258898,105,-0.0187229,0.00338064,-0.0149982,0
1429179258939,105,-0.0262956,-0.0139527,-0.0276973,0
1429179258981,105,-0.0291292,-0.0275606,-0.027699,0
1429179259023,105,-0.0356162,-0.0394124,-0.0244786,0
1429179259064,105,-0.0408661,-0.0436415,-0.0205462,0
1429179259105,105,-0.0425971,-0.0435115,-0.020918,0
1429179259147,105,-0.0306157,-0.0299865,-0.0152859,0
1429179259188,105,-0.0142453,-0.012416,-0.00338004,0
1429179259230,105,0.00860029,0.00994996,0.017381,0
1429179259271,105,0.0286467,0.0368327,0.0440589,1
1429179259313,105,0.0353929,0.0460476,0.0509851,22
1429179259354,105,0.0350756,0.0529492,0.049469,30
1429179259396,105,0.031044,0.0496093,0.0415278,23
1429179259438,105,0.0264973,0.0412052,0.0349387,7
1429179259479,105,0.0176699,0.0268716,0.022807,1
1429179259521,105,0.00894594,0.0167268,0.0161531,0
1429179259562,105,0.00177413,0.0158667,0.0154292,2
1429179259604,105,-0.0103403,0.0132539,0.00939089,6
1429179259645,105,-0.0139647,0.0204011,0.0141272,8
1429179259687,105,-0.0159126,0.0239186,0.0205379,7
1429179259728,105,-0.0194533,0.0189385,0.0174344,5
1429179259770,105,-0.0154025,0.0143521,0.0178501,4
1429179259816,105,-0.00621144,0.00947486,0.0194943,14
1429179259827,105,0.0185736,0.0103164,0.0297695,24
1429179259869,105,0.0365244,0.0110422,0.0335514,52
1429179259910,105,0.0431831,0.00874048,0.0288457,84
1429179259951,105,0.0287791,-0.00151958,0.00806454,85
1429179259993,105,0.00670026,-0.0162658,-0.0139982,70
1429179260034,105,-0.0193762,-0.0334819,-0.0327284,56
1429179260076,105,-0.0332022,-0.0458172,-0.0361913,40
1429179260120,105,-0.0426061,-0.0525507,-0.0345522,33
1429179260132,105,-0.0445353,-0.0623625,-0.0446353,33
1429179260173,105,-0.0526203,-0.0772881,-0.0725608,32
1429179260215,105,-0.0503631,-0.0934218,-0.112607,31
1429179260256,105,-0.0309947,-0.100025,-0.144632,29
1429179260298,105,0.0028845,-0.0971229,-0.158117,28
1429179260339,105,0.0489769,-0.0774309,-0.140133,24
1429179260381,105,0.0749119,-0.0567619,-0.111339,23
1429179260424,105,0.0747997,-0.0353556,-0.0764702,42
1429179260466,105,0.0512354,-0.00693835,-0.0315158,65
1429179260507,105,0.00595576,0.0167353,0.00507392,83
1429179260548,105,-0.0353199,0.0436375,0.0404017,77
1429179260590,105,-0.0627514,0.0652214,0.0673717,61
1429179260632,105,-0.0537544,0.0896611,0.100432,51
1429179260673,105,-0.0161266,0.111944,0.136727,41
1429179260714,105,0.0308614,0.126815,0.168923,39
1429179260757,105,0.0691486,0.135807,0.194843,40
1429179260768,105,0.0685532,0.119015,0.184825,40
1429179260810,105,0.0471183,0.0869357,0.143123,41
1429179260852,105,0.010864,0.0410138,0.0781438,40
1429179260893,105,-0.0153262,-0.00218229,0.00758631,41
1429179260935,105,-0.026213,-0.0322819,-0.0438894,41
1429179260976,105,-0.026356,-0.0442606,-0.0721894,51
1429179261018,105,-0.0177278,-0.0376063,-0.0706071,73
1429179261059,105,-0.00365433,-0.0206459,-0.0516733,116
1429179261101,105,0.00451609,-0.00475912,-0.030529,127
1429179261112,105,0.00278543,-0.00211942,-0.0250461,127
1429179261154,105,-0.0139703,-0.0160285,-0.036127,122
1429179261165,105,-0.0323434,-0.0385427,-0.0556959,78
1429179261207,105,-0.0428203,-0.0573327,-0.0647104,69
1429179261220,105,-0.0430191,-0.0668233,-0.0637468,69
1429179261261,105,-0.0353976,-0.06601,-0.0544322,66
1429179261273,105,-0.0296059,-0.0601374,-0.0431133,66
1429179261314,105,-0.0218889,-0.0492348,-0.0329773,68
1429179261356,105,-0.0152161,-0.0357229,-0.025145,70
1429179261367,105,-0.0125355,-0.0269885,-0.0208716,70
1429179261409,105,-0.00408993,-0.0163845,-0.0109087,67
1429179261422,105,0.00775504,-0.00407781,-0.000418376,67
1429179261463,105,0.0191588,0.0100014,0.0129416,63
1429179261476,105,0.0272712,0.022251,0.0204823,62
1429179261518,105,0.0330246,0.0303211,0.0254403,58
1429179261543,105,0.0336092,0.0337032,0.0253669,54
1429179261585,105,0.0325778,0.0366358,0.0228739,54
1429179261608,105,0.0361381,0.0441402,0.0242692,62
1429179261650,105,0.0326852,0.047087,0.0247497,75
1429179261676,105,0.0310393,0.0471708,0.0315759,86
1429179261717,105,0.0329934,0.0422659,0.0468487,88
1429179261744,105,0.0380784,0.0341132,0.0623006,84
1429179261785,105,0.0452778,0.0193796,0.0665844,77
1429179261827,105,0.037152,0.00172114,0.0466256,64
1429179261869,105,0.00633547,-0.0119915,0.00623426,56
1429179261910,105,-0.0391246,-0.0142661,-0.0365972,50
1429179261951,105,-0.0801051,-0.00236972,-0.062083,48
1429179261993,105,-0.102569,0.0133295,-0.0599732,43
1429179262034,105,-0.0987936,0.0237327,-0.0364339,38
1429179262076,105,-0.0854051,0.0110769,-0.0169268,27
1429179262117,105,-0.0644986,-0.0141877,-0.00285097,19
1429179262159,105,-0.0486813,-0.0450176,-0.0049288,12
1429179262200,105,-0.0365061,-0.0716143,-0.0196776,9
1429179262242,105,-0.0254207,-0.0857876,-0.037564,13
1429179262283,105,-0.020411,-0.0936599,-0.0570948,26
1429179262325,105,-0.00624684,-0.0812512,-0.0525947,43
1429179262367,105,0.00360996,-0.0581286,-0.0302985,45
1429179262409,105,0.0198909,-0.022263,0.00940245,36
1429179262451,105,0.0285894,0.00142596,0.035648,28
1429179262493,105,0.0405734,0.0194676,0.0428336,17
1429179262534,105,0.0466391,0.0203539,0.0294905,13
1429179262576,105,0.0547447,0.0201156,0.00703955,11
1429179262618,105,0.0475702,0.0101847,-0.0243123,10
1429179262659,105,0.0460915,0.00280183,-0.0422433,6
1429179262701,105,0.0523636,0.00125269,-0.0447273,4
1429179262743,105,0.0729958,0.00933852,-0.0283337,1
1429179262784,105,0.0971473,0.028144,0.00040092,0
1429179262826,105,0.115268,0.0532825,0.0364997,0
1429179262868,105,0.12343,0.0868823,0.0728846,0
1429179262909,105,0.112603,0.117194,0.0973239,0
1429179262951,105,0.0882305,0.139939,0.110977,12
1429179262993,105,0.0558207,0.147434,0.113683,38
1429179263034,105,0.0185432,0.130229,0.10521,45
1429179263076,105,-0.0157446,0.09645,0.0924606,42
1429179263117,105,-0.0525929,0.0470081,0.0673504,37
1429179263159,105,-0.0885994,-0.00416506,0.0356554,30
1429179263203,105,-0.112328,-0.0484792,-0.000330794,27
1429179263215,105,-0.132966,-0.0838642,-0.0407378,27
1429179263256,105,-0.136445,-0.0999621,-0.0682123,27
1429179263297,105,-0.150571,-0.115675,-0.0985567,30
1429179263339,105,-0.164531,-0.127545,-0.118841,31
1429179263384,105,-0.183708,-0.139945,-0.136987,28
1429179263398,105,-0.179466,-0.141479,-0.135619,28
1429179263440,105,-0.143984,-0.13055,-0.119419,26
1429179263481,105,-0.080076,-0.100949,-0.0854404,24
1429179263526,105,-0.00196224,-0.050332,-0.0435678,23
1429179263538,105,0.074262,0.0118,0.00756619,23
1429179263579,105,0.126527,0.0700918,0.0547043,35
1429179263621,105,0.147359,0.109491,0.0837498,47
1429179263662,105,0.141101,0.111775,0.0859237,56
1429179263703,105,0.118606,0.0812242,0.062687,52
1429179263745,105,0.0850345,0.0289032,0.0230968,43
1429179263786,105,0.0638522,-0.0119604,-0.000611279,37
1429179263827,105,0.0389554,-0.0374429,-0.0153098,32
1429179263869,105,0.0144768,-0.0406526,-0.0165422,32
1429179263911,105,-0.0117174,-0.0243655,-0.00702209,32
1429179263953,105,-0.0291798,-0.00452807,0.00186396,31
1429179263993,105,-0.0367366,0.00834175,0.00660481,29
1429179264035,105,-0.0380643,0.00185557,-0.00295123,27
1429179264076,105,-0.021093,0.00377838,-0.00370646,24
1429179264118,105,-0.00410472,0.0166955,0.00975001,20
1429179264159,105,0.0132006,0.0344663,0.0277264,23
1429179264200,105,0.0187537,0.0420108,0.0337144,41
1429179264242,105,0.00975232,0.0449212,0.0322763,54
1429179264284,105,0.00681737,0.0415319,0.0236756,57
1429179264325,105,0.0127718,0.0346449,0.0143711,51
1429179264367,105,0.0211056,0.0304426,0.0116248,42
1429179264409,105,0.0211613,0.0258525,0.0110083,38
1429179264450,105,-0.00342382,0.00956771,0.0035694,37
1429179264492,105,-0.045941,-0.0156206,-0.011748,38
1429179264534,105,-0.0897021,-0.0436908,-0.0272051,40
1429179264576,105,-0.113203,-0.0566738,-0.0371528,40
1429179264617,105,-0.105038,-0.047049,-0.0309733,38
1429179264659,105,-0.0525134,-0.00609851,0.00576463,37
1429179264701,105,0.0142131,0.0346514,0.0450571,34
1429179264743,105,0.079296,0.0724637,0.0874972,34
1429179264785,105,0.106018,0.0729343,0.0911047,46
1429179264829,105,0.0980037,0.0508964,0.0646437,60
1429179264841,105,0.0578674,-0.00083556,-0.0013825,65
1429179264887,105,-0.00634337,-0.0752854,-0.096199,68
1429179264899,105,-0.0626402,-0.144255,-0.18043,66
1429179264941,105,-0.105687,-0.175884,-0.210586,60
1429179264985,105,-0.0973962,-0.143484,-0.158323,51
1429179264996,105,-0.036231,-0.0536987,-0.0321579,48
1429179265039,105,0.0564837,0.0592574,0.116182,44
1429179265051,105,0.134844,0.144915,0.222661,44
1429179265092,105,0.175889,0.181608,0.256253,43
1429179265134,105,0.162334,0.162324,0.213553,43
1429179265175,105,0.0985095,0.101219,0.117322,42
1429179265217,105,0.0108139,0.0243605,0.00250443,40
1429179265229,105,-0.0607445,-0.040559,-0.087603,40
1429179265271,105,-0.0948012,-0.0822309,-0.142112,37
1429179265282,105,-0.0894734,-0.0972637,-0.158715,36
1429179265324,105,-0.0602703,-0.0942951,-0.153484,33
1429179265366,105,-0.03348,-0.0805263,-0.136361,34
1429179265377,105,-0.00463877,-0.0613847,-0.110938,34
1429179265419,105,-0.000378541,-0.0515685,-0.0908838,50
1429179265431,105,-0.00195143,-0.0524597,-0.0720075,50
1429179265473,105,-0.00417528,-0.050029,-0.047242,68
1429179265485,105,-0.00727731,-0.0424018,-0.0171521,70
1429179265527,105,-0.00147221,-0.0173539,0.0236654,67
1429179265543,105,0.0149987,0.017653,0.0725729,65
1429179265585,105,0.0289907,0.0561679,0.112517,55
1429179265608,105,0.0119797,0.0707775,0.11352,53
1429179265655,105,-0.0372906,0.0553491,0.0690062,47
1429179265676,105,-0.090839,0.0268856,0.00507634,45
1429179265717,105,-0.121882,-0.00401856,-0.054388,45
1429179265743,105,-0.107401,-0.015366,-0.0752629,45
1429179265785,105,-0.0433929,0.000507353,-0.045315,44
1429179265808,105,0.0379414,0.0353815,0.0229362,43
1429179265850,105,0.102749,0.0687204,0.0910024,40
1429179265876,105,0.119999,0.082791,0.129861,38
1429179265918,105,0.0851659,0.0646137,0.115142,35
1429179265943,105,0.034515,0.0343386,0.0692024,34
1429179265985,105,-0.0031952,0.00337459,0.0205643,33
1429179266007,105,-0.0119572,-0.0108237,-0.00741073,33
1429179266049,105,-0.00303784,-0.0135112,-0.0158416,40
1429179266090,105,0.0313985,0.00377722,0.00622675,54
1429179266132,105,0.0645344,0.0266803,0.033164,72
1429179266174,105,0.0910362,0.044145,0.0557091,74
1429179266216,105,0.0682956,0.032004,0.0404252,65
1429179266258,105,0.0342074,0.00618659,0.0116716,58
1429179266301,105,-0.0134596,-0.0310093,-0.0309856,48
1429179266342,105,-0.0607708,-0.0709382,-0.0814552,44
1429179266384,105,-0.113575,-0.109368,-0.134743,42
1429179266425,105,-0.153521,-0.144455,-0.182519,41
1429179266467,105,-0.169788,-0.161199,-0.202598,38
1429179266508,105,-0.139076,-0.147831,-0.173119,34
1429179266550,105,-0.103367,-0.119264,-0.126814,27
1429179266591,105,-0.0682766,-0.069355,-0.06001,24
1429179266633,105,-0.036402,-0.00756299,0.00666353,19
1429179266675,105,-0.0164438,0.0610541,0.0602665,17
1429179266720,105,-0.0020434,0.135667,0.106198,15
1429179266731,105,-0.00111652,0.18574,0.119653,15
1429179266773,105,-0.00793734,0.194156,0.118953,26
1429179266814,105,0.00671974,0.169024,0.102688,38
1429179266856,105,0.0688637,0.143661,0.118975,49
1429179266897,105,0.199768,0.159487,0.176539,13
1429179267069,105,0.335117,0.185567,0.233884,13
1429179267111,105,0.407403,0.181153,0.251085,13
1429179267152,105,0.355858,0.100521,0.180124,8
1429179267194,105,0.197768,-0.0448019,0.0466143,2
1429179267235,105,-0.000504464,-0.194707,-0.0924846,0
1429179267277,105,-0.169191,-0.302093,-0.197038,0
1429179267320,105,-0.260644,-0.334741,-0.2539,0
1429179267362,105,-0.247726,-0.277254,-0.238999,0
1429179267374,105,-0.178495,-0.17403,-0.189141,0
1429179267415,105,-0.101519,-0.0683664,-0.131843,0
1429179267457,105,-0.0819822,-0.0189967,-0.101964,0
1429179267499,105,-0.074397,0.0152178,-0.0639394,0
1429179267540,105,-0.0751525,0.0504789,-0.0174089,31
1429179267582,105,-0.0263823,0.11817,0.0551051,43
1429179267623,105,0.0402072,0.162523,0.105702,33
1429179267665,105,0.107152,0.166343,0.116207,20
1429179267706,105,0.125588,0.127388,0.0882181,2
1429179267748,105,0.0781387,0.0524372,0.0373073,0
1429179267790,105,-0.014598,-0.036683,-0.0238082,0
1429179267832,105,-0.101054,-0.0797757,-0.0470954,0
1429179267873,105,-0.138618,-0.100709,-0.0527405,0
1429179267915,105,-0.111052,-0.0834628,-0.0265094,0
1429179267957,105,-0.0494326,-0.0452396,0.0101899,0
1429179267998,105,0.0176313,-0.00772643,0.0445672,0
1429179268040,105,0.0697942,0.0504479,0.0788567,0
1429179268082,105,0.11788,0.109156,0.108088,0
1429179268123,105,0.138503,0.137875,0.112475,0
1429179268165,105,0.127851,0.109911,0.0761027,0
1429179268206,105,0.0762791,0.0276994,0.00394677,29
1429179268248,105,0.00965608,-0.0582542,-0.0743853,40
1429179268292,105,-0.029507,-0.094636,-0.111696,30
1429179268304,105,-0.0240521,-0.051214,-0.0787443,24
1429179268346,105,0.000697134,0.00529694,-0.0334314,10
1429179268393,105,0.0425306,0.0641767,0.023003,0
1429179268409,105,0.0523276,0.079278,0.0480883,0
1429179268421,105,0.0442729,0.0589991,0.0573498,0
1429179268462,105,0.00796529,0.0243755,0.0486119,0
1429179268504,105,-0.011215,-0.00451802,0.0315449,0
1429179268546,105,-0.0303561,-0.0294517,0.00749399,0
1429179268587,105,-0.0294837,-0.0516842,-0.0236387,0
1429179268628,105,-0.0470692,-0.0730513,-0.0532931,0
1429179268670,105,-0.0709951,-0.0879239,-0.0739974,0
1429179268711,105,-0.102474,-0.0848594,-0.0828444,0
1429179268759,105,-0.120596,-0.0720732,-0.075344,0
1429179268771,105,-0.115542,-0.0563183,-0.0646732,0
1429179268812,105,-0.0767697,-0.0245278,-0.0318386,17
1429179268854,105,-0.0247974,0.0178936,0.014992,52
1429179268895,105,0.0245142,0.0547284,0.0551341,58
1429179268937,105,0.0695753,0.0956029,0.0894581,51
1429179268978,105,0.0805041,0.118966,0.104986,34
1429179269020,105,0.0537241,0.0845124,0.0765423,24
1429179269061,105,-4.97825e-05,0.0172635,0.0283181,18
1429179269103,105,-0.0539279,-0.0455394,-0.0181615,21
1429179269145,105,-0.115731,-0.128966,-0.0774677,29
1429179269187,105,-0.122519,-0.143437,-0.0981517,31
1429179269228,105,-0.105954,-0.12017,-0.0927696,30
1429179269270,105,-0.0712728,-0.05278,-0.0492749,29
1429179269312,105,-0.038816,0.0322952,0.00452837,28
1429179269324,105,-0.00129924,0.114438,0.0689699,29
1429179269366,105,0.0231262,0.151348,0.103016,30
1429179269407,105,0.0474111,0.150228,0.109069,50
1429179269448,105,0.0653336,0.117721,0.0890378,75
1429179269490,105,0.10224,0.0946208,0.06539,99
1429179269531,105,0.15025,0.08259,0.046984,94
1429179269573,105,0.190641,0.081969,0.0407015,76
1429179269614,105,0.208703,0.0804656,0.0378291,63
1429179269655,105,0.190809,0.0538585,0.0342467,53
1429179269667,105,0.15746,0.0164384,0.0302619,51
1429179269708,105,0.108982,-0.0261832,0.0212336,51
1429179269750,105,0.0403334,-0.0541457,0.0148061,56
1429179269761,105,-0.00131834,-0.0564863,0.0107335,57
1429179269806,105,-0.0157619,-0.0366981,0.0179653,57
1429179269819,105,-0.028436,-0.0133515,0.0237726,56
1429179269860,105,-0.0330457,-0.00650477,0.0137132,48
1429179269903,105,-0.063668,-0.0292946,-0.0192765,42
1429179269915,105,-0.104686,-0.0623849,-0.0623957,40
1429179269957,105,-0.187746,-0.112126,-0.125001,32
1429179269999,105,-0.246214,-0.145637,-0.163875,31
1429179270041,105,-0.257724,-0.130725,-0.157095,57
1429179270053,105,-0.22009,-0.082476,-0.117615,57
1429179270094,105,-0.134637,-0.0114757,-0.0587124,96
1429179270106,105,-0.0287534,0.0371327,-0.0122848,96
1429179270147,105,0.0649281,0.0505346,0.0134132,102
1429179270159,105,0.106466,0.00545556,-0.00698359,97
1429179270201,105,0.108192,-0.055363,-0.0297049,84
1429179270212,105,0.0565742,-0.134227,-0.0761226,78
1429179270254,105,-0.000508373,-0.176153,-0.0881956,64
1429179270275,105,-0.0406896,-0.182691,-0.0831325,52
1429179270317,105,-0.101057,-0.176752,-0.0797428,42
1429179270358,105,-0.167335,-0.154323,-0.0825359,35
1429179270403,105,-0.243538,-0.142071,-0.100879,30
1429179270414,105,-0.28228,-0.122701,-0.113425,26
1429179270456,105,-0.252642,-0.083359,-0.0971889,18
1429179270497,105,-0.180961,-0.0297591,-0.0590324,6
1429179270539,105,-0.0699055,0.0420734,0.00733541,0
1429179270580,105,0.0757266,0.130914,0.104353,0
1429179270624,105,0.201297,0.196279,0.170651,0
1429179270636,105,0.312231,0.253786,0.221434,0
1429179270677,105,0.36668,0.26567,0.216764,0
1429179270719,105,0.362987,0.265678,0.194883,26
1429179270760,105,0.325723,0.272134,0.185469,51
1429179270803,105,0.287122,0.301903,0.212314,46
1429179270844,105,0.261211,0.316532,0.246464,28
1429179270886,105,0.224982,0.286223,0.250594,18
1429179270927,105,0.160098,0.185004,0.194715,8
1429179270969,105,0.0524692,0.0409169,0.081313,8
1429179271010,105,-0.0782242,-0.109708,-0.050848,14
1429179271051,105,-0.173126,-0.197793,-0.135117,17
1429179271093,105,-0.223252,-0.225929,-0.17055,17
1429179271135,105,-0.227994,-0.21053,-0.16366,14
1429179271176,105,-0.200856,-0.169307,-0.136178,8
1429179271218,105,-0.176134,-0.121952,-0.110979,5
1429179271260,105,-0.143362,-0.0786367,-0.0874147,0
1429179271302,105,-0.108637,-0.0584816,-0.0835925,0
1429179271343,105,-0.0600295,-0.0454079,-0.0679726,21
1429179271387,105,0.00610774,-0.0285526,-0.0350486,48
1429179271403,105,0.0411564,-0.0325146,-0.0268076,60
1429179271444,105,0.024721,-0.0538513,-0.0464918,70
1429179271486,105,-0.0296963,-0.0845525,-0.0804963,58
1429179271527,105,-0.0957555,-0.116866,-0.117134,35
1429179271569,105,-0.132121,-0.120049,-0.119926,26
1429179271610,105,-0.120484,-0.0982993,-0.0951578,27
1429179271652,105,-0.064912,-0.0498907,-0.0417182,29
1429179271693,105,0.0102005,-0.00568647,0.00449055,30
1429179271740,105,0.0801259,0.0463826,0.0438104,31
1429179271752,105,0.133966,0.0930628,0.0766744,31
1429179271794,105,0.153815,0.127184,0.0980782,28
1429179271836,105,0.155881,0.150173,0.110713,23
1429179271877,105,0.137897,0.154096,0.113367,14
1429179271919,105,0.112298,0.132888,0.100987,13
1429179271960,105,0.0904207,0.0996086,0.0795099,37
1429179272002,105,0.0812303,0.0655381,0.0570416,62
1429179272043,105,0.0714459,0.0498501,0.0432381,79
1429179272085,105,0.0652654,0.0519599,0.03507,76
1429179272127,105,0.0317088,0.0403674,0.0156074,66
1429179272169,105,-0.017625,0.0201727,-0.00941442,49
1429179272210,105,-0.0706315,-0.0142603,-0.0318073,42
1429179272253,105,-0.093845,-0.0365692,-0.0318974,39
1429179272265,105,-0.0930598,-0.0455555,-0.0206979,40
1429179272307,105,-0.0750373,-0.0448803,0.00562869,40
1429179272349,105,-0.0430684,-0.0277835,0.0489435,40
1429179272392,105,-0.0223885,-0.0223581,0.0530335,39
1429179272433,105,-0.020311,-0.0300287,0.0228741,39
1429179272475,105,-0.0232823,-0.0470055,-0.0462796,40
1429179272517,105,-0.0168268,-0.0452756,-0.0939292,40
1429179272558,105,-0.0150921,-0.0391093,-0.0870822,40
1429179272600,105,0.00186726,0.00158445,-0.0311178,56
1429179272644,105,0.0150561,0.0208544,0.0173257,84
1429179272655,105,0.00879958,0.0109786,0.0338283,100
1429179272697,105,-0.0202586,-0.033129,-0.00241675,127
1429179272739,105,-0.0512474,-0.0660652,-0.0549631,127
1429179272781,105,-0.0706875,-0.0650319,-0.101096,75
1429179272822,105,-0.0565765,-0.0380018,-0.124759,68
1429179272864,105,-0.00633698,0.0150414,-0.114077,62
1429179272906,105,0.0309417,0.0516606,-0.0804585,60
1429179272947,105,0.0206006,0.0337718,-0.0581564,59
1429179272989,105,-0.0217699,-0.00673354,-0.0440671,60
1429179273030,105,-0.0331625,-0.0252352,-0.00193487,60
1429179273076,105,0.00281155,0.0116799,0.0668667,58
1429179273087,105,0.0714595,0.0733932,0.137139,57
1429179273130,105,0.112999,0.112686,0.160929,55
1429179273142,105,0.112928,0.104019,0.110556,55
1429179273184,105,0.062147,0.053536,0.0213217,53
1429179273225,105,-0.000538344,0.00319366,-0.0486559,54
1429179273267,105,-0.0560875,-0.034705,-0.0789855,69
1429179273309,105,-0.0761955,-0.052794,-0.067605,81
1429179273351,105,-0.0615977,-0.0448601,-0.0278013,85
1429179273362,105,-0.03622,-0.0332977,0.00665278,85
1429179273403,105,0.00896625,-0.0108052,0.0477257,74
1429179273415,105,0.0383923,0.00961215,0.0798208,69
1429179273457,105,0.0673894,0.033442,0.114477,60
1429179273468,105,0.0460838,0.00660271,0.0671033,55
1429179273510,105,-0.0360167,-0.0866828,-0.0825875,49
1429179273552,105,-0.148358,-0.225771,-0.303623,45
1429179273593,105,-0.239197,-0.339373,-0.481523,44
1429179273605,105,-0.248984,-0.342267,-0.506152,43
1429179273646,105,-0.17334,-0.219281,-0.334758,42
1429179273688,105,-0.0180853,0.00442326,-0.0107724,41
1429179273699,105,0.152958,0.235934,0.34345,40
1429179273741,105,0.276072,0.389051,0.586601,39
1429179273752,105,0.306801,0.416799,0.647914,37
1429179273794,105,0.232063,0.314968,0.524449,34
1429179273808,105,0.0891173,0.146069,0.286811,33
1429179273849,105,-0.0603618,-0.0240515,0.0473251,27
1429179273890,105,-0.172879,-0.147388,-0.132273,24
1429179273911,105,-0.199356,-0.180742,-0.192722,22
1429179273957,105,-0.158053,-0.150496,-0.166873,27
1429179273998,105,-0.0820985,-0.0905403,-0.0910157,46
1429179274010,105,0.0103476,-0.0209897,-0.000956833,46
1429179274052,105,0.0734879,0.0227504,0.0575405,56
1429179274075,105,0.0971917,0.0387157,0.0753448,55
1429179274117,105,0.0737072,0.0277732,0.0404451,46
1429179274143,105,0.0355372,0.00963241,-0.014652,43
1429179274185,105,-0.0245226,-0.0228495,-0.0784878,35
1429179274208,105,-0.071084,-0.0568722,-0.129428,33
1429179274250,105,-0.098733,-0.0815078,-0.154195,30
