1429097515303,114,0.214334,0.161411,0.167872,58
1429097515327,114,0.0902623,-0.0254545,0.00940413,54
1429097515359,114,-0.0219326,-0.165442,-0.110812,47
1429097515392,114,-0.0517312,-0.201066,-0.148781,42
1429097515426,114,0.0036914,-0.13943,-0.110784,39
1429097515468,114,0.0970034,-0.0307858,-0.0393507,34
1429097515490,114,0.164206,0.0614768,0.0234862,31
1429097515532,114,0.176348,0.109926,0.0580397,26
1429097515559,114,0.121893,0.0943084,0.0522729,25
1429097515590,114,0.0207974,0.0253286,0.00713871,26
1429097515632,114,-0.06341,-0.0241904,-0.0244079,26
1429097515661,114,-0.0997693,-0.0336673,-0.0323394,21
1429097515691,114,-0.0754484,0.00319975,-0.00940556,17
1429097515729,114,-0.00263208,0.0706751,0.0385492,6
1429097515761,114,0.0728522,0.131895,0.0813028,6
1429097515792,114,0.100439,0.122814,0.0742055,11
1429097515827,114,0.0624985,0.0505296,0.0216369,34
1429097515860,114,-0.0307025,-0.0709767,-0.0669945,47
1429097515890,114,-0.137687,-0.175166,-0.142201,50
1429097515928,114,-0.202159,-0.205911,-0.157566,45
1429097515960,114,-0.205879,-0.176004,-0.124503,36
1429097515990,114,-0.167126,-0.113586,-0.0698222,30
1429097516032,114,-0.103267,-0.0731824,-0.0299363,15
1429097516060,114,-0.0467411,-0.0555074,-0.0112678,11
1429097516090,114,-0.0122889,-0.0545935,-0.00690738,6
1429097516128,114,-0.00596926,-0.0456686,0.00120868,10
1429097516158,114,-0.0124189,-0.0160251,0.0161393,13
1429097516190,114,-0.0222907,0.00748307,0.0194662,14
1429097516228,114,-0.0224253,0.0305224,0.0161966,1
1429097516258,114,0.00633207,0.0495617,0.0148113,0
1429097516290,114,0.0576413,0.0698446,0.021247,0
1429097516328,114,0.12628,0.0953013,0.0397266,0
1429097516358,114,0.185755,0.123199,0.0637057,11
1429097516390,114,0.205068,0.13658,0.0802451,47
1429097516432,114,0.196806,0.150086,0.103279,65
1429097516474,114,0.159229,0.150614,0.123468,51
1429097516515,114,0.0933642,0.122235,0.115272,32
1429097516556,114,0.0476717,0.0997157,0.105914,26
1429097516598,114,0.00847508,0.0634035,0.076008,24
1429097516640,114,-0.0146978,0.0194749,0.0327149,26
1429097516681,114,-0.024249,-0.0100177,-0.000278095,30
1429097516723,114,-0.0175935,-0.0190887,-0.0146675,28
1429097516764,114,-0.0310176,-0.0324541,-0.0304432,23
1429097516806,114,-0.0753942,-0.0725049,-0.0687242,20
1429097516848,114,-0.104029,-0.104057,-0.096796,19
1429097516889,114,-0.127554,-0.141364,-0.129246,28
1429097516931,114,-0.125676,-0.1574,-0.142859,46
1429097516973,114,-0.0893309,-0.133669,-0.11925,48
1429097517014,114,-0.0566245,-0.11404,-0.0958093,40
1429097517056,114,-0.0153038,-0.0690526,-0.0462391,32
1429097517098,114,0.0176275,-0.0208318,0.00709579,17
1429097517139,114,0.0200217,0.0153292,0.043592,9
1429097517181,114,-0.012147,0.0104018,0.0374257,7
1429097517223,114,-0.0578771,0.00184988,0.0133894,7
1429097517264,114,-0.0893992,-0.00813391,-0.016672,7
1429097517306,114,-0.114149,-0.0393711,-0.0586693,5
1429097517351,114,-0.0952023,-0.0473835,-0.0709514,6
1429097517363,114,-0.0182049,-0.0069554,-0.0268871,10
1429097517407,114,0.0985087,0.0926301,0.0752944,24
1429097517453,114,0.207227,0.202365,0.183558,47
1429097517464,114,0.230677,0.252695,0.222651,51
1429097517506,114,0.167895,0.196784,0.162894,52
1429097517548,114,0.035289,0.0631048,0.033743,44
1429097517590,114,-0.0603164,-0.0557172,-0.0684007,35
1429097517632,114,-0.109382,-0.150568,-0.136973,20
1429097517673,114,-0.0861705,-0.172272,-0.13268,15
1429097517716,114,-0.0445981,-0.155427,-0.10058,18
1429097517758,114,-0.0199636,-0.121856,-0.0666258,24
1429097517800,114,-0.0262284,-0.0831231,-0.048928,27
1429097517842,114,-0.027185,-0.0159211,-0.00864935,23
1429097517883,114,-0.000611618,0.0612825,0.0473175,18
1429097517925,114,0.039417,0.126722,0.104315,22
1429097517967,114,0.0586521,0.141086,0.120879,38
1429097518009,114,0.0448646,0.0935022,0.0787818,47
1429097518051,114,0.00918036,0.0175788,0.00386874,51
1429097518099,114,-0.0340974,-0.0582786,-0.0764906,49
1429097518111,114,-0.0834629,-0.122573,-0.151182,49
1429097518153,114,-0.0647277,-0.107919,-0.133492,21
1429097518196,114,-0.0277358,-0.060856,-0.0742382,2
1429097518208,114,0.0280323,0.0119913,0.0191786,0
1429097518249,114,0.0810511,0.0855457,0.11354,0
1429097518291,114,0.119847,0.142029,0.185187,0
1429097518332,114,0.107018,0.141734,0.181662,0
1429097518374,114,0.0607053,0.106104,0.132946,0
1429097518415,114,0.0235971,0.0613302,0.0750239,0
1429097518457,114,0.00849387,0.0248967,0.0280559,0
1429097518499,114,0.0262831,0.00891487,0.0146851,23
1429097518546,114,0.0294284,-0.00643325,-0.00279006,63
1429097518558,114,0.0198381,-0.024695,-0.0281044,78
1429097518606,114,-0.00864481,-0.0448872,-0.0601787,56
1429097518618,114,-0.0331124,-0.064682,-0.091944,50
1429097518660,114,-0.0507863,-0.0812312,-0.114833,38
1429097518702,114,-0.0491158,-0.081329,-0.110562,25
1429097518743,114,-0.022524,-0.0487698,-0.0592614,18
1429097518785,114,0.00855574,-0.00297121,0.00849989,14
1429097518827,114,0.0394725,0.0508609,0.0794014,17
1429097518838,114,0.0330785,0.0622895,0.0874781,18
1429097518879,114,0.0194195,0.0686617,0.0831327,18
1429097518921,114,0.00935156,0.0696463,0.0723794,11
1429097518933,114,0.0118588,0.0730236,0.0702467,7
1429097518974,114,0.00305354,0.0472743,0.0389736,3
1429097519017,114,0.0241891,0.0488754,0.0467688,21
1429097519028,114,0.0215943,0.0293915,0.0299139,21
1429097519070,114,0.029035,0.0288508,0.029302,59
1429097519111,114,0.0136572,0.0154745,0.00401067,73
1429097519153,114,-0.00349519,0.00080458,-0.0241887,61
1429097519195,114,-0.0316552,-0.0254002,-0.0579996,51
1429097519207,114,-0.0516991,-0.0470457,-0.073441,48
1429097519249,114,-0.0644578,-0.0686467,-0.0761337,42
1429097519262,114,-0.0634518,-0.0824662,-0.0710175,40
1429097519303,114,-0.0600461,-0.0932597,-0.0736936,33
1429097519315,114,-0.0680545,-0.113492,-0.104915,33
1429097519357,114,-0.0729314,-0.120497,-0.132368,31
1429097519368,114,-0.0749722,-0.114287,-0.147031,30
1429097519410,114,-0.0677441,-0.0954329,-0.138018,28
1429097519422,114,-0.0469495,-0.0586067,-0.0948133,27
1429097519463,114,0.0125443,0.0189533,0.00335474,22
1429097519476,114,0.0919822,0.111093,0.121672,20
1429097519518,114,0.16422,0.187929,0.220023,21
1429097519530,114,0.213659,0.23377,0.275258,21
1429097519572,114,0.214599,0.229475,0.267265,44
1429097519594,114,0.160933,0.165373,0.189971,55
1429097519636,114,0.0495968,0.0406026,0.0517911,75
1429097519659,114,-0.0631655,-0.0820654,-0.0806967,74
1429097519691,115,-0.12474,-0.143175,-0.139747,67
1429097519732,115,-0.138469,-0.153151,-0.141912,54
1429097519760,115,-0.100453,-0.100154,-0.0796386,42
1429097519794,115,-0.0607349,-0.0458743,-0.0249067,34
1429097519827,115,-0.0548913,-0.0301336,-0.0208296,29
1429097519859,115,-0.0744327,-0.0489316,-0.0581825,27
1429097519890,115,-0.0925245,-0.0713091,-0.0973914,26
1429097519932,115,-0.0451104,-0.028429,-0.0621867,23
1429097519958,115,0.0152733,0.0260651,-0.00389594,19
1429097519994,115,0.0461306,0.048276,0.0330471,18
1429097520028,115,0.0265694,0.0134087,0.0146037,20
1429097520058,115,-0.0377499,-0.0606564,-0.0432817,30
1429097520090,115,-0.118449,-0.141848,-0.117785,46
1429097520128,115,-0.17631,-0.190343,-0.166672,63
1429097520159,115,-0.209252,-0.219438,-0.201727,70
1429097520195,115,-0.196352,-0.204721,-0.189813,66
1429097520228,115,-0.148391,-0.161341,-0.146097,57
1429097520258,115,-0.0759327,-0.0947027,-0.0783641,48
1429097520290,115,0.0102711,-0.0110148,0.00506161,41
1429097520328,115,0.0959177,0.0757561,0.0892608,36
1429097520358,115,0.160443,0.140348,0.145217,34
1429097520396,115,0.197975,0.1841,0.173937,33
1429097520429,115,0.212155,0.219061,0.191374,34
1429097520459,115,0.20987,0.236732,0.195525,31
1429097520490,115,0.195792,0.234109,0.186193,25
1429097520533,115,0.170247,0.216748,0.171888,22
1429097520558,115,0.139988,0.175101,0.142606,26
1429097520598,115,0.106066,0.126595,0.109875,40
1429097520626,115,0.0766267,0.0874419,0.0851642,62
1429097520667,115,0.0529544,0.071439,0.0792908,82
1429097520709,115,0.0248788,0.0452455,0.0609187,83
1429097520751,115,-0.0022986,0.0167501,0.0375893,71
1429097520793,115,-0.0343618,-0.0308224,-0.00628248,54
1429097520837,115,-0.0717087,-0.0806728,-0.056568,44
1429097520849,115,-0.128276,-0.154737,-0.133647,44
1429097520891,115,-0.181941,-0.221004,-0.206702,44
1429097520932,115,-0.207311,-0.255798,-0.25036,47
1429097520974,115,-0.189863,-0.238877,-0.236737,44
1429097521015,115,-0.132645,-0.173799,-0.174031,38
1429097521057,115,-0.0548968,-0.0744397,-0.0749955,30
1429097521099,115,0.0071764,0.015491,0.0158579,29
1429097521142,115,0.044557,0.0779262,0.0790162,34
1429097521184,115,0.0378959,0.0789794,0.0798222,49
1429097521226,115,0.00239692,0.0331161,0.0334406,77
1429097521267,115,-0.0230762,-0.000141733,-0.000863548,83
1429097521309,115,-0.016386,0.00796284,0.00521237,69
1429097521350,115,0.010884,0.0365085,0.0317198,56
1429097521392,115,0.026152,0.0467437,0.0435025,40
1429097521434,115,0.0133113,0.0159021,0.0140983,33
1429097521476,115,-0.0186803,-0.0372836,-0.0331435,26
1429097521517,115,-0.0344506,-0.066391,-0.0599843,22
1429097521559,115,-0.0392367,-0.0714468,-0.0682248,15
1429097521601,115,-0.00897582,-0.031221,-0.0286875,11
1429097521643,115,0.0441461,0.0363657,0.0399648,8
1429097521684,115,0.107196,0.110398,0.118031,8
1429097521726,115,0.145805,0.158475,0.16671,24
1429097521767,115,0.15426,0.170013,0.174213,46
1429097521809,115,0.14216,0.155572,0.148718,74
1429097521851,115,0.12102,0.128514,0.11072,73
1429097521892,115,0.104254,0.10635,0.0798668,62
1429097521934,115,0.07791,0.0738447,0.0462465,53
1429097521976,115,0.0495319,0.037676,0.0158162,41
1429097522017,115,0.00607544,-0.0126742,-0.0231048,37
1429097522059,115,-0.0320769,-0.0550436,-0.0516555,32
1429097522104,115,-0.0574422,-0.0718946,-0.0534224,29
1429097522116,115,-0.068147,-0.0666768,-0.0394033,27
1429097522158,115,-0.0881518,-0.0690059,-0.0427335,18
1429097522200,115,-0.0976767,-0.0656768,-0.0509029,13
1429097522244,115,-0.110029,-0.0778054,-0.0783213,5
1429097522256,115,-0.120662,-0.101694,-0.114238,4
1429097522301,115,-0.13113,-0.130226,-0.147882,12
1429097522313,115,-0.131729,-0.145216,-0.158765,21
1429097522355,115,-0.0986874,-0.115809,-0.124614,42
1429097522398,115,-0.0473976,-0.063108,-0.0640047,60
1429097522440,115,0.0390955,0.0372791,0.0395408,51
1429097522481,115,0.101063,0.111797,0.116986,40
1429097522523,115,0.127224,0.14671,0.154805,24
1429097522566,115,0.0813173,0.0953738,0.105065,17
1429097522578,115,0.0175255,0.0159832,0.0263183,14
1429097522620,115,-0.0572694,-0.0784003,-0.0691994,12
1429097522661,115,-0.0984934,-0.126401,-0.121426,12
1429097522703,115,-0.105584,-0.128481,-0.130026,11
1429097522744,115,-0.0801591,-0.0950498,-0.0999469,7
1429097522786,115,-0.0274691,-0.0345151,-0.0360726,2
1429097522828,115,0.0492424,0.0515991,0.0551343,5
1429097522869,115,0.121812,0.13854,0.148727,21
1429097522911,115,0.162698,0.192398,0.206121,49
1429097522953,115,0.143139,0.179105,0.190777,54
1429097522995,115,0.0979913,0.136233,0.141513,41
1429097523007,115,0.028018,0.0566025,0.0560458,36
1429097523049,115,-0.0323663,-0.0224629,-0.0256986,21
1429097523061,115,-0.0792439,-0.0975581,-0.0966438,13
1429097523103,115,-0.0828449,-0.116496,-0.110375,0
1429097523144,115,-0.0809382,-0.114492,-0.105797,0
1429097523186,115,-0.0689493,-0.101645,-0.0941938,0
1429097523227,115,-0.0679564,-0.0914249,-0.0899303,4
1429097523239,115,-0.0833248,-0.104718,-0.112013,4
1429097523281,115,-0.102054,-0.122837,-0.138479,5
1429097523293,115,-0.0908402,-0.107806,-0.124357,6
1429097523335,115,-0.0716581,-0.0772681,-0.0940228,5
1429097523378,115,-0.0161831,0.00301679,-0.0102006,6
1429097523419,115,0.0381522,0.0750588,0.0635245,15
1429097523460,115,0.112852,0.14987,0.144704,28
1429097523502,115,0.184545,0.199397,0.206465,29
1429097523544,115,0.213862,0.20837,0.225707,24
1429097523556,115,0.192837,0.178619,0.202391,24
1429097523598,115,0.103906,0.0835356,0.101656,8
1429097523610,115,-0.0109423,-0.0251401,-0.0226428,1
1429097523621,115,-0.095559,-0.111849,-0.125015,1
1429097523633,115,-0.110629,-0.12415,-0.144684,0
1429097523674,115,-0.0570938,-0.0748849,-0.0912776,0
1429097523691,115,0.0127972,-0.00161641,-0.00844385,0
1429097523733,115,0.0670647,0.0556259,0.0566532,0
1429097523758,115,0.0722388,0.0828319,0.0847062,10
1429097523800,115,0.018743,0.0466995,0.0401668,10
1429097523841,115,-0.0247706,0.0240723,0.0111837,2
1429097523859,115,-0.037512,0.0199023,0.00618894,4
1429097523900,115,-0.015565,0.0236845,0.0171651,23
1429097523926,115,0.0222884,0.0362587,0.0421036,48
1429097523967,115,0.0213014,0.0200581,0.0317603,64
1429097523994,115,0.000260537,-0.00318143,0.0129001,61
1429097524035,115,-0.0611018,-0.0644455,-0.0536784,47
1429097524059,115,-0.102498,-0.109423,-0.103529,40
1429097524090,115,-0.111852,-0.129448,-0.127487,29
1429097524131,115,-0.0681179,-0.100188,-0.0954902,18
1429097524159,115,-0.00120874,-0.0401636,-0.0299357,15
1429097524194,115,0.0625511,0.0297831,0.0449685,11
1429097524227,115,0.0771068,0.0491036,0.0606913,13
1429097524260,115,0.0616124,0.0527103,0.0531163,17
1429097524290,115,0.0269864,0.0372042,0.023966,17
1429097524332,115,-0.00483929,0.0129738,-0.0106371,16
1429097524358,115,-0.0190787,0.00235561,-0.0232871,16
1429097524400,115,-0.0203234,0.00263711,-0.0183357,33
1429097524427,115,-0.00397772,0.0171753,0.00982251,55
1429097524459,115,0.00146048,0.0116174,0.0171301,67
1429097524490,115,0.00326681,-0.00370848,0.0159141,80
1429097524526,115,0.0129177,0.0022334,0.0255793,78
1429097524558,115,0.0283413,0.0142828,0.0351831,66
1429097524595,115,0.0518238,0.0448889,0.0551675,45
1429097524626,115,0.0691722,0.0769422,0.0777044,40
1429097524658,115,0.057338,0.0752072,0.0674182,32
1429097524690,115,0.0292518,0.0463567,0.0357974,30
1429097524726,115,-0.00289687,0.00183064,-0.00617289,34
1429097524758,115,-0.0261048,-0.0363134,-0.0424627,35
1429097524795,115,-0.045376,-0.0746957,-0.0832656,30
1429097524826,115,-0.0544753,-0.0824131,-0.0992867,27
1429097524867,115,-0.0575799,-0.0749733,-0.0976646,22
1429097524911,115,-0.0529764,-0.0587675,-0.0794453,39
1429097524926,115,-0.0373156,-0.032657,-0.0418631,49
1429097524967,115,-0.0180504,-0.0138055,-0.00786447,72
1429097525009,115,0.00282071,0.00558762,0.0231645,88
1429097525050,115,0.0234612,0.026925,0.0525118,86
1429097525092,114,0.0260219,0.030933,0.0540376,74
1429097525133,114,0.0263057,0.0342746,0.0533663,44
1429097525175,114,0.00788306,0.0134578,0.0216928,22
1429097525222,114,-0.019274,-0.0190214,-0.0216984,3
1429097525233,114,-0.0372929,-0.043314,-0.0555055,5
1429097525275,114,-0.0376937,-0.0433285,-0.057932,14
1429097525316,114,-0.0123596,-0.00967951,-0.01971,24
1429097525358,114,0.0247538,0.0390619,0.0381798,20
1429097525399,114,0.0573019,0.0800946,0.0912246,17
1429097525441,114,0.0644327,0.0878164,0.102888,28
1429097525483,114,0.056085,0.0735375,0.0879703,64
1429097525529,114,0.023648,0.0255931,0.0309117,95
1429097525541,114,-0.00924581,-0.0149684,-0.021407,95
1429097525582,114,-0.0498455,-0.0605847,-0.0793527,96
1429097525624,113,-0.0761345,-0.0804117,-0.104257,84
1429097525666,113,-0.0901696,-0.0855431,-0.10531,63
1429097525708,113,-0.0820681,-0.0736634,-0.0811656,53
1429097525750,113,-0.0620708,-0.0602169,-0.0556875,45
1429097525795,113,-0.0407251,-0.0503274,-0.0391178,44
1429097525807,113,-0.0162089,-0.0386036,-0.0266835,44
1429097525848,113,0.00886701,-0.0200692,-0.0098574,43
1429097525890,113,0.0263712,0.000234961,0.00697837,40
1429097525931,113,0.0408088,0.0242729,0.0292849,32
1429097525973,113,0.0434866,0.038858,0.0427393,36
1429097526015,113,0.0485421,0.0509801,0.05318,70
1429097526056,113,0.0632568,0.0702461,0.0703802,99
1429097526099,113,0.0679078,0.0736584,0.0688493,111
1429097526141,112,0.0704832,0.0748796,0.0642498,71
1429097526182,112,0.0693586,0.0727869,0.0601009,59
1429097526224,112,0.0662325,0.0703577,0.061215,53
1429097526265,112,0.0586229,0.0640332,0.0616399,48
1429097526308,112,0.0548866,0.0641725,0.0666542,46
1429097526349,112,0.0485722,0.0624701,0.0706997,43
1429097526392,112,0.0306145,0.0487936,0.0593482,41
1429097526433,112,0.00538426,0.0246752,0.03782,40
1429097526475,112,-0.0192287,0.00300754,0.0178322,38
1429097526518,112,-0.0391625,-0.0139969,0.00111404,43
1429097526559,112,-0.064031,-0.0378189,-0.0253413,55
1429097526601,112,-0.0949359,-0.0749491,-0.0714821,70
1429097526643,112,-0.136273,-0.134202,-0.142067,71
1429097526684,112,-0.16788,-0.184375,-0.203843,64
1429097526727,112,-0.161878,-0.193255,-0.217103,58
1429097526769,112,-0.121408,-0.159903,-0.175626,51
1429097526811,112,-0.0478493,-0.0812071,-0.0816507,46
1429097526852,112,0.0193573,-0.00798558,0.00785958,43
1429097526894,112,0.0395186,0.0167454,0.0386658,41
1429097526936,112,0.0198477,-0.000419294,0.0145044,39
1429097526977,112,-0.025701,-0.0442679,-0.0455236,36
1429097527023,112,-0.0415446,-0.0507653,-0.0693861,33
1429097527040,112,-0.0161403,-0.012596,-0.0386233,35
1429097527052,112,0.0390495,0.0594872,0.0359212,40
1429097527093,112,0.0872839,0.118728,0.103961,52
1429097527136,112,0.0935238,0.124489,0.118732,70
1429097527148,112,0.0548313,0.0747208,0.0727131,70
1429097527191,113,0.00287497,0.00596295,0.00639174,69
1429097527204,113,-0.0365513,-0.0487807,-0.0492444,66
1429097527247,113,-0.0286969,-0.0512739,-0.0461382,59
1429097527289,113,-0.00166179,-0.0289349,-0.0186179,51
1429097527300,113,0.0449649,0.0252141,0.0430948,49
1429097527342,113,0.106857,0.0972639,0.122595,47
1429097527354,113,0.152205,0.151526,0.180009,46
1429097527397,113,0.16085,0.165212,0.195207,44
1429097527438,113,0.109089,0.128783,0.159851,40
1429097527480,113,0.0179536,0.0513465,0.0823476,38
1429097527492,113,-0.0842409,-0.0264771,0.000382636,37
1429097527534,113,-0.172137,-0.0967171,-0.0773413,36
1429097527577,113,-0.194287,-0.109396,-0.101043,38
1429097527589,113,-0.192143,-0.122472,-0.131003,40
1429097527632,113,-0.176665,-0.146623,-0.177532,49
1429097527645,113,-0.133456,-0.15428,-0.198398,55
1429097527688,113,-0.084615,-0.171338,-0.220483,68
1429097527730,113,-0.0362066,-0.171002,-0.215935,69
1429097527742,113,0.000259756,-0.141052,-0.176377,68
1429097527783,113,0.053116,-0.0426145,-0.0630022,62
1429097527825,113,0.10142,0.0869526,0.079509,50
1429097527837,113,0.1339,0.192406,0.193466,46
1429097527878,113,0.138248,0.230679,0.235023,41
1429097527894,113,0.107139,0.179167,0.181744,40
1429097527936,113,0.081931,0.0921782,0.0958251,43
1429097527959,113,0.0529481,0.00546055,0.00815487,43
1429097527994,113,0.0468241,-0.0301574,-0.0251162,42
1429097528035,113,0.0351366,-0.0393426,-0.0357658,38
1429097528059,113,0.037392,-0.00965207,-0.00533802,36
1429097528094,113,0.0339941,0.0228376,0.0257184,37
1429097528127,113,0.0391063,0.0649899,0.0684957,44
1429097528158,113,0.0473627,0.0979421,0.106115,58
1429097528193,113,0.0411329,0.0983924,0.111925,70
1429097528235,113,0.0142644,0.0591552,0.0756643,76
1429097528258,113,-0.038024,-0.0114161,0.00132563,74
1429097528299,112,-0.0870616,-0.073966,-0.0690643,70
1429097528327,112,-0.125085,-0.121787,-0.127638,62
1429097528358,112,-0.0996063,-0.0842106,-0.0915923,55
1429097528393,112,-0.0443966,-0.014122,-0.0184867,48
1429097528427,112,-0.00258967,0.0252018,0.0256927,45
1429097528458,112,0.0340806,0.0650716,0.0695334,43
1429097528499,112,0.055622,0.0816812,0.0865788,42
1429097528528,112,0.0776964,0.100915,0.105816,41
1429097528558,112,0.0926362,0.102459,0.108497,40
1429097528595,112,0.0857442,0.0751458,0.0810578,38
1429097528627,112,0.0475491,0.0114518,0.0148199,36
1429097528658,112,-0.024254,-0.0757205,-0.0808634,40
1429097528694,112,-0.105221,-0.160661,-0.174941,51
1429097528726,112,-0.163234,-0.210038,-0.229523,64
1429097528758,112,-0.185878,-0.220313,-0.239926,70
1429097528795,113,-0.166947,-0.188617,-0.201648,69
1429097528825,113,-0.125184,-0.150803,-0.155699,61
1429097528858,113,-0.0657507,-0.0853892,-0.0801333,52
1429097528895,113,0.00969549,0.00133652,0.0174989,43
1429097528925,113,0.0765896,0.0830046,0.108225,39
1429097528958,113,0.125428,0.155134,0.185593,37
1429097528996,113,0.167786,0.216832,0.252031,37
1429097529026,113,0.183862,0.247009,0.281318,36
1429097529057,113,0.192141,0.253263,0.282995,35
1429097529099,113,0.172588,0.214707,0.233411,33
1429097529144,113,0.141172,0.162108,0.16674,34
1429097529158,113,0.0919245,0.0925828,0.0823882,36
1429097529199,113,0.0307777,0.0208123,-0.0041962,44
1429097529241,113,-0.0325441,-0.0551003,-0.089547,62
1429097529287,113,-0.0842306,-0.112433,-0.151839,71
1429097529298,113,-0.112301,-0.138145,-0.174495,71
1429097529340,112,-0.124348,-0.144279,-0.176796,66
1429097529381,112,-0.129484,-0.144632,-0.175337,57
1429097529423,112,-0.12503,-0.139654,-0.17248,43
1429097529464,112,-0.0967618,-0.108549,-0.136847,40
1429097529506,112,-0.0560853,-0.0687081,-0.0876645,40
1429097529547,112,-0.0191671,-0.0357151,-0.0450788,40
1429097529589,112,0.0116674,-0.00663433,-0.00581852,36
1429097529630,112,0.0319926,0.018005,0.0251001,33
1429097529673,112,0.0383469,0.0454637,0.0568507,32
1429097529715,112,0.0346221,0.0604483,0.075029,40
1429097529757,112,0.0126222,0.0552147,0.0704383,59
1429097529799,112,-0.0198554,0.0215748,0.0313798,69
1429097529841,112,-0.0463569,-0.0267477,-0.0238377,72
1429097529883,112,-0.053088,-0.0587214,-0.0602275,68
1429097529924,112,-0.0303794,-0.0551546,-0.0485178,60
1429097529966,112,-0.000708787,-0.0365217,-0.0168334,54
1429097530007,112,0.0272593,-0.00500786,0.0281482,46
1429097530049,112,0.0301259,0.00856936,0.0428489,43
1429097530091,112,0.0432084,0.043706,0.0744838,40
1429097530132,112,0.0460187,0.0658601,0.0858806,39
1429097530174,112,0.0355469,0.0635387,0.0710722,37
1429097530216,112,0.0323053,0.0550146,0.0578868,39
1429097530258,112,0.0131234,0.0187029,0.0206085,54
1429097530299,112,-1.11976e-05,-0.0114342,-0.0065301,69
1429097530344,112,-0.0207389,-0.0389785,-0.0378314,80
1429097530357,112,-0.0333977,-0.0472902,-0.0560436,79
1429097530398,113,-0.0398246,-0.040849,-0.0612937,74
1429097530440,113,-0.038393,-0.0284459,-0.0531358,62
1429097530481,113,-0.0358202,-0.0193729,-0.0411176,54
1429097530523,113,-0.0179827,-0.000236052,-0.00925643,46
1429097530564,113,0.0173535,0.031933,0.036008,44
1429097530606,113,0.0656166,0.0749045,0.0880877,42
1429097530647,113,0.0974298,0.109419,0.120898,40
1429097530689,113,0.0930467,0.110052,0.111773,35
1429097530730,113,0.0644454,0.0835437,0.0774847,33
1429097530772,113,0.0112787,0.0258798,0.0125527,43
1429097530814,113,-0.0346976,-0.0396494,-0.0576347,59
1429097530855,113,-0.0647477,-0.0855809,-0.107504,73
1429097530897,113,-0.0710228,-0.10371,-0.128999,78
1429097530939,113,-0.0633587,-0.100021,-0.12397,74
1429097530980,113,-0.0482136,-0.0796101,-0.0955576,70
1429097531022,113,-0.0497216,-0.0749804,-0.0819649,62
1429097531064,113,-0.0642153,-0.0857024,-0.0829693,57
1429097531106,113,-0.0828988,-0.104173,-0.0955035,51
1429097531118,113,-0.0850547,-0.104892,-0.096563,51
1429097531159,113,-0.044414,-0.0595163,-0.0463235,48
1429097531201,113,0.0164714,0.0134226,0.0299118,47
1429097531242,113,0.0814783,0.0945146,0.117654,42
1429097531284,113,0.112232,0.134193,0.162667,40
1429097531325,113,0.102189,0.115551,0.145784,52
1429097531366,113,0.0552377,0.0622295,0.0901934,67
1429097531408,113,0.00840094,0.0144342,0.0365302,83
1429097531450,113,-0.0285539,-0.0146073,-0.000579666,83
1429097531492,114,-0.0312309,-0.00623514,0.00211139,74
1429097531534,114,-0.0194092,0.0106488,0.011593,65
1429097531576,114,-0.00160619,0.0246534,0.0203149,54
1429097531588,114,0.00660705,0.0164799,0.0100161,54
1429097531629,114,-0.0132754,-0.0160445,-0.0230964,50
1429097531671,114,-0.0188235,-0.0271815,-0.027074,50
1429097531715,114,-0.0335809,-0.0308676,-0.0234164,48
1429097531727,114,-0.0374689,-0.0167791,-0.0083098,47
1429097531769,114,-0.0298062,-0.00209586,-0.00582505,44
1429097531810,114,-0.028695,-0.0177313,-0.040892,39
1429097531852,114,-0.0181043,-0.0277157,-0.0672714,37
1429097531893,114,-0.000544586,-0.0296869,-0.0736996,48
1429097531935,114,0.0287614,-0.0107651,-0.04582,64
1429097531977,114,0.0540759,0.0136745,-0.0047955,80
1429097531991,114,0.0615523,0.0393714,0.0364859,81
1429097532032,114,0.0487356,0.0524477,0.0562364,77
1429097532075,114,0.014751,0.0351002,0.0350576,69
1429097532087,114,-0.0324678,-0.0288669,-0.040082,64
1429097532128,114,-0.0601119,-0.0695334,-0.0840831,52
1429097532169,114,-0.061088,-0.0864011,-0.0943184,47
1429097532211,114,-0.0595751,-0.0837267,-0.081733,42
1429097532253,114,-0.0307269,-0.0293928,-0.0134982,40
1429097532265,114,0.00906126,0.0370492,0.0631327,40
1429097532307,114,0.0383694,0.0822947,0.109309,37
1429097532318,114,0.0338316,0.0610338,0.0797795,35
1429097532360,114,0.0294217,0.0412581,0.0513695,29
1429097532372,114,0.00780339,0.000794472,0.0008195,29
1429097532413,114,-0.00174691,-0.0251742,-0.0334578,23
1429097532455,114,0.037435,0.00747762,0.002903,28
1429097532467,114,0.0990234,0.0772405,0.0829854,34
1429097532508,114,0.126714,0.134391,0.145504,48
1429097532520,114,0.0981222,0.138276,0.146351,55
1429097532561,114,0.00334694,0.0675991,0.0619575,66
1429097532574,114,-0.134899,-0.0801075,-0.108527,66
1429097532616,114,-0.235558,-0.22176,-0.265365,61
1429097532628,114,-0.235102,-0.266074,-0.30538,57
1429097532669,114,-0.147635,-0.210295,-0.233912,49
1429097532694,114,0.00416736,-0.0611378,-0.0571665,42
1429097532735,114,0.190522,0.142611,0.187872,38
1429097532758,114,0.307716,0.287069,0.359021,37
1429097532799,114,0.300312,0.295938,0.368218,36
1429097532827,114,0.195348,0.204905,0.25201,36
1429097532857,114,0.0288655,0.0470934,0.0544197,35
1429097532898,114,-0.136665,-0.12436,-0.158264,33
1429097532927,114,-0.253588,-0.237467,-0.299838,31
1429097532959,114,-0.270725,-0.245468,-0.315065,28
1429097532994,114,-0.199215,-0.161181,-0.215484,30
1429097533027,114,-0.121951,-0.0909279,-0.125915,35
1429097533058,114,-0.0426226,-0.0310259,-0.0440474,50
1429097533099,114,0.000126552,-0.0177773,-0.0168707,71
1429097533127,114,0.0764241,0.0473332,0.0655715,74
1429097533158,114,0.192645,0.17117,0.211282,74
1429097533199,114,0.311557,0.303468,0.362449,64
1429097533226,114,0.385886,0.401276,0.472472,60
1429097533258,114,0.355446,0.398643,0.466294,52
1429097533299,114,0.230568,0.288191,0.338222,43
1429097533341,114,0.0429804,0.090385,0.111998,42
1429097533382,114,-0.13769,-0.130434,-0.135707,41
1429097533424,114,-0.226771,-0.270398,-0.291975,40
1429097533466,114,-0.223185,-0.301847,-0.326943,37
1429097533507,114,-0.12593,-0.199829,-0.213886,34
1429097533549,114,-0.016655,-0.0597395,-0.0638941,37
1429097533591,114,0.0565002,0.052449,0.0489503,48
1429097533632,114,0.0382949,0.05684,0.0355694,69
1429097533674,114,-0.0253835,-0.00539951,-0.0453479,75
1429097533716,114,-0.10509,-0.102925,-0.151195,69
1429097533757,114,-0.148385,-0.16439,-0.20204,60
1429097533799,114,-0.13362,-0.151533,-0.166351,47
1429097533841,114,-0.0531269,-0.0533677,-0.0418844,41
1429097533882,114,0.0191742,0.0434102,0.0679059,39
1429097533925,114,0.0255491,0.0710932,0.0874461,38
1429097533967,114,0.00589272,0.0503824,0.0520044,36
1429097534008,114,-0.0200525,0.0179602,0.00801731,33
1429097534051,114,-0.0327032,-0.0102888,-0.0220307,30
1429097534063,114,-0.0260856,-0.0210482,-0.024402,32
1429097534104,114,-0.00991601,-0.0207339,-0.0153424,41
1429097534146,114,-0.00581604,-0.0244539,-0.017691,68
1429097534188,114,-0.0073027,-0.0205554,-0.022793,82
1429097534229,114,-0.00424215,-0.00210752,-0.015805,85
1429097534271,114,0.00817459,0.0211447,0.00115868,79
1429097534312,114,0.0265396,0.0392909,0.0235385,65
1429097534353,114,0.031,0.0206889,0.0150466,56
1429097534396,114,0.0356334,-0.00139721,0.00516862,48
1429097534438,114,0.0406822,-0.0163336,-0.00140837,45
1429097534481,114,0.0431628,-0.0242637,-0.00643417,42
1429097534523,114,0.0380561,-0.0190851,-0.00400213,39
1429097534565,114,0.0233461,-0.00814826,0.000397836,33
1429097534607,114,-0.0100762,-0.0168626,-0.0160658,34
1429097534648,114,-0.0315804,-0.0193215,-0.0192535,52
1429097534690,114,-0.0346962,-0.00259195,-0.00111584,75
1429097534731,114,-0.017253,0.0273058,0.0302362,97
1429097534774,114,0.000652285,0.0493951,0.0490057,97
1429097534815,114,0.0255604,0.0756709,0.0728883,85
1429097534857,114,0.036978,0.0741728,0.0690488,74
1429097534898,114,0.0418938,0.0658238,0.0636802,59
1429097534940,114,0.0316144,0.0364765,0.0392562,53
1429097534982,114,0.0218926,0.0156555,0.0240406,49
1429097535023,114,-0.00383074,-0.0185295,-0.00671689,47
1429097535065,114,-0.0332661,-0.0466754,-0.0330962,42
1429097535106,114,-0.0621408,-0.0770273,-0.0656058,39
1429097535148,114,-0.0693187,-0.0831219,-0.0776535,36
1429097535189,114,-0.0535052,-0.0687963,-0.0742521,44
1429097535231,114,-0.0249553,-0.0389699,-0.0524297,73
1429097535272,114,0.00100822,-0.00805383,-0.0277635,88
1429097535313,114,0.017701,0.0162742,-0.00807798,93
1429097535355,114,0.0182541,0.023846,-0.00444216,85
1429097535398,114,0.0117059,0.0223318,-0.00776414,69
1429097535439,114,0.00118471,0.0099017,-0.015491,58
1429097535481,114,-0.00925402,-0.00781608,-0.0218875,50
1429097535523,114,-0.0238381,-0.0297619,-0.0275865,43
1429097535565,114,-0.0334329,-0.0431549,-0.0226361,40
1429097535607,114,-0.0373683,-0.0471812,-0.0160838,37
1429097535649,114,-0.0268382,-0.0318698,0.00260488,32
1429097535661,114,0.00414144,0.00235837,0.0294484,32
1429097535703,114,0.0356135,0.0338023,0.0452514,27
1429097535744,114,0.0589007,0.0544802,0.0493048,28
1429097535786,114,0.0649651,0.0591468,0.0415334,46
1429097535828,114,0.0415955,0.0391466,0.017591,64
1429097535870,114,0.00368889,0.00578816,-0.0143621,80
1429097535881,114,-0.0369703,-0.0369839,-0.0489918,80
1429097535923,114,-0.0632217,-0.0700016,-0.0708321,76
1429097535965,114,-0.0744337,-0.0865179,-0.0772433,66
1429097536007,114,-0.0594502,-0.0697155,-0.050125,48
1429097536049,114,-0.0475442,-0.0531309,-0.0286394,40
1429097536061,114,-0.0344394,-0.0274047,-0.00225176,38
1429097536103,114,-0.0227192,-0.00548082,0.0145956,36
1429097536144,114,-0.00957024,0.0124571,0.0277655,34
1429097536186,114,0.00817361,0.0244942,0.0365999,31
1429097536198,114,0.0210815,0.0294366,0.0401673,31
1429097536239,114,0.0266919,0.0277045,0.0376273,28
1429097536252,114,0.0287404,0.0316476,0.0401559,26
1429097536295,114,0.0243788,0.0339313,0.0346275,23
1429097536307,114,0.0199452,0.0334314,0.0243224,21
1429097536348,114,0.00925648,0.0230751,0.00184633,18
1429097536390,114,0.00807718,0.0193385,-0.0078663,28
1429097536402,114,0.0185578,0.0285954,0.00394264,35
1429097536445,114,0.0323455,0.0382557,0.0221408,54
1429097536457,114,0.0426065,0.0433246,0.0389001,62
1429097536499,114,0.0420283,0.0384272,0.0426299,73
1429097536511,114,0.0225712,0.0124526,0.0207385,75
1429097536552,114,-0.0145401,-0.0306114,-0.0256827,69
1429097536565,114,-0.0493472,-0.0643465,-0.0662858,69
1429097536607,114,-0.066684,-0.0845001,-0.0929165,53
1429097536627,114,-0.0586112,-0.0783367,-0.0880323,48
1429097536657,114,-0.0234972,-0.0431245,-0.0473015,40
1429097536699,114,0.0222774,0.0120063,0.0168802,35
1429097536727,114,0.07065,0.0745398,0.0882523,32
1429097536757,114,0.0798139,0.0875297,0.101449,31
1429097536795,114,0.0538917,0.062437,0.0689157,30
1429097536825,114,-3.98298e-05,0.00778392,0.00213387,27
1429097536858,114,-0.0540803,-0.0470537,-0.0625326,25
1429097536895,114,-0.0853387,-0.0801981,-0.0984147,22
1429097536926,114,-0.0825424,-0.0810076,-0.0977175,19
1429097536958,114,-0.0401236,-0.043271,-0.051701,19
1429097536999,114,0.0256385,0.0159226,0.0189373,26
1429097537026,114,0.0838564,0.0689489,0.0818509,40
1429097537058,114,0.116763,0.106391,0.122488,54
1429097537099,114,0.110937,0.112954,0.126258,61
1429097537126,114,0.0830115,0.101192,0.111087,59
1429097537157,114,0.040449,0.071815,0.0778237,51
1429097537196,114,-0.00140042,0.0335779,0.0374417,40
1429097537225,114,-0.0282514,0.00104056,0.00433198,30
1429097537257,114,-0.0382117,-0.0211303,-0.0146593,22
1429097537296,114,-0.0336149,-0.0302873,-0.0227372,19
1429097537325,114,-0.0351015,-0.0428372,-0.0366605,17
1429097537357,114,-0.0233617,-0.0369463,-0.0297722,16
1429097537396,114,-0.0188844,-0.0341413,-0.0290551,16
1429097537425,114,-0.0155454,-0.0306226,-0.0311135,15
1429097537457,114,-0.025748,-0.0415157,-0.0521916,13
1429097537496,114,-0.0298018,-0.0436097,-0.0629168,12
1429097537525,114,-0.0186498,-0.0288939,-0.0505054,15
1429097537567,114,-0.001105,-0.0095767,-0.0272013,27
1429097537609,114,0.0156062,0.00651972,-0.000340884,54
1429097537650,114,0.0111278,-0.000211247,0.00218075,67
1429097537691,114,-0.0154933,-0.0307513,-0.0246912,69
1429097537733,114,-0.0500459,-0.0605341,-0.0564944,62
1429097537774,114,-0.0608633,-0.0647335,-0.062406,49
1429097537816,114,-0.0545292,-0.0486187,-0.0484066,42
1429097537857,114,-0.0219044,-0.00793537,-0.00631271,37
1429097537899,114,0.0129907,0.0318715,0.0366056,36
1429097537940,114,0.0360235,0.051402,0.0580693,34
1429097537982,114,0.0372931,0.0465078,0.0495752,32
1429097538024,114,0.0272903,0.0232418,0.0209387,28
1429097538065,114,0.0052534,-0.00878838,-0.0193005,27
1429097538107,114,-0.008875,-0.0298782,-0.0462679,41
1429097538148,114,-0.0119437,-0.0278608,-0.0451876,62
1429097538190,114,0.00658178,0.00339169,-0.00771981,89
1429097538231,114,0.0295878,0.042927,0.040872,94
1429097538272,114,0.0474969,0.0724521,0.0785604,84
1429097538314,114,0.0453383,0.0720671,0.0837428,72
1429097538355,114,0.0276898,0.0453431,0.0623907,55
1429097538397,114,0.00184511,0.00581039,0.0268958,47
1429097538438,114,-0.00733782,-0.0180549,0.00903424,42
1429097538480,114,0.0167685,-0.00491164,0.027149,40
1429097538522,114,0.048025,0.0199251,0.0493341,35
1429097538563,114,0.0661324,0.0425095,0.0636194,30
1429097538605,114,0.0553781,0.0480159,0.0551232,25
1429097538646,114,0.0102493,0.0246482,0.0127598,28
1429097538690,114,-0.0459445,-0.0152713,-0.04473,51
1429097538704,114,-0.0957621,-0.0612351,-0.103711,63
1429097538747,114,-0.109584,-0.0788058,-0.12293,82
1429097538790,114,-0.0909914,-0.069619,-0.103071,91
1429097538836,114,-0.0582368,-0.0507331,-0.0686039,85
1429097538848,114,-0.0288169,-0.0291404,-0.0315935,80
1429097538890,114,-0.0106287,-0.018006,-0.0102753,65
1429097538931,114,-0.00774675,-0.0227468,-0.0111339,56
1429097538973,114,-0.00776643,-0.0284882,-0.0175972,49
1429097539017,114,-0.00460352,-0.0282398,-0.0205525,47
1429097539029,114,-0.00619895,-0.0280292,-0.0283267,45
1429097539071,114,-0.00815006,-0.0283753,-0.035384,42
1429097539113,114,-0.00250199,-0.0141988,-0.0237554,38
1429097539155,114,0.0132941,0.00892425,0.00381177,35
1429097539196,114,0.0300073,0.0325399,0.0353152,33
1429097539238,114,0.0400248,0.0454822,0.0554977,41
1429097539279,114,0.0347411,0.0432133,0.0582945,72
1429097539321,114,0.0296947,0.0361949,0.0517442,90
1429097539363,114,0.0290119,0.0336774,0.0454514,96
1429097539405,114,0.03091,0.0313105,0.0396157,87
1429097539447,114,0.0383859,0.034443,0.0423723,68
1429097539489,114,0.0423221,0.0350027,0.0451251,56
1429097539501,114,0.0379605,0.028762,0.0372166,52
1429097539542,114,0.0191236,0.0149646,0.0180757,45
1429097539584,114,0.000324563,0.00108138,-0.0041915,44
1429097539626,114,-0.0182596,-0.0112447,-0.0221191,43
1429097539638,114,-0.0205475,-0.0137219,-0.026118,43
1429097539679,114,-0.00932895,-0.00232978,-0.0112364,39
1429097539721,114,0.00751039,0.0132175,0.0108598,34
1429097539763,114,0.0201167,0.0329716,0.0346828,26
1429097539804,114,0.016837,0.0422921,0.0448272,28
1429097539846,114,0.00738126,0.0422874,0.0427008,49
1429097539888,114,-0.0187842,0.0175321,0.0113562,69
1429097539930,114,-0.0380609,-0.0152268,-0.0261303,82
1429097539972,114,-0.0373859,-0.0394437,-0.048992,76
1429097539983,114,-0.0192546,-0.0431377,-0.0435213,71
1429097539995,114,-0.0037584,-0.0453855,-0.0323724,65
1429097540037,114,0.00732578,-0.0399689,-0.0131544,52
1429097540078,114,-0.0100385,-0.0517358,-0.0241211,40
1429097540120,114,-0.0364362,-0.0605269,-0.045607,36
1429097540164,114,-0.0505128,-0.0497715,-0.0548951,35
1429097540175,114,-0.0488997,-0.025585,-0.0479041,35
1429097540217,114,-0.0286005,0.00306346,-0.0235589,33
1429097540229,114,-0.00335815,0.0201709,-0.00013698,31
1429097540277,114,0.0140801,0.0238295,0.0127196,26
1429097540289,114,0.0272466,0.0216465,0.0164417,26
1429097540332,114,0.0233708,0.0122814,0.0057981,21
1429097540344,114,0.0166141,0.00523467,-0.00377696,19
1429097540387,114,0.00849495,-0.00128486,-0.0100005,20
1429097540398,114,-0.00350096,-0.00837169,-0.0143357,24
1429097540440,114,-0.0120844,-0.016488,-0.014894,40
1429097540481,114,-0.0206879,-0.025486,-0.0174984,67
1429097540494,114,-0.021231,-0.0294226,-0.0144779,73
1429097540536,114,-0.0144968,-0.0261094,-0.00582149,75
1429097540558,114,-0.0115726,-0.0249266,-0.00175843,72
1429097540599,114,-0.00485879,-0.00940866,0.0146001,55
1429097540626,114,0.0043433,0.0131723,0.0349413,42
1429097540668,114,0.0240963,0.0416657,0.0627946,32
1429097540693,114,0.0488221,0.0671316,0.0869445,26
1429097540735,114,0.0683678,0.0828219,0.0977926,24
1429097540757,114,0.0806244,0.0936172,0.0996747,24
1429097540799,114,0.0716809,0.0860274,0.0758786,24
1429097540826,114,0.0475849,0.0575005,0.0315822,22
1429097540867,114,0.0141441,0.014438,-0.0247727,19
1429097540893,114,5.85214e-05,-0.0117307,-0.0504147,15
1429097540935,114,0.011554,-0.00978991,-0.0362171,12
1429097540957,114,0.0394733,0.0145744,0.00576166,12
1429097540998,114,0.0539626,0.035662,0.0401548,30
1429097541027,114,0.0421957,0.0374429,0.0457908,52
1429097541057,114,0.011362,0.0271162,0.03102,63
1429097541098,114,-0.0405297,-0.00474517,-0.00702804,79
1429097541127,114,-0.0814255,-0.0369715,-0.0430563,76
1429097541157,114,-0.101496,-0.0677418,-0.0718295,72
1429097541195,114,-0.0981284,-0.0935811,-0.0923813,62
1429097541227,114,-0.0881988,-0.120782,-0.114816,44
1429097541257,114,-0.0680906,-0.12321,-0.115331,40
1429097541295,114,-0.0528459,-0.105772,-0.102231,33
1429097541328,114,-0.0432562,-0.071476,-0.0762987,33
1429097541357,114,-0.0299831,-0.0273635,-0.0379304,34
1429097541399,114,-0.011318,0.0116154,-0.00124256,32
1429097541425,114,0.00558907,0.0333565,0.0202571,31
1429097541457,114,0.0126006,0.0283536,0.0130329,26
1429097541495,114,0.0141985,0.012945,-0.00353664,18
1429097541525,114,0.0214796,0.00911528,-0.004566,18
1429097541557,114,0.0431853,0.0293125,0.0264365,28
1429097541595,114,0.0603056,0.0575094,0.0715846,58
1429097541625,114,0.0695064,0.0807216,0.111115,69
1429097541657,114,0.0582044,0.0860246,0.126714,82
1429097541696,114,0.0358988,0.0709822,0.110087,85
1429097541725,114,0.0076317,0.0383178,0.0648521,79
1429097541767,114,-0.0140711,0.00296294,0.0131712,63
1429097541808,114,-0.00423704,-0.00259018,0.00275677,52
1429097541849,114,0.0164021,0.00608861,0.0115048,41
1429097541891,114,0.0457437,0.0277603,0.0392953,39
1429097541932,114,0.0542933,0.0377413,0.048696,36
1429097541974,114,0.0504855,0.0375901,0.0403448,34
1429097542015,114,0.0309336,0.0274794,0.0190407,30
1429097542056,114,0.0181452,0.0242286,0.00884678,27
1429097542098,114,-0.00330899,0.0113833,-0.00923754,30
1429097542139,114,-0.0243328,-0.0113148,-0.0335665,44
1429097542181,114,-0.0524497,-0.0478285,-0.0734543,78
1429097542222,114,-0.0619951,-0.0683418,-0.0940992,93
1429097542264,114,-0.0666421,-0.0827736,-0.105082,94
1429097542306,114,-0.0569302,-0.0760214,-0.0891247,85
1429097542352,114,-0.0442512,-0.0622985,-0.063963,64
1429097542364,114,-0.0314736,-0.0481961,-0.0413518,58
1429097542406,114,-0.0246775,-0.0438351,-0.0335469,48
1429097542447,114,-0.0190854,-0.0403869,-0.0339368,40
1429097542489,114,-0.0141041,-0.0349633,-0.0360286,39
1429097542530,114,-0.00247449,-0.0180528,-0.0277222,37
1429097542573,114,0.0165326,0.0100471,-0.00487225,35
1429097542615,114,0.0326683,0.0359166,0.0202865,29
1429097542656,114,0.0355194,0.0455543,0.0324709,24
1429097542698,114,0.014083,0.0279607,0.0180108,22
1429097542741,114,-0.00762533,0.00743906,0.00476292,34
1429097542784,114,-0.021415,-0.00288966,0.00365641,68
1429097542825,114,-0.0183675,-0.00539496,0.0123256,89
1429097542867,114,-0.00371408,0.00501573,0.0292063,97
1429097542909,114,0.0115271,0.0180993,0.0468125,89
1429097542951,114,0.0105565,0.0175058,0.0452372,69
1429097542992,114,-0.0117103,-0.000473157,0.0227465,56
1429097543034,114,-0.036861,-0.0199283,-0.00106935,45
1429097543076,114,-0.0505856,-0.0300529,-0.0175008,42
1429097543118,114,-0.0413324,-0.0233978,-0.0157278,40
1429097543161,114,-0.0111994,0.0020486,0.00469283,37
1429097543203,114,0.0221463,0.0304015,0.0279608,30
1429097543244,114,0.0446823,0.0458258,0.0380656,25
1429097543286,114,0.0518528,0.0413788,0.0296914,17
1429097543328,114,0.0417755,0.020275,0.00582447,13
1429097543369,114,0.0332136,0.00678749,-0.0119587,14
1429097543411,114,0.0290642,0.00390787,-0.0185098,29
1429097543453,114,0.0414306,0.0278846,0.00369286,66
1429097543494,114,0.0797933,0.0828696,0.0620023,84
1429097543536,114,0.109502,0.119339,0.107471,85
1429097543578,114,0.129744,0.137215,0.13891,75
1429097543620,114,0.100563,0.094759,0.109568,54
1429097543662,114,0.0232628,-0.00190528,0.0203138,44
1429097543674,114,-0.0635628,-0.0927792,-0.0728762,41
1429097543716,114,-0.12211,-0.137837,-0.126186,40
1429097543728,114,-0.140595,-0.133578,-0.132377,40
1429097543770,114,-0.127583,-0.107018,-0.112193,40
1429097543811,114,-0.090225,-0.0723511,-0.0753813,39
1429097543853,114,-0.0788308,-0.0725793,-0.0745863,35
1429097543894,114,-0.0846762,-0.0851268,-0.0885458,31
1429097543936,114,-0.106219,-0.103845,-0.11258,23
1429097543979,114,-0.0923517,-0.0848935,-0.0968282,19
1429097543991,114,-0.056025,-0.037772,-0.0492942,18
1429097544033,114,0.00369225,0.0243617,0.0205943,33
1429097544074,114,0.0473776,0.0624744,0.0643983,52
1429097544117,114,0.0812197,0.0881907,0.0921531,72
1429097544128,114,0.103496,0.098003,0.0955597,72
1429097544171,114,0.100369,0.0863603,0.074012,70
1429097544183,114,0.0845307,0.0667928,0.046567,66
1429097544225,114,0.0602776,0.0362988,0.0198409,56
1429097544267,114,0.0360812,0.0161721,0.0123975,42
1429097544278,114,0.0264887,0.0104329,0.0273212,42
1429097544321,114,0.0301084,0.0258968,0.0603881,37
1429097544340,114,0.0385192,0.0401315,0.0795867,37
1429097544352,114,0.0480795,0.0418768,0.0737234,38
1429097544394,114,0.0476127,0.0351769,0.0533096,40
1429097544406,114,0.0395248,0.0259208,0.0325627,40
1429097544448,114,0.0254963,0.022981,0.0253864,39
1429097544460,114,0.0121508,0.0179139,0.0242327,38
1429097544502,114,-0.0110204,-7.01052e-05,0.00787212,33
1429097544543,114,-0.025064,-0.0200439,-0.0133156,29
1429097544586,114,-0.0384457,-0.0320991,-0.0339755,26
1429097544597,114,-0.0510232,-0.0399971,-0.056839,26
1429097544639,114,-0.0448987,-0.0315273,-0.0634879,42
1429097544658,114,-0.0374932,-0.0245296,-0.0652117,51
1429097544699,114,-0.0318186,-0.0220913,-0.0597952,71
1429097544742,114,-0.0315843,-0.0290637,-0.0529492,81
1429097544758,114,-0.0443853,-0.05461,-0.0542778,79
1429097544799,114,-0.0456229,-0.0568395,-0.0363251,69
1429097544841,114,-0.0520711,-0.0557038,-0.0244935,49
1429097544857,114,-0.0821383,-0.0687255,-0.0400887,42
1429097544899,114,-0.113844,-0.0757944,-0.0580059,32
1429097544926,114,-0.150743,-0.0974089,-0.0913267,27
1429097544969,114,-0.161866,-0.104439,-0.102314,25
1429097544994,114,-0.137858,-0.095472,-0.0877745,25
1429097545036,114,-0.0952069,-0.0743384,-0.0609202,21
1429097545057,114,-0.0513998,-0.0537246,-0.0425247,19
1429097545099,114,-0.0132964,-0.0334297,-0.0349035,16
1429097545126,114,0.000662324,-0.0317558,-0.0520835,12
1429097545157,114,0.0200663,-0.0191777,-0.0527662,9
1429097545198,114,0.0759418,0.0380455,0.00575792,12
1429097545225,114,0.165719,0.140622,0.122368,26
1429097545257,114,0.258053,0.244283,0.249841,47
1429097545298,114,0.334546,0.326129,0.35722,64
1429097545325,114,0.334425,0.320512,0.369562,69
1429097545366,114,0.27798,0.257147,0.313193,65
1429097545395,114,0.145974,0.12393,0.168407,55
1429097545425,114,0.0207555,0.00333674,0.0296207,42
1429097545457,114,-0.0548688,-0.0749707,-0.0676152,32
1429097545496,114,-0.0635899,-0.0869974,-0.0892906,26
1429097545525,114,-0.0311105,-0.0551386,-0.0609765,23
1429097545566,114,-0.00823108,-0.0256927,-0.0330378,22
1429097545596,114,-0.0162506,-0.0181687,-0.0312763,21
1429097545625,114,-0.0617159,-0.0438168,-0.0658978,20
1429097545657,114,-0.12136,-0.0954735,-0.127517,18
1429097545695,114,-0.159223,-0.127223,-0.168589,13
1429097545761,114,-0.165358,-0.139982,-0.191832,14
1429097545802,114,-0.146572,-0.126295,-0.182823,88
1429097545941,114,-0.106363,-0.0943634,-0.14789,84
1429097545983,114,-0.0956102,-0.0867705,-0.130798,73
1429097545994,114,-0.0743345,-0.0613676,-0.0854599,66
1429097546036,114,-0.0777571,-0.0479892,-0.0550529,36
1429097546134,114,-0.064372,-0.0263919,-0.015574,34
1429097546177,114,-0.0306994,0.00251925,0.02664,34
1429097546226,114,0.0322887,0.0428282,0.0826542,31
1429097546239,114,0.101331,0.0872098,0.139434,84
1429097546468,114,0.166603,0.137932,0.207092,91
1429097546514,114,0.215118,0.185593,0.266124,94
1429097546556,114,0.247753,0.234755,0.320563,80
1429097546599,114,0.254524,0.261803,0.337898,65
1429097546611,114,0.213644,0.236893,0.285912,58
1429097546653,114,0.150076,0.174781,0.188486,41
1429097546695,114,0.0583976,0.0710716,0.0494549,37
1429097546738,114,-0.0350957,-0.0517099,-0.0976677,35
1429097546779,114,-0.11468,-0.1572,-0.219255,33
1429097546821,114,-0.167784,-0.225163,-0.295772,29
1429097546863,114,-0.187717,-0.237664,-0.314226,25
1429097546875,114,-0.173059,-0.208372,-0.286037,22
1429097546917,114,-0.137137,-0.153634,-0.220436,17
1429097546958,114,-0.101292,-0.100822,-0.152554,18
1429097547000,114,-0.0829242,-0.0686233,-0.100531,34
1429097547044,114,-0.0500094,-0.0301925,-0.0367904,69
1429097547089,114,-0.0357476,-0.0159918,-0.00774908,86
1429097547102,114,-0.00518556,0.0100926,0.0305555,86
1429097547150,114,0.00577208,0.00966009,0.0330202,78
1429097547161,114,-0.00521058,-0.0147774,0.00884947,72
1429097547203,114,-0.0195129,-0.035459,-0.00924834,59
1429097547245,114,-0.0131766,-0.0277842,0.00475846,40
1429097547290,114,0.00892888,0.00135559,0.0396027,32
1429097547302,114,0.0227951,0.0256865,0.059579,32
1429097547344,114,0.0575118,0.0726144,0.0940347,29
1429097547386,114,0.0811875,0.103768,0.110181,28
1429097547427,114,0.101772,0.127121,0.122322,23
1429097547469,114,0.102745,0.12563,0.118127,20
1429097547510,114,0.0771416,0.09416,0.0890553,14
1429097547552,114,0.0378718,0.0465788,0.0482033,14
1429097547593,114,-0.00390937,0.00250938,0.00781708,32
1429097547636,114,-0.0527694,-0.0407121,-0.0421739,51
1429097547679,114,-0.0908817,-0.0665089,-0.0784288,71
1429097547695,114,-0.114095,-0.085576,-0.105733,73
1429097547707,114,-0.114058,-0.0943139,-0.114521,71
1429097547748,114,-0.0933524,-0.0929757,-0.103675,64
1429097547789,114,-0.0597586,-0.0849016,-0.0803987,49
1429097547831,114,-0.0293509,-0.0691401,-0.0516383,41
1429097547873,114,-0.0102404,-0.0466684,-0.0229452,39
1429097547914,114,-0.00780994,-0.0318796,-0.0156936,39
1429097547955,114,-0.00854653,-0.0159615,-0.00827197,37
1429097547997,114,-0.007718,0.00105799,0.000571006,31
1429097548039,114,-5.07038e-05,0.0217893,0.0117256,27
1429097548051,114,0.0161622,0.0535052,0.0356705,25
1429097548092,114,0.0252817,0.0656218,0.0442832,20
1429097548134,114,0.0342411,0.0571336,0.0410296,22
1429097548176,114,0.047539,0.0471741,0.043328,40
1429097548219,114,0.0563208,0.0297479,0.0414612,56
1429097548231,114,0.0776858,0.0298991,0.0459571,61
1429097548272,114,0.0891975,0.0346962,0.0435556,64
1429097548315,114,0.0873904,0.0431385,0.0341929,54
1429097548327,114,0.079004,0.0568828,0.0310124,49
1429097548368,114,0.0588982,0.0596867,0.0265033,39
1429097548410,114,0.0386877,0.0567608,0.0332171,28
1429097548452,114,0.00832187,0.0291521,0.0279647,25
1429097548464,114,-0.0271034,-0.0160152,0.00680442,24
1429097548506,114,-0.0688409,-0.0785017,-0.0429218,22
1429097548549,114,-0.098659,-0.121581,-0.0911857,18
1429097548561,114,-0.108175,-0.127234,-0.115826,17
1429097548603,114,-0.0913678,-0.0978796,-0.105818,14
1429097548614,114,-0.0664905,-0.055864,-0.0716338,12
1429097548656,114,-0.0352633,-0.0140677,-0.0218079,11
1429097548697,114,0.0069122,0.0311487,0.0355984,23
1429097548709,114,0.0202522,0.0486066,0.0634153,30
1429097548750,114,-0.0150357,0.0123182,0.0217509,46
1429097548792,114,-0.0592752,-0.0336454,-0.0336074,58
1429097548805,114,-0.119209,-0.101506,-0.110636,58
1429097548816,114,-0.169615,-0.163095,-0.175307,57
1429097548857,114,-0.193639,-0.198375,-0.204967,51
1429097548899,114,-0.18654,-0.204463,-0.201344,37
1429097548910,114,-0.14344,-0.168873,-0.158398,33
1429097548952,114,-0.0682905,-0.0942439,-0.0821003,27
1429097548963,114,0.00993798,-0.0139234,-0.00585507,25
1429097549005,114,0.075952,0.0591412,0.0607098,24
1429097549025,114,0.131472,0.113817,0.111344,24
1429097549067,114,0.174462,0.169196,0.163451,23
1429097549093,114,0.214708,0.227376,0.230756,22
1429097549135,114,0.224628,0.258024,0.274379,19
1429097549157,114,0.19144,0.227421,0.256234,18
1429097549199,114,0.121219,0.164105,0.19066,17
1429097549226,114,0.0836885,0.128571,0.144692,26
1429097549268,114,0.0522273,0.085327,0.0885458,40
1429097549293,114,0.0367829,0.0560102,0.0466984,53
1429097549335,114,0.0376133,0.0521245,0.0354451,56
1429097549376,114,0.06527,0.0664881,0.0483007,48
1429097549394,114,0.0817405,0.0851277,0.0673804,43
1429097549436,114,0.0849387,0.0816294,0.0686668,34
1429097549457,114,0.0474507,0.0305973,0.0240741,29
1429097549499,114,-0.00594257,-0.0445253,-0.0448648,19
1429097549527,114,-0.0962185,-0.164694,-0.16477,18
1429097549557,114,-0.176524,-0.26223,-0.262468,18
1429097549599,114,-0.252403,-0.348363,-0.355058,19
1429097549625,114,-0.273378,-0.351585,-0.362198,19
1429097549657,114,-0.262206,-0.291646,-0.308026,17
1429097549693,114,-0.209891,-0.180556,-0.199006,16
1429097549725,114,-0.136492,-0.0627982,-0.0796073,15
1429097549757,114,-0.0613222,0.0163506,0.00586262,16
1429097549793,114,0.00752599,0.0697646,0.0671658,25
1429097549825,114,0.0617344,0.0951204,0.101808,39
1429097549857,114,0.0967695,0.0959589,0.108084,51
1429097549895,114,0.113116,0.0956149,0.10961,53
1429097549925,114,0.0997251,0.0657304,0.076963,50
1429097549957,114,0.0696029,0.0246189,0.0318895,43
1429097549993,114,0.038181,0.00189433,0.00407894,36
1429097550025,114,0.039545,0.0296718,0.0309239,30
1429097550057,114,0.0764844,0.0907064,0.0964904,27
1429097550093,114,0.110113,0.138276,0.150682,26
1429097550125,114,0.124215,0.141354,0.160892,25
1429097550157,114,0.101651,0.109406,0.130762,23
1429097550193,114,0.0743642,0.0768909,0.0982989,21
1429097550225,114,0.0499691,0.0573318,0.073162,17
1429097550266,114,0.052289,0.0820616,0.0925092,10
1429097550308,114,0.0708263,0.114474,0.11916,7
1429097550353,114,0.0735592,0.1231,0.117683,22
1429097550369,114,0.0531741,0.0881043,0.0735944,30
1429097550393,114,0.0162394,0.0304838,0.00905571,38
1429097550435,114,-0.02576,-0.0338444,-0.0563398,51
1429097550476,114,-0.0643007,-0.0941593,-0.111444,49
1429097550518,114,-0.082117,-0.125654,-0.132582,38
1429097550559,114,-0.0807007,-0.131825,-0.131172,29
1429097550604,114,-0.0444594,-0.0936029,-0.085986,21
1429097550616,114,-0.026483,-0.0567713,-0.0521731,20
1429097550662,114,-0.00205976,-0.0129475,-0.013315,22
1429097550679,114,-0.000698435,0.00656738,0.000388531,22
1429097550695,114,0.000956734,0.0226479,0.0147253,22
1429097550737,114,-0.0105941,0.0208215,0.0126971,20
1429097550778,114,-0.0294945,0.007342,-0.00171619,19
1429097550819,114,-0.059778,-0.0259228,-0.038542,17
1429097550861,114,-0.0909535,-0.0607186,-0.0802218,15
1429097550903,114,-0.11354,-0.0950038,-0.119595,28
1429097550944,114,-0.11848,-0.116929,-0.142153,44
1429097550986,114,-0.0879312,-0.100849,-0.118239,62
1429097551028,114,-0.0446074,-0.0737217,-0.0757922,61
1429097551071,114,0.0166225,-0.0157061,-0.00217458,50
1429097551113,114,0.0650837,0.0341591,0.0560799,38
1429097551155,114,0.0916999,0.0646503,0.0893919,33
1429097551196,114,0.0900985,0.0676518,0.0887364,29
1429097551238,114,0.0667696,0.043995,0.0573169,28
1429097551281,114,0.0508075,0.0368687,0.0407059,26
1429097551323,114,0.0342172,0.0333255,0.0293988,25
1429097551364,114,0.0338925,0.0460465,0.0396556,23
1429097551406,114,0.0284603,0.0466372,0.0437202,23
1429097551447,114,0.0328864,0.0489496,0.0535591,37
1429097551489,114,0.0256338,0.0319502,0.0407417,52
1429097551530,114,0.0210555,0.0215326,0.0302475,68
1429097551573,114,0.010339,0.00973337,0.0107726,67
1429097551614,114,-0.00840689,-0.006135,-0.0143201,57
1429097551657,114,-0.0334888,-0.0258808,-0.0378571,50
1429097551699,114,-0.0514798,-0.0437575,-0.053279,40
1429097551741,114,-0.0627055,-0.0520157,-0.0537735,37
1429097551784,114,-0.0590311,-0.0454102,-0.0389279,36
1429097551796,114,-0.0415698,-0.0247718,-0.0131148,36
1429097551838,114,-0.0165926,0.00224333,0.0146461,35
1429097551880,114,0.00802143,0.0222684,0.0328429,33
1429097551921,114,0.0272497,0.02975,0.0358964,29
1429097551963,114,0.0313337,0.018012,0.0175424,28
1429097552005,114,0.0336921,0.0108774,0.00648755,41
1429097552046,114,0.0261912,0.00262835,-0.0044833,57
1429097552088,114,0.0116843,-0.00468704,-0.011566,77
1429097552130,114,-0.00610917,-0.0116068,-0.0185306,81
1429097552175,114,-0.021259,-0.0194871,-0.0276404,76
1429097552187,114,-0.0433369,-0.0466309,-0.0620058,73
1429097552228,114,-0.062098,-0.0699232,-0.0906671,64
1429097552275,114,-0.0748719,-0.086045,-0.105952,55
1429097552287,114,-0.0643692,-0.0768278,-0.0882396,53
1429097552328,114,-0.0228052,-0.0237395,-0.0183821,50
1429097552371,114,0.0198545,0.0324538,0.0515878,46
1429097552412,114,0.0486543,0.0696196,0.0955822,43
1429097552454,114,0.0563047,0.0766454,0.100985,39
1429097552496,114,0.0469569,0.0550446,0.0725198,36
1429097552537,114,0.0384879,0.0387161,0.0500285,39
1429097552579,114,0.0255433,0.0235359,0.0261935,50
1429097552621,114,0.0179137,0.0221093,0.0161007,73
1429097552637,114,0.0213149,0.0337249,0.0190082,78
1429097552648,114,0.0202892,0.0345588,0.0169316,78
1429097552691,114,0.0139852,0.0155634,0.000676288,79
1429097552703,114,-0.00251005,-0.0207078,-0.030151,76
1429097552746,114,-0.0201751,-0.0565555,-0.0593248,68
1429097552758,114,-0.0309159,-0.070105,-0.0685774,64
1429097552799,114,-0.0303578,-0.0597696,-0.0539303,52
1429097552842,114,-0.0186951,-0.0298168,-0.0194226,46
1429097552855,114,-0.00299475,-0.00302547,0.0116323,44
1429097552896,114,0.016519,0.0287895,0.0435487,40
1429097552938,114,0.0293952,0.0484847,0.059244,37
1429097552979,114,0.0401222,0.0643104,0.0659738,34
1429097553022,114,0.0365494,0.0613998,0.0571037,27
1429097553034,114,0.0302955,0.0565613,0.0506651,25
1429097553076,114,0.0127734,0.0363996,0.0298456,20
1429097553088,114,-0.00902365,0.00669325,0.000728088,20
1429097553130,114,-0.032705,-0.0320038,-0.0431317,24
1429097553172,114,-0.0423352,-0.0463483,-0.0639141,41
1429097553213,114,-0.0435865,-0.046763,-0.0678645,50
1429097553255,114,-0.0406096,-0.041113,-0.0550204,50
1429097553296,114,-0.0524253,-0.0570234,-0.0575312,45
1429097553338,114,-0.0778211,-0.0965408,-0.0806065,34
1429097553350,114,-0.0926134,-0.117438,-0.0888796,34
1429097553392,114,-0.0766597,-0.0974157,-0.0642646,24
1429097553405,114,-0.0563979,-0.0658657,-0.0415627,21
1429097553446,114,-0.0410118,-0.0402972,-0.0323939,16
1429097553458,114,-0.0270405,-0.0134345,-0.0222442,14
1429097553500,114,-0.000270049,0.0246824,0.00806022,10
1429097553511,114,0.0375179,0.068822,0.0548207,8
1429097553553,114,0.0766643,0.103333,0.0987742,5
1429097553565,114,0.10808,0.118467,0.12369,5
1429097553610,114,0.132153,0.126282,0.134449,2
1429097553625,114,0.143577,0.12563,0.130689,0
1429097553666,114,0.145414,0.122591,0.12159,0
1429097553694,114,0.128938,0.105418,0.0956509,0
1429097553726,114,0.110934,0.0934898,0.0811094,0
1429097553758,114,0.0785774,0.0691403,0.0562615,10
1429097553799,114,0.0397352,0.0397291,0.0326084,24
1429097553827,114,-0.00231141,0.00318366,0.00461914,31
1429097553861,114,-0.0485019,-0.0439819,-0.0350143,21
1429097553892,114,-0.0962493,-0.0978395,-0.08545,10
1429097553925,114,-0.119408,-0.120082,-0.107994,0
1429097553957,114,-0.129175,-0.128597,-0.122008,0
1429097553998,114,-0.113701,-0.0962157,-0.0971763,0
1429097554025,114,-0.0900276,-0.0559283,-0.0652853,0
1429097554066,114,-0.0638809,-0.0189518,-0.0357088,0
1429097554093,114,-0.050593,-0.0209875,-0.0433665,0
1429097554125,114,-0.0363343,-0.0313379,-0.0490372,0
1429097554166,114,-0.0299381,-0.0535028,-0.062106,0
1429097554193,114,6.51563e-05,-0.0367908,-0.0319792,0
1429097554227,114,0.0197832,-0.0219476,-0.00898974,0
1429097554265,114,0.0257294,-0.00628428,0.00726894,0
1429097554292,114,0.0200806,0.00407869,0.0114289,0
1429097554335,114,0.0116585,0.00860964,0.00732598,0
1429097554357,114,0.0145083,0.0204485,0.0117501,9
1429097554398,114,0.00815624,0.00885577,-0.00337888,30
1429097554425,114,0.0169502,0.00490534,-0.00192606,35
1429097554466,114,0.016187,-0.010811,-0.0113728,26
1429097554508,114,0.0161305,-0.0166919,-0.00985336,4
1429097554549,114,0.0282055,0.00927635,0.0204813,0
1429097554591,114,0.0359482,0.0419337,0.0566674,0
1429097554632,114,0.0592822,0.0939752,0.117881,0
1429097554674,114,0.0564242,0.109412,0.140731,0
1429097554715,114,0.0267153,0.0857439,0.120357,0
1429097554757,114,-0.020037,0.0353826,0.0616961,0
1429097554798,114,-0.0654514,-0.0177922,-0.00551004,0
1429097554840,114,-0.108541,-0.0688049,-0.0746744,0
1429097554882,114,-0.104791,-0.071094,-0.0863862,0
1429097554894,114,-0.073731,-0.05053,-0.0621418,0
1429097554935,114,-0.0479424,-0.0485719,-0.0584763,14
1429097554977,114,-0.0379433,-0.0669618,-0.0782888,29
1429097555019,114,-0.0172288,-0.070364,-0.0868962,26
1429097555061,114,-0.0093821,-0.0782373,-0.10114,11
1429097555104,114,-0.0035489,-0.0776793,-0.103521,0
1429097555145,114,-0.00728878,-0.072466,-0.102324,0
1429097555190,114,-0.0370188,-0.100726,-0.133016,0
1429097555202,114,-0.0569564,-0.119127,-0.147434,0
1429097555244,114,-0.0230226,-0.075305,-0.0854637,0
1429097555285,114,0.0703675,0.0323795,0.0492926,2
1429097555327,114,0.14354,0.135161,0.167675,0
1429097555369,114,0.1933,0.226997,0.262587,0
1429097555410,114,0.204396,0.271318,0.293709,4
1429097555453,114,0.175293,0.255201,0.256559,23
1429097555494,114,0.0992291,0.164481,0.142972,51
1429097555536,114,0.00684834,0.0420289,0.0076275,55
1429097555578,114,-0.0912647,-0.0872922,-0.125599,39
1429097555620,114,-0.169305,-0.189405,-0.219853,25
1429097555662,114,-0.2094,-0.231811,-0.248908,7
1429097555704,114,-0.193985,-0.204772,-0.207029,4
1429097555746,114,-0.0854929,-0.0727962,-0.0577801,5
1429097555787,114,0.0783492,0.11255,0.141639,4
1429097555828,114,0.263103,0.314885,0.357922,2
1429097555870,114,0.356845,0.411773,0.456267,2
1429097555911,114,0.34271,0.392337,0.42553,2
1429097555952,114,0.249584,0.286968,0.304157,5
1429097555994,114,0.120852,0.142418,0.144311,30
1429097556036,114,0.032655,0.0404449,0.0353227,52
1429097556077,114,-0.0329527,-0.0385376,-0.0447954,67
1429097556119,114,-0.0830571,-0.104667,-0.108527,59
1429097556160,114,-0.14914,-0.182745,-0.186756,33
1429097556202,114,-0.22251,-0.263705,-0.268644,17
1429097556243,114,-0.291548,-0.336003,-0.343178,8
1429097556285,114,-0.328359,-0.377155,-0.383607,8
1429097556326,114,-0.29381,-0.339887,-0.34206,12
1429097556368,114,-0.219541,-0.261088,-0.260769,12
1429097556410,114,-0.115067,-0.145607,-0.145473,9
1429097556451,114,-0.0219086,-0.0385224,-0.0422533,6
1429097556493,114,0.0468044,0.0437216,0.0339964,4
1429097556535,114,0.075929,0.0793846,0.0653112,19
1429097556577,114,0.0917389,0.0997584,0.0859638,57
1429097556619,114,0.0938706,0.10578,0.0953875,72
1429097556660,114,0.106073,0.125533,0.120795,66
1429097556702,114,0.0962837,0.112989,0.112997,56
1429097556743,114,0.0950229,0.116031,0.118373,40
1429097556785,114,0.0831923,0.106173,0.11031,33
1429097556827,114,0.0634507,0.0869087,0.0933041,29
1429097556869,114,0.0381843,0.0578326,0.0672897,25
1429097556911,114,0.0247524,0.0369838,0.0512966,16
1429097556952,114,0.0117945,0.0102678,0.0269858,11
1429097556994,114,-0.00570576,-0.0195034,-0.00422773,9
1429097557036,114,-0.0293124,-0.0520841,-0.0437289,6
1429097557078,114,-0.065901,-0.089142,-0.0943307,7
1429097557121,114,-0.0954848,-0.109795,-0.130493,24
1429097557163,114,-0.101634,-0.10115,-0.132216,65
1429097557175,114,-0.0609814,-0.0436626,-0.0758006,76
1429097557217,114,-0.00887055,0.0160059,-0.00615377,87
1429097557259,114,0.0522554,0.0749901,0.0692599,77
1429097557300,114,0.0945714,0.104382,0.115922,63
1429097557312,114,0.0995055,0.0949901,0.116713,56
1429097557353,114,0.0893624,0.0738786,0.0990302,44
1429097557365,114,0.0657879,0.051444,0.0747277,41
1429097557407,114,0.0356006,0.0301199,0.0471683,38
1429097557419,114,0.00418873,0.0082281,0.0166664,37
1429097557460,114,-0.033044,-0.0216095,-0.024541,37
1429097557502,114,-0.0639541,-0.0524349,-0.0606793,35
1429097557514,114,-0.0867218,-0.0793349,-0.0888888,33
1429097557555,114,-0.085726,-0.0856993,-0.092136,28
1429097557597,114,-0.0662431,-0.0669918,-0.0684691,18
1429097557609,114,-0.0362764,-0.0350232,-0.0316256,15
1429097557651,114,-0.013315,-0.00901231,-0.00267601,13
1429097557662,114,-0.00857791,-0.0109907,-0.00297427,17
1429097557704,114,0.00257797,-0.00520476,0.004394,37
1429097557745,114,0.0280069,0.0150586,0.0269698,79
1429097557757,114,0.0418649,0.0275793,0.0363761,79
1429097557798,114,0.0320565,0.0192914,0.0204801,96
1429097557826,114,0.00376467,-0.00673178,-0.0117905,94
1429097557861,114,-0.0248331,-0.0345834,-0.0455748,76
1429097557902,114,-0.0440227,-0.0556967,-0.0678958,62
1429097557925,114,-0.0360853,-0.0490457,-0.0595807,55
1429097557967,114,-0.0114256,-0.0250783,-0.0336321,44
1429097557993,114,0.0192062,0.0073995,-0.000143159,43
1429097558025,114,0.0472955,0.0414115,0.0338032,43
1429097558066,114,0.071373,0.0772621,0.0736918,41
1429097558093,114,0.0949753,0.117986,0.12274,40
1429097558136,114,0.105998,0.14433,0.154008,32
1429097558157,114,0.0991324,0.143276,0.1543,28
1429097558198,114,0.0514081,0.0835941,0.0880081,19
1429097558225,114,-0.0066688,0.00926886,0.00500999,18
1429097558266,114,-0.057453,-0.057756,-0.0727069,40
1429097558294,114,-0.0825783,-0.0933776,-0.113282,56
1429097558325,114,-0.0781519,-0.0860253,-0.105834,92
1429097558366,114,-0.0613759,-0.0681819,-0.0822211,123
1429097558394,114,-0.0358414,-0.0401029,-0.0446783,123
1429097558425,114,-0.0251624,-0.0305995,-0.0254978,115
1429097558466,114,-0.0167195,-0.0201428,-0.0101643,65
1429097558494,114,-0.0211966,-0.027082,-0.0161891,61
1429097558525,114,-0.00867103,-0.0206179,-0.0104783,55
1429097558569,114,0.0061812,-0.0104296,0.000178303,51
1429097558593,114,0.028888,0.0085997,0.0215022,50
1429097558634,114,0.0237864,0.00236622,0.0137975,48
1429097558661,114,0.00730214,-0.0122036,-0.00421935,46
1429097558703,114,-0.023886,-0.0417324,-0.0404085,43
1429097558744,114,-0.0515149,-0.0666078,-0.071268,40
1429097558785,114,-0.0721026,-0.0821864,-0.0926285,39
1429097558827,114,-0.069996,-0.071063,-0.085491,46
1429097558869,114,-0.0586244,-0.049102,-0.063245,60
1429097558910,114,-0.0231555,-0.00459443,-0.0145404,75
1429097558952,114,0.0140999,0.0352624,0.0310616,82
1429097558993,114,0.0528268,0.0741711,0.0772678,78
1429097559035,114,0.0793282,0.0989717,0.109145,64
1429097559078,114,0.0842137,0.101813,0.117427,53
1429097559120,114,0.0825076,0.0996584,0.120188,50
1429097559161,114,0.06381,0.0826746,0.102511,48
1429097559203,114,0.0455155,0.0718823,0.0880119,47
1429097559244,114,0.0294014,0.0616597,0.0705642,46
1429097559286,114,0.014011,0.0465333,0.048794,43
1429097559327,114,-0.00165345,0.0199343,0.01685,41
1429097559369,114,-0.0277322,-0.0260576,-0.0335899,38
1429097559410,114,-0.0606004,-0.0820084,-0.0943462,44
1429097559452,114,-0.0738295,-0.113356,-0.127034,67
1429097559493,114,-0.0897586,-0.138432,-0.150317,82
1429097559535,114,-0.0927402,-0.136815,-0.140607,88
1429097559577,114,-0.0885841,-0.120869,-0.113803,82
1429097559618,114,-0.0749327,-0.089373,-0.0732717,69
1429097559660,114,-0.0524771,-0.0502543,-0.0328585,61
1429097559702,114,-0.0365349,-0.0267557,-0.0174316,54
1429097559743,114,-0.00657744,-0.00247634,-0.0042477,52
1429097559785,114,0.0189784,0.0171943,0.00253699,49
1429097559826,114,0.0470508,0.0465351,0.0236327,47
1429097559868,114,0.0522032,0.0536594,0.024266,41
1429097559909,114,0.0457635,0.0492137,0.019277,38
1429097559952,114,0.0503001,0.0504409,0.0279067,32
1429097559993,114,0.0729331,0.0663934,0.0575603,35
1429097560035,114,0.102844,0.0985531,0.105153,54
1429097560077,114,0.0886565,0.0908392,0.102865,71
1429097560119,114,0.0609185,0.0716223,0.0832225,82
1429097560161,114,0.0155947,0.0308861,0.035444,80
1429097560203,114,0.00247718,0.0134659,0.0175264,69
1429097560245,114,-0.00805136,-0.0113469,-0.00740198,60
1429097560286,114,-0.0078299,-0.0277003,-0.0211297,50
1429097560328,114,-0.0374828,-0.0628021,-0.0599746,47
1429097560370,114,-0.0775125,-0.100468,-0.104462,44
1429097560415,114,-0.108569,-0.111035,-0.120623,42
1429097560427,114,-0.123779,-0.107104,-0.121067,42
1429097560468,114,-0.112138,-0.0759336,-0.0928168,40
1429097560510,114,-0.084496,-0.0414657,-0.0596687,37
1429097560552,114,-0.013413,0.0216666,0.0108942,31
1429097560594,114,0.0700085,0.0854879,0.0896543,29
1429097560606,114,0.132629,0.118707,0.138117,30
1429097560648,114,0.140686,0.114549,0.140048,50
1429097560660,114,0.125286,0.0996211,0.12585,50
1429097560702,114,0.104055,0.0991234,0.12128,78
1429097560744,114,0.0877821,0.108249,0.125908,86
1429097560787,114,0.0775307,0.111252,0.125955,80
1429097560828,114,0.076062,0.10397,0.119869,70
1429097560870,114,0.0630727,0.0676514,0.0874223,55
1429097560912,114,0.0438051,0.0201922,0.0433872,50
1429097560924,114,0.0038285,-0.0379408,-0.020638,49
1429097560966,114,-0.053231,-0.0976158,-0.0946024,48
1429097561008,114,-0.0892453,-0.129655,-0.142995,47
1429097561050,114,-0.0888366,-0.113187,-0.138761,43
1429097561092,114,-0.046429,-0.0377288,-0.0669098,40
1429097561134,114,0.0174538,0.0569385,0.0356704,34
1429097561175,114,0.0678863,0.125443,0.115675,29
1429097561217,114,0.0741251,0.122747,0.121732,31
1429097561258,114,0.0280465,0.0471111,0.0459943,44
1429097561300,114,-0.0484841,-0.0716185,-0.0816012,72
1429097561341,114,-0.109248,-0.15427,-0.176082,81
1429097561383,114,-0.128363,-0.169869,-0.19725,76
1429097561395,114,-0.121077,-0.142685,-0.172268,76
1429097561436,114,-0.113245,-0.114695,-0.138958,59
1429097561478,114,-0.0859134,-0.0787637,-0.0919215,49
1429097561490,114,-0.0533705,-0.0533395,-0.0522064,45
1429097561531,114,-0.0102287,-0.0205708,-0.00860285,41
1429097561573,114,0.0374389,0.0182177,0.036966,40
1429097561585,114,0.073865,0.0562143,0.0762848,40
1429097561627,114,0.0828129,0.0800646,0.0952723,39
1429097561638,114,0.0777389,0.0925326,0.105243,37
1429097561680,114,0.0666762,0.0960036,0.107512,34
1429097561722,114,0.0518095,0.0895091,0.101111,27
1429097561735,114,0.0274973,0.062163,0.0688126,24
1429097561777,114,-0.00375212,0.0174246,0.0184493,19
1429097561819,114,-0.0347008,-0.026538,-0.0318996,24
1429097561860,114,-0.0603701,-0.0623744,-0.0699997,39
1429097561902,114,-0.0858408,-0.093271,-0.099639,66
1429097561914,114,-0.110636,-0.119468,-0.125456,66
1429097561956,114,-0.120481,-0.131117,-0.13622,75
1429097561967,114,-0.111615,-0.123135,-0.127176,75
1429097562009,114,-0.0806157,-0.0941005,-0.09827,65
1429097562021,114,-0.0456402,-0.0584426,-0.0621031,59
1429097562063,114,0.00404908,-0.00928024,-0.00933197,48
1429097562075,114,0.0430532,0.0308772,0.0368733,43
1429097562117,114,0.0822357,0.0815666,0.0967586,36
1429097562128,114,0.112216,0.126967,0.147917,34
1429097562170,114,0.129808,0.159942,0.182078,30
1429097562194,114,0.123738,0.163259,0.181661,30
1429097562236,114,0.101657,0.135217,0.147907,27
1429097562261,114,0.082771,0.0974126,0.104031,25
1429097562292,114,0.0543721,0.0445266,0.0433773,22
1429097562325,114,0.0444609,0.0199269,0.00983078,19
1429097562366,114,0.0291658,-0.000566097,-0.0219012,16
1429097562392,114,0.0192807,-0.00824268,-0.0352784,18
1429097562433,114,0.0173554,-0.000636398,-0.0224,29
1429097562461,114,0.0264664,0.0219406,0.0124502,49
1429097562492,114,0.0219574,0.0331875,0.0374752,71
1429097562534,114,-0.00630274,0.0149237,0.0297511,83
1429097562563,114,-0.0591449,-0.0393355,-0.021937,83
1429097562592,114,-0.128856,-0.122041,-0.109686,76
1429097562634,114,-0.183398,-0.193747,-0.189968,65
1429097562662,114,-0.222611,-0.247298,-0.253755,54
1429097562692,114,-0.218728,-0.247771,-0.259148,46
1429097562725,114,-0.172431,-0.199792,-0.213374,42
1429097562763,114,-0.0983516,-0.120582,-0.131704,40
1429097562792,114,-0.00963062,-0.0270656,-0.0398161,38
1429097562824,114,0.0512489,0.0400449,0.0247269,35
1429097562862,114,0.0965319,0.0928233,0.0771863,32
1429097562892,114,0.127422,0.130903,0.121153,29
1429097562934,114,0.138968,0.151432,0.149053,25
1429097562976,114,0.144022,0.158217,0.164943,27
1429097563018,114,0.154136,0.172662,0.187455,40
1429097563060,114,0.14485,0.169969,0.189517,74
1429097563102,114,0.101179,0.133354,0.152771,89
1429097563143,114,0.00253025,0.0338772,0.0463143,88
1429097563185,114,-0.0960904,-0.0784002,-0.0697708,77
1429097563226,114,-0.175118,-0.181428,-0.1773,58
1429097563268,114,-0.194964,-0.215303,-0.211963,49
1429097563309,114,-0.153612,-0.17538,-0.168803,41
1429097563351,114,-0.0946008,-0.102005,-0.0939203,40
1429097563363,114,-0.0327485,-0.0213597,-0.0131391,40
1429097563404,114,0.00713549,0.0279971,0.0315689,35
1429097563447,114,0.018852,0.0342648,0.0293083,31
1429097563490,114,0.0379213,0.0368957,0.0254427,24
1429097563532,114,0.0587616,0.0404184,0.0254487,21
1429097563574,114,0.0898759,0.0643441,0.0507715,26
1429097563616,114,0.127922,0.107456,0.0990926,42
1429097563657,114,0.106865,0.094138,0.084101,72
1429097563699,114,0.087174,0.0961645,0.0828843,81
1429097563741,114,0.0638089,0.087341,0.0732604,75
1429097563782,114,0.0568525,0.0921248,0.0823396,62
1429097563823,114,0.0539231,0.0845345,0.0846828,40
1429097563865,114,0.0321117,0.0420006,0.0525805,31
1429097563908,114,-0.0188662,-0.038284,-0.0217024,25
1429097563950,114,-0.0719571,-0.116404,-0.0999279,24
1429097563994,114,-0.118863,-0.168822,-0.158061,22
1429097564006,114,-0.129911,-0.175796,-0.171115,20
1429097564049,114,-0.122129,-0.154459,-0.155654,17
1429097564097,114,-0.109023,-0.126467,-0.130402,11
1429097564111,114,-0.0791828,-0.0699174,-0.0713832,9
1429097564153,114,-0.0248556,0.00720729,0.0147667,7
1429097564197,114,0.0497812,0.0984918,0.116472,25
1429097564208,114,0.118704,0.161339,0.185994,36
1429097564250,114,0.16307,0.198465,0.221955,60
1429097564291,114,0.162958,0.189431,0.20322,81
1429097564333,114,0.126948,0.146957,0.15126,78
1429097564375,114,0.068627,0.0847722,0.0797797,61
1429097564417,114,0.00507471,0.00948663,-0.00130675,47
1429097564458,114,-0.0400309,-0.0465775,-0.0606312,32
1429097564500,114,-0.0459723,-0.0711383,-0.0822572,27
1429097564542,114,-0.00931111,-0.0413527,-0.0437309,26
1429097564583,114,0.0465889,0.0225758,0.0308741,26
1429097564626,114,0.0827145,0.0765473,0.0888986,25
1429097564638,114,0.066811,0.0709653,0.0755733,25
1429097564679,114,0.00872651,0.0102606,0.000562575,22
1429097564721,114,-0.0687505,-0.0820937,-0.110713,19
1429097564762,114,-0.13396,-0.162828,-0.204591,23
1429097564803,114,-0.14897,-0.181705,-0.224706,39
1429097564845,114,-0.108371,-0.132667,-0.163047,73
1429097564887,114,-0.0508271,-0.0559116,-0.0685551,87
1429097564928,114,-2.6957e-05,0.0190925,0.0220169,85
1429097564970,113,0.0285138,0.0686847,0.0840378,74
1429097565012,113,0.0359829,0.0840106,0.104564,55
1429097565054,113,0.0450013,0.0878611,0.111177,45
1429097565097,113,0.064378,0.0912291,0.115587,39
1429097565109,113,0.0734292,0.0854401,0.103228,38
1429097565150,113,0.0685384,0.0709596,0.0757716,37
1429097565192,113,0.0414097,0.0375813,0.0281166,34
1429097565233,113,0.01521,0.00181738,-0.0135349,30
1429097565275,113,-0.00407468,-0.028918,-0.0416075,24
1429097565316,113,-0.0135388,-0.0444048,-0.0509138,23
1429097565357,113,-0.0147267,-0.0463097,-0.0440118,31
1429097565399,113,-0.0221057,-0.0418691,-0.0376845,59
1429097565440,113,-0.0337447,-0.0379209,-0.0366208,79
1429097565452,113,-0.0553738,-0.0501078,-0.0564519,85
1429097565494,113,-0.0685842,-0.0631786,-0.0732722,86
1429097565536,111,-0.0830642,-0.0849731,-0.0917849,77
1429097565548,111,-0.0740135,-0.0822204,-0.0790844,71
1429097565589,111,-0.0466672,-0.0584471,-0.0462913,58
1429097565601,111,-0.00896932,-0.0171996,-0.000326454,53
1429097565643,111,0.0130745,0.00829619,0.0214203,41
1429097565655,111,0.01956,0.0142235,0.0209042,41
1429097565697,111,0.0164598,0.0112834,0.0111814,38
1429097565708,111,0.00746566,0.00729792,0.00342689,38
1429097565750,111,0.00429535,0.0141296,0.00895646,39
1429097565761,111,0.0124133,0.0337363,0.0304647,39
1429097565803,111,0.0247332,0.0520401,0.0509099,37
1429097565825,111,0.0338929,0.0574551,0.0597032,33
1429097565867,111,0.0274835,0.0421145,0.0438316,29
1429097565893,111,0.0179616,0.0207863,0.0202044,25
1429097565934,111,0.0100066,0.00645094,0.00320006,30
1429097565960,111,0.00376013,-1.65351e-05,-0.0054455,44
1429097566002,111,-0.00249902,-0.00183143,-0.00661622,58
1429097566025,111,-0.0164922,-0.0116975,-0.0153028,64
1429097566067,111,-0.0410665,-0.0349412,-0.0361724,67
1429097566093,111,-0.0563419,-0.04793,-0.045327,63
1429097566136,111,-0.045077,-0.0374973,-0.030464,56
1429097566160,111,-0.0222529,-0.0187291,-0.0103552,48
1429097566201,111,0.00310828,0.000631428,0.00402027,41
1429097566225,111,0.0245496,0.00948139,0.00379919,40
1429097566266,111,0.0225821,0.000503329,-0.0156579,38
1429097566294,111,0.0230701,0.000558394,-0.0200562,37
1429097566336,111,0.0200154,0.00234086,-0.0168115,35
1429097566361,111,0.038765,0.0236731,0.0121753,31
1429097566403,111,0.0635316,0.0547013,0.0541584,26
1429097566425,111,0.0889031,0.0886651,0.0966888,24
1429097566469,111,0.0945843,0.103236,0.116609,16
1429097566494,111,0.0773187,0.0913222,0.105631,13
1429097566525,111,0.0384493,0.0532065,0.0671758,16
1429097566567,111,-0.0165038,-0.0130068,-0.00318486,39
1429097566594,111,-0.0597133,-0.0674046,-0.0609708,49
1429097566625,111,-0.0637334,-0.0801782,-0.0774869,64
1429097566661,111,-0.0465553,-0.0631588,-0.0585389,67
1429097566692,111,-0.0320078,-0.0413637,-0.0325166,64
1429097566724,111,-0.0485483,-0.0486495,-0.0365716,54
1429097566762,111,-0.102907,-0.0941099,-0.0814701,39
1429097566792,111,-0.180079,-0.16278,-0.156753,35
1429097566834,111,-0.230741,-0.209328,-0.211805,28
1429097566862,111,-0.23035,-0.206934,-0.216542,27
1429097566892,111,-0.167267,-0.14786,-0.161201,26
1429097566934,111,-0.06313,-0.0531699,-0.064882,23
1429097566962,111,0.0346646,0.0348987,0.0234024,20
1429097566997,111,0.0926419,0.090065,0.0769289,16
1429097567024,111,0.12624,0.127518,0.111208,14
1429097567062,111,0.132201,0.140516,0.123724,9
1429097567092,111,0.152576,0.164228,0.158724,5
1429097567124,111,0.177228,0.191789,0.200898,5
1429097567166,111,0.208704,0.219868,0.246856,25
1429097567208,111,0.227337,0.230992,0.266477,45
1429097567251,111,0.227725,0.223963,0.257487,65
1429097567293,109,0.155595,0.142667,0.160348,63
1429097567337,109,0.0450109,0.023006,0.0216606,50
1429097567349,109,-0.110047,-0.13292,-0.150413,44
1429097567390,109,-0.20738,-0.230433,-0.248888,35
1429097567432,109,-0.230359,-0.252411,-0.258967,26
1429097567474,109,-0.213933,-0.229609,-0.225222,25
1429097567518,109,-0.178621,-0.177132,-0.171916,25
1429097567530,109,-0.122966,-0.103394,-0.105598,24
1429097567572,109,-0.0405499,-0.0148539,-0.0237599,22
1429097567614,109,0.0350108,0.049626,0.039447,18
1429097567656,109,0.0711264,0.0723813,0.063103,14
1429097567698,109,0.0504407,0.0342476,0.0266104,8
1429097567739,109,-0.00479608,-0.0262023,-0.0347371,10
1429097567781,109,-0.0391608,-0.0578539,-0.0677052,30
1429097567823,109,-0.0367772,-0.0480405,-0.0597881,46
1429097567864,109,0.013172,0.00875839,0.00192392,54
1429097567906,109,0.0526619,0.055694,0.053229,49
1429097567947,109,0.0435356,0.0503559,0.0499229,34
1429097567989,109,-0.0173916,-0.0134404,-0.0159989,24
1429097568031,109,-0.0815042,-0.0877449,-0.0926268,16
1429097568072,109,-0.112997,-0.11806,-0.124289,16
1429097568114,109,-0.0998208,-0.0921357,-0.0951695,17
1429097568156,109,0.00208734,0.0325262,0.0444391,16
1429097568198,109,0.111251,0.156135,0.188407,13
1429097568239,109,0.188836,0.232754,0.280009,10
1429097568281,109,0.189923,0.218324,0.261989,7
1429097568323,109,0.134303,0.137109,0.164342,13
1429097568365,109,0.0634267,0.0480599,0.0497431,37
1429097568407,109,0.0154106,0.0032541,-0.0152139,52
1429097568449,109,-0.00302662,-0.00145731,-0.0330967,59
1429097568491,108,-0.0100792,0.00323961,-0.0331928,53
1429097568533,108,-0.00699813,0.00520183,-0.024695,39
1429097568578,108,-0.00456359,-0.00734497,-0.0218071,31
1429097568589,108,0.0312333,0.0141213,0.023004,28
1429097568633,108,0.0717345,0.0470779,0.076063,26
1429097568645,108,0.120804,0.096712,0.139092,26
1429097568687,108,0.124725,0.104565,0.146222,26
1429097568731,108,0.0785906,0.0631624,0.0880084,25
1429097568743,108,0.00382402,-0.0125707,-0.0106868,25
1429097568785,108,-0.104694,-0.119469,-0.141514,22
1429097568827,108,-0.157542,-0.16599,-0.202731,19
1429097568870,108,-0.165576,-0.16861,-0.210926,16
1429097568882,108,-0.106335,-0.105551,-0.140534,19
1429097568923,108,-0.022746,-0.0267289,-0.0494544,32
1429097568965,108,0.0358785,0.0202656,0.00888808,62
1429097569006,108,0.0390294,0.0116012,0.00435692,73
1429097569048,108,0.0116225,-0.0173549,-0.0243419,74
1429097569090,108,-0.0214771,-0.041139,-0.0464353,62
1429097569104,108,-0.0578662,-0.0641276,-0.0647839,56
1429097569145,108,-0.0743676,-0.065273,-0.0594233,46
1429097569187,108,-0.072583,-0.0537347,-0.0399943,36
1429097569228,108,-0.0625552,-0.042545,-0.0253888,33
1429097569271,108,-0.0260924,-0.00494541,0.0123406,34
1429097569284,108,0.0342809,0.0540848,0.068159,34
1429097569326,108,0.0854886,0.104645,0.11228,32
1429097569338,108,0.0944588,0.115811,0.11493,31
1429097569380,108,0.0639484,0.087137,0.0817777,29
1429097569421,108,0.00051505,0.0247706,0.0148597,25
1429097569464,108,-0.0381286,-0.0140577,-0.0217887,27
1429097569506,108,-0.0562617,-0.0323554,-0.0386248,49
1429097569518,108,-0.0413248,-0.0217808,-0.0250634,60
1429097569559,108,-0.0145242,-0.00834108,-0.0118915,78
1429097569601,108,0.0155683,0.00558633,0.00250325,87
1429097569613,108,0.0271049,-0.0028844,-0.00361435,87
1429097569655,107,0.0210915,-0.0208615,-0.0152502,77
1429097569696,107,-0.000975669,-0.0473876,-0.0307669,67
1429097569738,107,-0.0216736,-0.0612656,-0.0377723,52
1429097569779,107,-0.0178143,-0.041967,-0.0180667,46
1429097569821,107,0.00703758,0.00178321,0.0182905,44
1429097569863,107,0.039537,0.0481206,0.056112,43
1429097569874,107,0.0613867,0.0759483,0.0752435,42
1429097569916,107,0.0656615,0.0819564,0.0776534,40
1429097569958,107,0.0473627,0.0644869,0.0592984,35
1429097570000,107,0.0162235,0.0328552,0.0291035,31
1429097570041,107,-0.0189852,-0.00494239,-0.0104938,30
1429097570082,107,-0.0578573,-0.0461541,-0.0544046,41
1429097570124,107,-0.0672139,-0.0591953,-0.0705563,74
1429097570137,107,-0.0740501,-0.0723335,-0.0883492,84
1429097570178,107,-0.0702328,-0.0772917,-0.0979391,96
1429097570220,107,-0.0657295,-0.0862024,-0.105634,93
1429097570231,106,-0.0673108,-0.0936413,-0.108354,93
1429097570279,106,-0.0650417,-0.0927405,-0.0950078,77
1429097570291,106,-0.0753123,-0.0958225,-0.086947,72
1429097570333,106,-0.0623114,-0.0686927,-0.0514796,61
1429097570344,106,-0.0268339,-0.0216803,0.000280197,58
1429097570388,106,0.0197872,0.0350895,0.0534568,52
1429097570403,106,0.0592531,0.0742598,0.0847367,51
1429097570414,106,0.0832017,0.0941177,0.0940752,51
1429097570456,106,0.087027,0.0937493,0.0810836,48
1429097570468,106,0.0731455,0.0787921,0.0588763,48
1429097570509,106,0.063878,0.0667212,0.0486921,43
1429097570524,106,0.062071,0.0641809,0.0536827,40
1429097570566,106,0.0715302,0.0713088,0.0702509,37
1429097570592,106,0.06768,0.068865,0.0714717,32
1429097570634,106,0.0704612,0.0757933,0.0794808,26
1429097570661,106,0.0609184,0.0688201,0.0714108,25
1429097570692,106,0.0420611,0.0538204,0.0564655,36
1429097570733,106,0.00891667,0.0209045,0.0245158,54
1429097570762,106,-0.043231,-0.0341797,-0.0280129,73
1429097570792,106,-0.076951,-0.0729499,-0.0614404,81
1429097570834,104,-0.0977074,-0.0991454,-0.0844884,78
1429097570862,104,-0.0926551,-0.0989283,-0.0868622,69
1429097570892,104,-0.073869,-0.0833742,-0.0785633,58
1429097570924,104,-0.0522445,-0.0635066,-0.0681205,48
1429097570966,104,-0.035026,-0.0474564,-0.0561255,40
1429097570992,104,-0.0249163,-0.0327908,-0.041932,38
1429097571034,104,-0.00660518,-0.00975547,-0.0170472,37
1429097571060,104,0.0215165,0.022041,0.0195763,36
1429097571092,104,0.0485508,0.0496256,0.0475372,34
1429097571124,104,0.0624746,0.0630886,0.0581074,30
1429097571166,104,0.0603577,0.0596597,0.0519468,25
1429097571192,104,0.0451684,0.0485708,0.0395892,19
1429097571234,104,0.0105603,0.0168872,0.00983996,13
1429097571260,104,-0.000174783,0.0125184,0.0139763,12
1429097571292,104,0.00530193,0.0190401,0.0263934,19
1429097571334,104,0.0165801,0.0244678,0.031987,33
1429097571375,104,0.0273495,0.0233755,0.0264855,49
1429097571417,104,0.0152638,0.00370867,-0.00025109,49
1429097571458,104,-0.0126285,-0.0297395,-0.0352946,39
1429097571504,104,-0.0512096,-0.066124,-0.0678166,25
1429097571516,104,-0.0612615,-0.070792,-0.0662526,25
1429097571558,104,-0.0276684,-0.0279091,-0.0183834,18
1429097571600,104,0.0188822,0.0267865,0.0366277,18
1429097571642,104,0.0400817,0.050803,0.0568208,19
1429097571684,104,0.0320222,0.0408079,0.0423666,17
1429097571725,104,-0.0227043,-0.0180975,-0.0186236,12
1429097571767,104,-0.0943584,-0.0963115,-0.0952885,8
1429097571809,104,-0.15325,-0.160577,-0.157552,2
1429097571851,104,-0.179689,-0.18612,-0.184769,1
1429097571893,104,-0.157977,-0.160361,-0.161528,11
1429097571935,104,-0.101887,-0.0964288,-0.104264,24
1429097571976,104,-0.0260418,-0.0134491,-0.0256487,36
1429097572018,104,0.0295277,0.0431812,0.0288651,33
1429097572059,104,0.0722439,0.0854378,0.0765512,21
1429097572100,104,0.0812389,0.0903877,0.0916191,13
1429097572142,104,0.0890625,0.0931395,0.106681,6
1429097572184,104,0.0944855,0.0930218,0.11621,6
1429097572229,104,0.0903864,0.0828256,0.108092,10
1429097572240,104,0.0830741,0.0722379,0.0911084,10
1429097572282,104,0.0679027,0.054777,0.0653684,10
1429097572324,104,0.0639789,0.0503724,0.0594403,7
1429097572369,104,0.0726701,0.0615885,0.0748078,5
1429097572381,104,0.0831059,0.0752916,0.0960072,4
1429097572423,104,0.0705941,0.0651756,0.0865222,8
1429097572465,104,0.0407594,0.0383694,0.0476654,21
1429097572507,104,0.0129542,0.0169074,0.00508387,41
1429097572552,104,-0.00738544,0.000419904,-0.0329475,46
1429097572564,104,-0.0167585,-0.0085396,-0.054295,45
1429097572612,104,-0.0255589,-0.0269322,-0.0700663,37
1429097572624,104,-0.0345278,-0.0367074,-0.0656413,33
1429097572665,104,-0.0480092,-0.0461955,-0.0577867,26
1429097572707,104,-0.0525556,-0.0412106,-0.0396896,20
1429097572749,104,-0.050512,-0.0333785,-0.0271827,21
1429097572791,104,-0.043452,-0.0306977,-0.0289958,24
1429097572833,104,-0.0413299,-0.0416142,-0.0459087,25
1429097572874,104,-0.0412368,-0.0611326,-0.0660075,22
1429097572916,104,-0.0349316,-0.0561494,-0.0569359,18
1429097572957,104,-0.0293477,-0.0446524,-0.0384827,13
1429097572999,104,-0.0201516,-0.016656,-0.00725801,19
1429097573040,104,-0.00547343,0.0177848,0.0271931,40
1429097573082,104,0.0268854,0.0595309,0.0658773,52
1429097573125,102,0.0487834,0.0786909,0.0823476,51
1429097573137,102,0.0566096,0.0732441,0.0772332,51
1429097573179,102,0.0457485,0.0449295,0.0519393,39
1429097573220,102,0.0182534,0.00803465,0.0154286,31
1429097573262,102,0.0020103,-0.0117055,-0.00361997,24
1429097573303,102,-0.00210179,-0.00779212,-0.00321993,24
1429097573345,102,0.00357485,-0.00112381,-0.000199345,26
1429097573387,102,0.00352186,-0.00391002,-0.00603408,26
1429097573429,102,-0.010099,-0.0182904,-0.0247898,25
1429097573471,102,-0.0461028,-0.0566796,-0.064481,24
1429097573513,102,-0.0721229,-0.0801991,-0.0881552,21
1429097573524,102,-0.0692333,-0.0665857,-0.0753206,20
1429097573568,102,-0.0316419,-0.0247295,-0.0317766,23
1429097573579,102,0.00508567,0.0161274,0.0110028,28
1429097573621,102,0.0324185,0.0530819,0.049633,41
1429097573662,102,0.0404968,0.0626348,0.0603973,59
1429097573703,102,0.050231,0.0686985,0.0684129,59
1429097573745,102,0.070519,0.0742996,0.075017,49
1429097573789,102,0.0939346,0.0801649,0.0819027,41
1429097573802,102,0.101036,0.063727,0.0647098,38
1429097573843,102,0.0837209,0.0297452,0.030616,30
1429097573885,102,0.0411507,-0.0203252,-0.0187231,28
1429097573926,102,-0.0144172,-0.0751267,-0.0712433,29
1429097573967,102,-0.0466061,-0.0941535,-0.0870247,30
1429097574009,102,-0.0507131,-0.0757961,-0.0681148,29
1429097574051,102,-0.012747,-0.00942827,-0.00479807,27
1429097574092,102,0.0231889,0.0560468,0.0538158,23
1429097574134,102,0.0378176,0.0935069,0.0859964,20
1429097574176,102,0.0206149,0.0857481,0.0777939,29
1429097574218,102,-0.0285502,0.028203,0.0234691,43
1429097574259,102,-0.0741101,-0.0399353,-0.0376157,59
1429097574301,102,-0.111837,-0.106335,-0.10038,58
1429097574313,102,-0.123172,-0.138976,-0.133538,55
1429097574355,102,-0.143207,-0.168932,-0.169435,48
1429097574367,102,-0.169938,-0.194587,-0.200929,44
1429097574409,102,-0.178758,-0.195233,-0.200668,38
1429097574450,102,-0.148625,-0.155276,-0.151318,32
1429097574491,102,-0.0839083,-0.0732226,-0.060297,31
1429097574534,102,0.00485158,0.0339181,0.0515773,34
1429097574546,102,0.0905792,0.132262,0.144801,34
1429097574587,102,0.137857,0.184606,0.184847,33
1429097574600,102,0.155288,0.189971,0.178088,32
1429097574642,102,0.155827,0.165641,0.151605,29
1429097574654,102,0.151531,0.134493,0.129334,27
1429097574695,102,0.127825,0.0916557,0.0952591,23
1429097574707,102,0.0803565,0.0380527,0.0461214,23
1429097574749,102,0.0218387,-0.0144711,-0.0128946,22
1429097574760,102,-0.0459999,-0.0756812,-0.0872294,22
1429097574802,102,-0.085231,-0.110139,-0.132946,36
1429097574824,102,-0.063686,-0.0827771,-0.105573,42
1429097574866,102,0.000214845,-0.0120252,-0.0219476,57
1429097574893,102,0.0781893,0.0742992,0.083719,58
1429097574924,102,0.102705,0.103007,0.124086,54
1429097574966,102,0.0884112,0.0932179,0.119314,43
1429097574992,102,0.0328286,0.0416126,0.0598352,40
1429097575034,102,-0.0143004,1.07231e-05,0.00851363,33
1429097575061,102,-0.022494,-0.00207144,-0.00105525,32
1429097575092,102,-0.000602699,0.0258982,0.0234919,32
1429097575133,102,0.0178785,0.047115,0.0416713,34
1429097575161,102,0.0480199,0.0769874,0.0756586,34
1429097575192,102,0.0513955,0.0773138,0.0788737,34
1429097575233,102,0.0287512,0.0434395,0.0490222,30
1429097575262,102,-0.0344987,-0.039527,-0.0369079,27
1429097575292,102,-0.0949754,-0.1087,-0.110977,25
1429097575334,102,-0.128467,-0.141773,-0.151272,24
1429097575361,102,-0.135729,-0.140214,-0.157154,27
1429097575392,102,-0.0978429,-0.094788,-0.113957,38
1429097575434,102,-0.0335527,-0.0334159,-0.047385,54
1429097575460,102,0.0113306,-7.08012e-05,-0.00530933,56
1429097575501,102,0.0223109,-0.00611571,-0.00193243,53
1429097575524,102,-0.0126824,-0.0518031,-0.0417553,50
1429097575566,102,-0.0438445,-0.0819138,-0.069867,40
1429097575612,102,-0.0622101,-0.0861284,-0.0745277,34
1429097575624,102,-0.0570163,-0.0622419,-0.0545044,34
1429097575666,102,-0.0282698,-0.0170435,-0.0127654,35
1429097575707,102,-0.00154083,0.0164065,0.014612,36
1429097575749,102,0.0147234,0.0318794,0.0272458,33
1429097575790,102,-0.000283199,0.010292,0.00259181,31
1429097575835,102,-0.0121426,-0.00486637,-0.0138858,27
1429097575847,102,-0.00371132,0.00324133,-0.00480801,26
1429097575888,102,0.0190806,0.0263554,0.0214519,24
1429097575930,102,0.05724,0.0656632,0.0687724,34
1429097575972,102,0.108563,0.119398,0.12912,48
1429097576014,102,0.154478,0.168929,0.185335,65
1429097576056,102,0.184718,0.203975,0.22441,66
1429097576097,102,0.155687,0.175627,0.19324,58
1429097576139,102,0.0711556,0.0852809,0.0957663,52
1429097576180,102,-0.000372153,0.00265313,0.00969885,45
1429097576222,102,-0.0669874,-0.0854936,-0.0835302,45
1429097576264,102,-0.0680981,-0.0902057,-0.0891574,47
1429097576306,102,-0.0492594,-0.0605564,-0.0623155,47
1429097576348,102,-0.0185004,-0.00734192,-0.0155737,43
1429097576390,102,-0.0211467,0.00411283,-0.0131042,40
1429097576435,102,-0.0512291,-0.028199,-0.054358,35
1429097576446,102,-0.098492,-0.0972094,-0.127448,34
1429097576488,102,-0.139765,-0.168064,-0.194048,37
1429097576536,102,-0.155827,-0.209498,-0.227772,55
1429097576548,102,-0.154413,-0.225024,-0.233425,63
1429097576590,102,-0.105368,-0.168011,-0.168379,72
1429097576633,102,-0.0200126,-0.0527546,-0.0447971,72
1429097576675,103,0.0728815,0.0798761,0.0988584,65
1429097576717,103,0.139764,0.177452,0.208062,53
1429097576759,103,0.143598,0.192302,0.229149,48
1429097576801,103,0.110952,0.152286,0.188742,46
1429097576842,103,0.0707636,0.101012,0.129525,45
1429097576884,103,0.0503367,0.0782254,0.0972023,42
1429097576925,103,0.0628582,0.084371,0.0977056,39
1429097576967,103,0.0595196,0.06894,0.0728974,33
1429097577009,103,0.0499038,0.048015,0.0469303,29
1429097577050,103,0.000455525,-0.00800732,-0.0197323,24
1429097577092,103,-0.0598594,-0.0751115,-0.0965797,25
1429097577134,103,-0.12563,-0.142005,-0.174814,65
1429097577204,103,-0.134571,-0.13367,-0.169814,70
1429097577251,102,-0.10447,-0.0893417,-0.120115,62
1429097577300,102,-0.0365792,-0.0209018,-0.038371,58
1429097577314,102,0.0460326,0.0430714,0.0439008,58
1429097577356,102,0.106554,0.0774399,0.0900463,47
1429097577399,102,0.128927,0.0744106,0.0947467,42
1429097577411,102,0.119275,0.0532417,0.0753042,42
1429097577453,102,0.090575,0.0334493,0.0524212,42
1429097577517,102,0.0466893,0.0232896,0.0338231,41
1429097577528,102,0.000224423,0.0261265,0.0226563,41
1429097577570,102,-0.0482038,0.0182226,0.00483818,37
1429097577582,102,-0.0832018,0.00766087,-0.0126136,34
1429097577624,102,-0.096131,-0.0121664,-0.033584,29
1429097577667,102,-0.0801176,-0.0219968,-0.0396083,23
1429097577679,102,-0.0462682,-0.0289781,-0.0391341,23
1429097577720,102,-0.0075936,-0.0254309,-0.0252711,19
1429097577762,102,0.00731815,-0.027072,-0.0201216,49
1429097577836,102,0.0181265,-0.0122087,-0.00660701,59
1429097577878,102,0.0260161,0.0141296,0.0146188,73
1429097577920,102,0.0113328,0.00680557,-6.80077e-05,73
1429097577961,102,-0.00305941,-0.00475215,-0.0152787,66
1429097578003,102,-0.0344962,-0.0497883,-0.0563707,54
1429097578045,102,-0.0433224,-0.0740425,-0.069629,50
1429097578087,102,-0.0383497,-0.084068,-0.0646466,44
1429097578153,102,-0.0215058,-0.0667271,-0.0356651,43
1429097578195,102,-0.0179372,-0.0512385,-0.0179029,41
1429097578237,102,-0.0238835,-0.0341678,-0.00758025,37
1429097578278,102,-0.0576428,-0.0470166,-0.0357986,32
1429097578321,102,-0.046475,-0.018855,-0.0200747,16
1429097578395,102,-0.00700883,0.0194354,0.0102889,16
1429097578437,102,0.0611859,0.0878693,0.0770388,13
1429097578479,102,0.116966,0.14195,0.132733,19
1429097578490,102,0.124229,0.155796,0.14748,25
1429097578533,102,0.0777249,0.10089,0.0901909,40
1429097578545,102,-0.01079,0.000296121,-0.0189817,47
1429097578586,102,-0.0958775,-0.0983383,-0.128426,55
1429097578598,102,-0.14751,-0.160637,-0.197442,55
1429097578640,102,-0.155342,-0.170029,-0.204648,46
1429097578652,102,-0.0855191,-0.0926517,-0.112565,42
1429097578694,102,0.00132832,-0.00197207,-0.00246944,36
1429097578707,102,0.0928877,0.106572,0.126461,33
1429097578748,102,0.154424,0.176808,0.208979,30
1429097578760,102,0.153293,0.178131,0.20985,29
1429097578802,102,0.120095,0.127092,0.153693,29
1429097578824,102,0.0650844,0.0513614,0.0701012,29
1429097578865,102,0.0372632,0.00445922,0.0185173,29
1429097578907,102,0.00494425,-0.0380954,-0.0335321,26
1429097578948,102,-0.0104982,-0.0432714,-0.0460561,23
1429097578960,102,-0.0467814,-0.0636174,-0.0765759,22
1429097579002,102,-0.0393811,-0.027329,-0.0399625,19
1429097579024,102,-0.0374489,-0.0176926,-0.0289243,16
1429097579065,102,0.000405306,0.0176214,0.0169275,13
1429097579092,102,0.00411916,-0.00374856,-0.0006434,13
1429097579133,102,-0.0171319,-0.0559032,-0.0554945,20
1429097579161,102,-0.0519229,-0.105583,-0.10948,32
1429097579193,102,-0.100583,-0.147263,-0.159507,43
1429097579234,102,-0.131238,-0.159005,-0.175623,47
1429097579262,101,-0.146281,-0.15156,-0.169685,50
1429097579292,101,-0.126101,-0.109753,-0.122856,38
1429097579334,101,-0.0688702,-0.0304932,-0.028858,21
1429097579360,101,0.0356823,0.0931808,0.12112,6
1429097579401,101,0.147102,0.212191,0.2643,0
1429097579424,101,0.225696,0.28512,0.35078,0
1429097579466,101,0.260773,0.294383,0.355922,0
1429097579492,101,0.230725,0.243082,0.283147,2
1429097579533,101,0.162304,0.161924,0.17,3
1429097579560,101,0.0837141,0.0821461,0.0593663,2
1429097579602,101,0.0198293,0.0245279,-0.0189767,0
1429097579623,101,0.0093287,0.016337,-0.0307354,0
1429097579665,101,0.00798653,0.00478152,-0.035603,0
1429097579692,101,0.020465,-0.00119838,-0.0265696,0
1429097579734,101,-0.00488836,-0.032786,-0.0498096,9
1429097579760,101,-0.046051,-0.0651511,-0.0784523,37
1429097579802,101,-0.12542,-0.128359,-0.148405,63
1429097579843,101,-0.2115,-0.202878,-0.232111,75
1429097579884,101,-0.276949,-0.272229,-0.309785,67
1429097579926,101,-0.278055,-0.28892,-0.324245,48
1429097579967,101,-0.217644,-0.247417,-0.274335,39
1429097580009,101,-0.128444,-0.172384,-0.185668,29
1429097580053,101,-0.0381164,-0.0759908,-0.077344,27
1429097580096,101,0.0186209,-0.00985393,0.000799959,27
1429097580137,101,0.052154,0.0493277,0.0711848,24
1429097580180,101,0.0852682,0.10448,0.142612,19
1429097580222,101,0.115213,0.147948,0.199867,15
1429097580264,101,0.141201,0.170049,0.225112,13
1429097580305,101,0.139553,0.151755,0.193807,26
1429097580347,101,0.126995,0.117898,0.140867,51
1429097580389,101,0.114611,0.093857,0.101939,93
1429097580430,101,0.108954,0.0821502,0.0837833,103
1429097580472,101,0.102088,0.0910039,0.0979021,95
1429097580513,101,0.080181,0.0856815,0.0978215,61
1429097580555,101,0.0335168,0.0662398,0.0824113,52
1429097580598,101,-0.0137268,0.0385699,0.0523884,48
1429097580639,101,-0.0679717,-0.018189,-0.0131143,46
1429097580684,101,-0.0989529,-0.0650687,-0.0699226,45
1429097580696,101,-0.107932,-0.0989994,-0.114994,45
1429097580737,101,-0.0936063,-0.104419,-0.128867,43
1429097580782,101,-0.0572975,-0.0806364,-0.106336,40
1429097580794,101,-0.0203769,-0.0553218,-0.076449,39
1429097580835,101,0.01013,-0.0226165,-0.0316019,36
1429097580877,101,0.00741926,-0.016339,-0.0234112,35
1429097580918,101,-0.0205675,-0.0286377,-0.0408952,43
1429097580960,101,-0.0473336,-0.0439665,-0.0615455,67
1429097581003,101,-0.0610919,-0.0526143,-0.0775791,78
1429097581015,101,-0.0282039,-0.0217343,-0.0409757,80
1429097581057,101,0.0162574,0.0150435,0.00617997,75
1429097581098,101,0.0123295,-0.00527205,-0.0139075,67
1429097581139,101,-0.00949846,-0.0318508,-0.0379901,57
1429097581181,101,-0.0474737,-0.0626187,-0.0651862,53
1429097581223,101,-0.0653894,-0.0597623,-0.0528163,51
1429097581264,101,-0.049482,-0.0220791,-0.00225495,50
1429097581306,101,-0.00956824,0.0271357,0.0563049,46
1429097581347,101,0.0223912,0.0454667,0.0747657,43
1429097581389,101,0.0355585,0.0284079,0.0528196,40
1429097581430,101,0.00206944,-0.0302544,-0.023236,36
1429097581472,101,-0.0233159,-0.065031,-0.0750362,33
1429097581515,101,-0.045231,-0.0749902,-0.0938187,37
1429097581556,101,-0.0143053,-0.0210615,-0.0321193,58
1429097581598,101,0.0423021,0.059919,0.0651724,73
1429097581639,101,0.124214,0.158541,0.183383,79
1429097581681,101,0.169962,0.200215,0.230204,72
1429097581722,101,0.155104,0.175735,0.200506,64
1429097581764,101,0.0903649,0.095241,0.107708,51
1429097581806,101,0.00825347,0.00639524,0.0127543,46
1429097581847,101,-0.0495425,-0.047132,-0.0399662,44
1429097581889,101,-0.0519806,-0.0355141,-0.0200081,44
1429097581931,101,-0.0254817,0.0135075,0.0313053,41
1429097581942,101,-0.0413619,0.00538002,0.00813793,40
1429097581984,101,-0.0915115,-0.0635443,-0.0873603,36
1429097582026,101,-0.163303,-0.186727,-0.235467,29
1429097582068,101,-0.206721,-0.293136,-0.351532,25
1429097582109,101,-0.164281,-0.293667,-0.335251,21
1429097582151,101,-0.0499729,-0.14989,-0.162418,26
1429097582192,101,0.0783654,0.047738,0.0620284,44
1429097582234,101,0.156627,0.216139,0.230524,54
1429097582275,101,0.148453,0.257283,0.254483,53
1429097582317,101,0.111413,0.211063,0.193318,46
1429097582358,101,0.0555558,0.085697,0.0671748,35
1429097582400,101,0.000482277,-0.040686,-0.0470965,29
1429097582411,101,-0.0519073,-0.15034,-0.146161,27
1429097582453,101,-0.0771534,-0.168439,-0.159857,26
1429097582494,101,-0.0809299,-0.12496,-0.121298,26
1429097582536,101,-0.0316566,0.00628127,0.00984382,25
1429097582547,101,0.0199495,0.112925,0.116995,25
1429097582589,101,0.0308262,0.142766,0.143776,22
1429097582601,101,0.0284025,0.107989,0.10585,20
1429097582642,101,0.0295032,0.0632857,0.0628078,15
1429097582654,101,0.0411023,0.0215248,0.0243514,15
1429097582695,101,0.0428438,-0.0112532,-0.00932436,11
1429097582737,101,0.0228365,-0.0491737,-0.0512835,11
1429097582784,101,-0.0068792,-0.0804963,-0.0872494,24
1429097582796,101,-0.000632133,-0.0306016,-0.0346552,31
1429097582837,101,0.0244755,0.0475378,0.0501277,43
1429097582878,101,0.0658657,0.135485,0.148498,48
1429097582889,100,0.11668,0.182027,0.210205,48
1429097582931,100,0.138323,0.175723,0.215526,40
1429097582943,100,0.0990807,0.078821,0.115112,40
1429097582986,100,0.0205268,-0.0305141,-0.00968271,30
1429097582999,100,-0.0699293,-0.118173,-0.118576,28
1429097583040,100,-0.168993,-0.197274,-0.22049,25
1429097583082,100,-0.182339,-0.183703,-0.214738,25
1429097583093,100,-0.129573,-0.121088,-0.14556,25
1429097583135,100,-0.0158189,-0.0043645,-0.00957042,25
1429097583160,100,0.102514,0.11939,0.135495,25
1429097583202,100,0.171678,0.198308,0.226974,23
1429097583223,100,0.183209,0.20385,0.233277,22
1429097583265,100,0.128431,0.121077,0.136135,17
1429097583307,100,0.0068056,-0.025121,-0.0369897,18
1429097583324,100,-0.13226,-0.193681,-0.235832,20
1429097583365,100,-0.215749,-0.270618,-0.327971,37
1429097583391,100,-0.19958,-0.233025,-0.280735,43
1429097583433,100,-0.139183,-0.123784,-0.150533,51
1429097583461,100,-0.063549,-0.0136316,-0.0173369,49
1429097583491,100,-0.0376806,0.00826925,0.0131262,46
1429097583533,100,-0.0453425,-0.0203782,-0.0160071,37
1429097583561,100,-0.0564248,-0.0563956,-0.0606344,34
1429097583592,100,-0.0550227,-0.0684859,-0.0791527,32
