1429615155445,73,-0.298066,-0.194983,-0.191061,20
1429615155456,73,-0.2107,-0.123784,-0.121841,17
1429615155497,73,-0.0396976,-0.00623783,-0.00164874,12
1429615155538,73,0.150456,0.117673,0.112475,33
1429615155579,73,0.252394,0.178474,0.162624,83
1429615155590,73,0.253992,0.176017,0.15263,76
1429615155631,73,0.168181,0.122987,0.0935072,56
1429615155642,73,0.0947815,0.0801134,0.0489301,52
1429615155684,73,0.0209435,0.0389049,0.00612845,41
1429615155695,73,-0.00995563,0.0192907,-0.00198568,37
1429615155736,73,-0.0365585,-0.00504201,-0.00968185,24
1429615155747,73,-0.0226424,-0.00956477,0.00580812,21
1429615155788,73,-0.000281328,-0.00999782,0.00993319,24
1429615155800,73,-0.000341376,-0.0202753,-0.00187693,57
1429615155841,73,-0.050313,-0.0604943,-0.0499385,82
1429615155852,74,-0.12162,-0.109778,-0.0976584,77
1429615155893,74,-0.18769,-0.154479,-0.141918,58
1429615155917,74,-0.196742,-0.161301,-0.147535,49
1429615155951,74,-0.143499,-0.124426,-0.11724,37
1429615155984,74,-0.000438951,-0.0272254,-0.025692,26
1429615156017,74,0.119848,0.0663805,0.060526,13
1429615156051,74,0.164719,0.115066,0.100058,7
1429615156084,74,0.0697853,0.066396,0.0665077,39
1429615156117,74,-0.107322,-0.0366134,-0.02675,74
1429615156151,74,-0.24263,-0.117353,-0.101841,66
1429615156184,74,-0.269265,-0.134385,-0.127064,52
1429615156217,74,-0.162725,-0.0714835,-0.081553,44
1429615156250,74,0.0710425,0.0609111,0.0245729,36
1429615156285,74,0.301489,0.196273,0.144064,25
1429615156318,74,0.458579,0.281587,0.230682,17
1429615156350,74,0.516367,0.311439,0.281069,31
1429615156385,74,0.441297,0.259127,0.258439,73
1429615156417,74,0.286482,0.160361,0.176898,73
1429615156452,74,0.0515527,0.0170903,0.0387749,59
1429615156485,74,-0.189484,-0.129422,-0.10549,52
1429615156518,74,-0.348418,-0.216925,-0.196095,44
1429615156552,74,-0.428604,-0.262483,-0.241342,32
1429615156582,74,-0.437167,-0.281311,-0.242314,21
1429615156615,74,-0.364267,-0.254035,-0.195962,15
1429615156653,74,-0.245331,-0.197268,-0.127006,62
1429615156685,74,-0.125289,-0.125902,-0.0600874,76
1429615156715,84,-0.00575277,-0.0320814,0.0116377,64
1429615156753,84,0.0772327,0.0457124,0.0537434,54
1429615156782,84,0.0960813,0.0870569,0.0685603,48
1429615156815,84,0.0996862,0.112104,0.0625252,38
1429615156853,84,0.112855,0.131919,0.0576546,27
1429615156885,84,0.166007,0.166879,0.0740747,17
1429615156914,84,0.249882,0.207947,0.114989,33
1429615156953,84,0.261329,0.200906,0.126998,75
1429615156985,85,0.172043,0.117797,0.0865004,69
1429615157028,85,0.0552856,0.0256681,0.0285266,56
1429615157053,85,-0.057666,-0.0529985,-0.0302619,53
1429615157085,85,-0.0686984,-0.0583342,-0.0422836,45
1429615157115,85,0.011404,-6.59974e-05,-0.0196466,37
1429615157153,85,0.123369,0.0633379,0.0283349,29
1429615157185,85,0.201812,0.107715,0.0747655,41
1429615157215,85,0.183976,0.0926942,0.0817165,67
1429615157254,85,0.026857,-0.00107846,0.0201753,59
1429615157285,85,-0.195222,-0.131996,-0.0820449,49
1429615157315,85,-0.294094,-0.187985,-0.134102,45
1429615157353,85,-0.290782,-0.182473,-0.129466,39
1429615157382,85,-0.194726,-0.130152,-0.0852519,32
1429615157416,85,-0.109482,-0.090841,-0.0520673,28
1429615157453,85,-0.102947,-0.0963373,-0.061863,51
1429615157482,85,-0.159821,-0.129073,-0.0819174,60
1429615157515,85,-0.190531,-0.1366,-0.0891242,48
1429615157556,85,-0.158624,-0.0961007,-0.049312,44
1429615157597,85,-0.0805402,-0.0309774,0.00300734,38
1429615157638,85,0.0576372,0.0656245,0.0759237,32
1429615157680,85,0.203981,0.151669,0.126428,29
1429615157721,85,0.249774,0.173349,0.128134,59
1429615157762,85,0.297448,0.194582,0.127991,52
1429615157804,85,0.336169,0.215792,0.140153,41
1429615157845,85,0.32636,0.212019,0.135515,39
1429615157887,85,0.237576,0.153807,0.0895425,32
1429615157928,85,0.119681,0.0697473,0.0223352,25
1429615157970,85,-0.0161092,-0.0264379,-0.0597124,22
1429615158011,85,-0.195522,-0.138195,-0.14634,54
1429615158052,85,-0.3065,-0.201135,-0.190673,53
1429615158093,85,-0.317066,-0.186057,-0.159818,41
1429615158135,85,-0.17984,-0.0851782,-0.0680465,40
1429615158176,85,0.0193543,0.0434841,0.0430855,34
1429615158218,85,0.161081,0.125725,0.107813,28
1429615158259,85,0.197177,0.13397,0.105256,25
1429615158300,85,0.0927083,0.0575235,0.037203,61
1429615158342,86,-0.0829484,-0.0549387,-0.0512644,54
1429615158383,86,-0.235313,-0.157513,-0.110875,43
1429615158424,86,-0.269405,-0.184995,-0.106203,41
1429615158470,86,-0.17543,-0.133009,-0.036801,33
1429615158482,86,-0.0576239,-0.069742,0.0172861,30
1429615158523,86,0.0636552,-0.0105749,0.0602994,25
1429615158567,86,0.135452,0.030368,0.0729948,57
1429615158580,86,0.143206,0.048381,0.0564277,63
1429615158621,86,0.153766,0.0867869,0.0496848,52
1429615158663,86,0.0986397,0.0839595,0.0205335,45
1429615158705,86,0.0925378,0.108204,0.0317309,41
1429615158751,86,0.0730361,0.101333,0.0309437,34
1429615158763,86,0.00156473,0.0521222,0.00789268,31
1429615158805,86,-0.064482,-0.00327291,-0.0148809,39
1429615158846,86,-0.169783,-0.0787809,-0.0637149,63
1429615158888,87,-0.211399,-0.110813,-0.0938918,52
1429615158930,87,-0.167095,-0.0894029,-0.0877424,43
1429615158971,87,-0.0587719,-0.0321596,-0.0515675,40
1429615159012,87,0.098522,0.0538426,0.0178683,32
1429615159053,87,0.154048,0.0675086,0.0482388,27
1429615159095,87,0.148183,0.0524747,0.0609551,25
1429615159137,87,0.0817314,0.00782268,0.0566086,58
1429615159150,87,-0.00955679,-0.035805,0.0246776,62
1429615159191,87,-0.107346,-0.0752551,-0.0347565,53
1429615159233,87,-0.177355,-0.0974202,-0.104617,43
1429615159274,87,-0.188601,-0.104437,-0.156168,40
1429615159316,87,-0.0641349,-0.0358951,-0.110701,33
1429615159357,87,0.10984,0.0613395,0.00607769,28
1429615159399,87,0.275315,0.157933,0.143572,26
1429615159440,87,0.297809,0.171834,0.208362,24
1429615159481,87,0.186678,0.101355,0.180633,54
1429615159522,87,0.000142974,-0.0166852,0.0749694,58
1429615159563,87,-0.230212,-0.15937,-0.0677858,46
1429615159605,87,-0.285857,-0.184264,-0.133714,41
1429615159617,87,-0.232547,-0.135952,-0.132031,40
1429615159659,87,-0.0334503,-0.000145142,-0.0467213,34
1429615159671,87,0.171373,0.131171,0.0619362,31
1429615159712,87,0.292958,0.207053,0.133331,28
1429615159754,87,0.248872,0.183553,0.121553,26
1429615159766,87,0.13594,0.129251,0.0694829,25
1429615159807,87,-0.00440795,0.0535463,-0.00524094,23
1429615159819,87,-0.0805305,-0.00133188,-0.044314,29
1429615159860,87,-0.107466,-0.0320671,-0.0541532,62
1429615159901,87,-0.0769373,-0.0438193,-0.037027,52
1429615159943,87,0.0406464,0.00822396,0.0151657,43
1429615159954,87,0.129848,0.0455143,0.052436,42
1429615159997,87,0.137253,0.0402848,0.0400353,38
1429615160009,87,0.0192484,-0.03796,-0.0213924,36
1429615160051,87,-0.193638,-0.178334,-0.123738,30
1429615160063,87,-0.29468,-0.247464,-0.162599,29
1429615160112,87,-0.305179,-0.258225,-0.158349,26
1429615160123,87,-0.195518,-0.183566,-0.093471,25
1429615160164,87,-0.0632089,-0.0799693,-0.0158713,24
1429615160183,87,0.0115381,-0.0031979,0.0283485,42
1429615160224,87,0.0399676,0.0432836,0.040091,60
1429615160251,87,0.042182,0.0632914,0.0354567,51
1429615160292,87,0.0342665,0.0692399,0.0178668,42
1429615160315,87,0.0555213,0.0799485,0.0266319,42
1429615160351,87,0.0857689,0.102737,0.0528128,38
1429615160383,87,0.0722211,0.111877,0.0666747,33
1429615160416,87,0.0405976,0.113011,0.0647898,29
1429615160450,87,0.0339152,0.118297,0.0538912,26
1429615160482,87,0.101277,0.145513,0.0739741,24
1429615160516,87,0.148217,0.125731,0.0649386,29
1429615160557,87,0.135133,0.0531477,0.0321333,63
1429615160583,87,0.078405,-0.0424196,-0.0113467,56
1429615160624,87,0.0179439,-0.0960572,-0.0335333,44
1429615160651,87,-0.0082497,-0.0874688,-0.0217979,42
1429615160691,87,-0.0163126,-0.0451373,-0.000156881,40
1429615160716,87,-0.00534543,0.00582713,0.0197481,35
1429615160750,87,-0.0244483,0.0183294,0.0125994,30
1429615160784,87,-0.0372053,0.00500585,0.0010086,26
1429615160816,87,-0.0833423,-0.0469789,-0.0274922,24
1429615160850,87,-0.133926,-0.115294,-0.0638841,38
1429615160884,87,-0.191366,-0.180866,-0.102004,65
1429615160915,87,-0.216564,-0.206486,-0.119516,57
1429615160950,5,-0.151216,-0.150663,-0.0879753,45
1429615160983,87,-0.0818673,-0.0745445,-0.048185,43
1429615161016,87,-0.00779493,0.0102391,-0.00536284,43
1429615161051,87,0.00725617,0.0404509,0.00211677,43
1429615161084,87,0.0467121,0.0693034,0.0100121,42
1429615161115,87,0.137264,0.120905,0.0540445,41
1429615161152,87,0.275878,0.216003,0.137725,38
1429615161184,87,0.416886,0.324967,0.234578,35
1429615161215,87,0.444146,0.355124,0.268749,34
1429615161250,87,0.29486,0.253894,0.195243,30
1429615161285,87,0.0580449,0.0749004,0.0556061,28
1429615161317,87,-0.153104,-0.0991983,-0.0776275,26
1429615161353,87,-0.263742,-0.196109,-0.155861,25
1429615161384,87,-0.32282,-0.252589,-0.209204,23
1429615161417,87,-0.285908,-0.224189,-0.201331,23
1429615161452,87,-0.214478,-0.159878,-0.161203,23
1429615161485,87,-0.0966221,-0.075882,-0.0922293,35
1429615161517,87,0.0276189,0.00088605,-0.0131547,42
1429615161553,87,0.0855073,0.0197491,0.029903,64
1429615161584,87,0.0660268,-0.00468269,0.0377223,66
1429615161618,87,0.00888624,-0.0411725,0.0235626,60
1429615161653,87,-0.0870876,-0.0905092,-0.0160287,55
1429615161684,87,-0.129237,-0.0979588,-0.0369674,52
1429615161714,87,-0.113565,-0.0722642,-0.0329091,47
1429615161755,87,-0.00891541,0.00207072,0.0176385,43
1429615161796,87,0.0716488,0.0535022,0.0487024,42
1429615161837,87,0.0792725,0.0658621,0.0523798,42
1429615161879,87,0.0188022,0.0440192,0.0173965,41
1429615161920,87,-0.102271,-0.0173322,-0.0562713,38
1429615161963,87,-0.155312,-0.0445111,-0.087114,35
1429615161974,87,-0.141678,-0.049059,-0.0894751,34
1429615162016,87,-0.0121896,0.0151597,-0.0128131,32
1429615162057,87,0.143508,0.0996289,0.0879484,28
1429615162100,87,0.255928,0.160249,0.160538,26
1429615162141,87,0.286395,0.175377,0.181396,24
1429615162183,87,0.250912,0.153914,0.159505,22
1429615162224,87,0.190779,0.131055,0.116226,32
1429615162266,87,0.132464,0.111417,0.0650272,48
1429615162307,87,0.1106,0.110032,0.0399187,66
1429615162351,86,0.089964,0.0777008,0.0301707,62
1429615162393,86,0.0305976,0.0172685,0.01058,57
1429615162434,86,-0.0479034,-0.068329,-0.0232016,52
1429615162475,86,-0.194261,-0.192937,-0.110196,46
1429615162516,86,-0.314751,-0.286493,-0.188363,44
1429615162557,86,-0.319317,-0.280127,-0.201977,44
1429615162599,86,-0.247503,-0.212393,-0.153297,44
1429615162640,86,-0.0780378,-0.066401,-0.0501964,41
1429615162683,86,0.0555689,0.0483868,0.0325858,39
1429615162694,86,0.137333,0.117047,0.074246,37
1429615162736,86,0.119563,0.108932,0.0588992,33
1429615162777,86,0.0379553,0.0442045,0.00933827,31
1429615162818,86,-0.00644493,0.0136802,-0.00961598,28
1429615162859,86,-0.0184128,0.015299,0.0037692,25
1429615162901,86,-0.00541119,0.028433,0.0133336,24
1429615162942,86,-0.0116924,0.0210726,-0.00229305,38
1429615162983,86,-0.0424764,-0.014615,-0.0477575,53
1429615163024,86,-0.0648671,-0.0477945,-0.0783781,68
1429615163066,86,-0.060631,-0.0544822,-0.0783896,65
1429615163108,86,-0.00307221,-0.0108304,-0.0378158,58
1429615163150,86,0.0185774,0.019737,-0.00114306,53
1429615163191,86,0.00772029,0.0265848,0.0263437,48
1429615163232,86,-0.0394112,-0.00388857,0.0399177,48
1429615163273,86,-0.0649672,-0.0411493,0.0514656,48
1429615163315,86,-0.0183328,-0.0274934,0.0846671,47
1429615163356,86,0.014929,-0.013028,0.077996,43
1429615163398,86,0.0482326,0.0123325,0.0540094,40
1429615163439,86,0.0238588,0.00624297,-0.00919122,37
1429615163481,86,0.0288257,0.0231872,-0.0319907,34
1429615163492,86,0.0478856,0.0368149,-0.0181755,33
1429615163534,86,0.090341,0.0683815,0.0302485,31
1429615163575,86,0.129399,0.0962545,0.0763189,29
1429615163616,86,0.127735,0.0955427,0.0840988,36
1429615163658,86,0.108033,0.0720463,0.0530793,56
1429615163702,86,0.0446323,0.0190987,-0.00569901,66
1429615163713,86,0.0166856,-0.0111503,-0.0378163,67
1429615163755,87,0.042391,0.00693132,-0.019012,62
1429615163796,87,0.0322108,0.00893184,-0.00615432,57
1429615163837,87,0.0156449,0.0138248,0.0115759,52
1429615163878,87,-0.037102,-0.0158811,-0.00155793,48
1429615163920,87,-0.103954,-0.0615751,-0.0344719,47
1429615163961,87,-0.183301,-0.129998,-0.094097,47
1429615164002,87,-0.222631,-0.174278,-0.141361,46
1429615164043,87,-0.237254,-0.192442,-0.157585,41
1429615164085,87,-0.178202,-0.154542,-0.12373,39
1429615164126,87,-0.0945015,-0.0837232,-0.0610621,35
1429615164168,87,0.0230599,0.0167972,0.0244642,33
1429615164209,87,0.0769009,0.0742467,0.0727768,30
1429615164250,87,0.117474,0.122696,0.111443,29
1429615164262,87,0.106595,0.140535,0.110546,30
1429615164303,87,0.0550731,0.11165,0.079962,40
1429615164344,87,0.0378725,0.0890714,0.0660532,61
1429615164385,87,0.108216,0.110458,0.0914506,69
1429615164427,87,0.206081,0.132392,0.120798,67
1429615164468,87,0.268277,0.141013,0.122568,63
1429615164509,87,0.206795,0.0856808,0.0589976,56
1429615164551,87,0.0874668,0.00677202,-0.0198748,52
1429615164592,87,-0.061737,-0.0874781,-0.0892603,49
1429615164633,87,-0.207779,-0.180109,-0.146929,48
1429615164675,87,-0.250043,-0.209458,-0.147646,46
1429615164686,87,-0.236542,-0.187825,-0.119267,46
1429615164728,87,-0.168061,-0.119779,-0.0778056,42
1429615164769,87,-0.118309,-0.0592443,-0.0525469,40
1429615164810,87,-0.0412471,0.024937,-0.00985669,35
1429615164851,87,0.0395861,0.0788082,0.034859,33
1429615164863,87,0.0749351,0.0828139,0.0632499,32
1429615164904,87,0.0712678,0.0292324,0.0564038,30
1429615164945,87,0.0206285,-0.0435616,-0.000393232,28
1429615164986,87,0.0161251,-0.0552599,-0.0110896,28
1429615165027,87,0.0221965,-0.0259817,-0.0140442,43
1429615165068,87,0.0728029,0.0650947,0.0183457,58
1429615165110,87,0.101156,0.124325,0.00692099,71
1429615165121,87,0.0861793,0.145667,-0.0122479,71
1429615165163,87,0.0282792,0.101202,-0.0438283,69
1429615165173,87,-0.0110192,0.0464381,-0.0277639,69
1429615165215,87,-0.146918,-0.113958,-0.106579,63
1429615165226,87,-0.222953,-0.225681,-0.170449,61
1429615165267,87,-0.202905,-0.23392,-0.146121,56
1429615165278,87,-0.0829003,-0.124839,-0.0293184,54
1429615165319,87,0.0408405,-0.0101941,0.113481,52
1429615165331,87,0.133819,0.095759,0.217872,51
1429615165372,87,0.139948,0.128645,0.263891,49
1429615165414,87,0.127255,0.141181,0.276585,46
1429615165424,87,0.0785301,0.0976325,0.175076,46
1429615165466,87,0.134262,0.138415,0.1357,41
1429615165482,87,0.135085,0.11748,0.0122436,40
1429615165523,87,0.191328,0.146359,-0.00934474,38
1429615165565,87,0.195737,0.166274,0.0265363,34
1429615165582,87,0.103485,0.107313,0.022392,33
1429615165623,87,-0.00283247,0.0441231,0.0270679,31
1429615165665,87,-0.0845223,-0.0117398,-0.0133361,29
1429615165682,87,-0.13275,-0.0642861,-0.0577309,28
1429615165723,87,-0.138213,-0.0986879,-0.0990828,27
1429615165751,87,-0.116163,-0.11472,-0.118764,25
1429615165782,87,-0.0779858,-0.104194,-0.117976,30
1429615165823,87,-0.143292,-0.175402,-0.202399,41
1429615165852,87,-0.219117,-0.239329,-0.277406,57
1429615165882,87,-0.241726,-0.24598,-0.265192,67
1429615165923,87,-0.215507,-0.20966,-0.188353,69
1429615165950,87,-0.129874,-0.134382,-0.0960349,68
1429615165991,87,-0.0133212,-0.0343023,-0.00187368,62
1429615166033,87,0.0149831,-0.0155423,-0.0136853,57
1429615166075,87,0.0129595,-0.0222025,-0.0480038,53
1429615166116,87,0.0379518,-0.00932823,-0.00968525,49
1429615166157,87,0.0798846,0.0215457,0.0617276,48
1429615166198,87,0.1542,0.0771778,0.161183,45
1429615166240,87,0.175242,0.144666,0.219222,43
1429615166281,87,0.128737,0.176783,0.173176,40
1429615166323,87,0.0372481,0.17281,0.10286,38
1429615166364,87,-0.066628,0.102458,0.0156938,34
1429615166405,87,-0.176032,-0.0381816,-0.0717905,33
1429615166446,87,-0.133455,-0.0710042,-0.00842779,31
1429615166488,87,0.0549562,0.0338979,0.148652,30
1429615166529,87,0.361614,0.276115,0.363887,28
1429615166571,87,0.591393,0.487403,0.550275,27
1429615166612,87,0.582679,0.497428,0.485659,25
1429615166653,87,0.358942,0.318305,0.260201,29
1429615166695,87,-0.0376777,-0.0366499,-0.14141,49
1429615166736,87,-0.356182,-0.330116,-0.487512,63
1429615166777,87,-0.474207,-0.441571,-0.597139,68
1429615166819,87,-0.355018,-0.306138,-0.397406,65
1429615166860,87,-0.0934414,-0.044097,-0.00900123,62
1429615166901,87,0.0887305,0.139577,0.293415,55
1429615166942,87,0.0429494,0.0564748,0.279123,51
1429615166983,87,-0.040957,-0.081496,0.166508,47
1429615167024,87,-0.152201,-0.240261,-0.0392142,46
1429615167066,87,-0.20871,-0.308449,-0.209275,43
1429615167107,87,-0.276297,-0.339385,-0.393788,40
1429615167149,87,-0.373273,-0.391068,-0.568057,35
1429615167160,87,-0.319154,-0.33017,-0.552212,35
1429615167201,87,-0.148045,-0.169469,-0.368771,32
1429615167243,87,0.218797,0.17972,0.047961,30
1429615167285,87,0.593071,0.572763,0.50347,27
1429615167326,87,0.769486,0.811624,0.74347,26
1429615167367,87,0.613175,0.72123,0.645129,25
1429615167408,87,0.156395,0.326573,0.23572,24
1429615167450,87,-0.353743,-0.18868,-0.249658,22
1429615167492,87,-0.745019,-0.629074,-0.604771,21
1429615167534,87,-0.694227,-0.67379,-0.539115,20
1429615167575,87,-0.439751,-0.526422,-0.322538,31
1429615167617,87,0.0175694,-0.116556,0.118024,56
1429615167658,87,0.331479,0.208525,0.369547,66
1429615167700,87,0.504777,0.436185,0.501814,65
1429615167742,87,0.472484,0.456264,0.420912,62
1429615167784,87,0.276317,0.260479,0.148869,55
1429615167825,87,0.0364151,-0.0144718,-0.117454,50
1429615167867,87,-0.050135,-0.128662,-0.183036,47
1429615167908,87,-0.0156485,-0.0859384,-0.0748945,46
1429615167950,87,0.0742034,0.0273083,0.0960198,43
1429615167992,87,0.18471,0.16975,0.263264,40
1429615168033,87,0.117948,0.123366,0.202429,36
1429615168074,87,-0.0259031,0.0303908,0.0673869,33
1429615168116,87,-0.191803,-0.0901941,-0.108561,29
1429615168157,87,-0.333242,-0.20434,-0.261214,27
1429615168198,87,-0.372297,-0.248814,-0.312379,24
1429615168240,87,-0.35756,-0.292718,-0.337918,23
1429615168281,87,-0.270683,-0.27616,-0.292308,21
1429615168322,87,-0.1102,-0.166455,-0.172545,19
1429615168363,87,0.0142265,-0.0140198,-0.0622392,17
1429615168405,87,0.0812068,0.107623,0.0187542,14
1429615168447,87,0.120765,0.174622,0.102814,23
1429615168488,87,0.270488,0.314782,0.306017,49
1429615168531,87,0.460196,0.448241,0.499661,67
1429615168542,87,0.632469,0.554648,0.655937,67
1429615168584,87,0.659508,0.531176,0.610543,63
1429615168625,87,0.479293,0.353503,0.379085,58
1429615168667,87,0.0779463,-0.0031247,-0.0355198,50
1429615168708,87,-0.277641,-0.280243,-0.353441,46
1429615168750,87,-0.558252,-0.498066,-0.565525,44
1429615168791,87,-0.626953,-0.528478,-0.555918,44
1429615168833,87,-0.536486,-0.45256,-0.431895,41
1429615168845,87,-0.332639,-0.304437,-0.241199,41
1429615168886,87,-0.105633,-0.165155,-0.0744099,37
1429615168927,87,-0.106433,-0.183602,-0.114618,34
1429615168970,87,-0.134837,-0.187418,-0.141176,29
1429615169011,87,-0.214481,-0.203749,-0.172366,26
1429615169053,87,-0.224372,-0.154693,-0.122478,23
1429615169094,87,-0.135179,-0.0177513,0.00694071,21
1429615169136,87,0.0273155,0.161912,0.148368,18
1429615169182,87,0.17715,0.296521,0.20373,15
1429615169194,87,0.26799,0.335586,0.192789,15
1429615169236,87,0.310552,0.294362,0.152465,11
1429615169249,87,0.299937,0.207303,0.104794,12
1429615169290,87,0.34732,0.189909,0.166563,23
1429615169332,87,0.408792,0.228669,0.257459,42
1429615169373,87,0.380805,0.226657,0.284201,68
1429615169415,87,0.334637,0.226343,0.291606,69
1429615169457,87,0.133624,0.109717,0.162188,62
1429615169469,87,-0.0221268,0.00192919,0.0539715,59
1429615169511,87,-0.170194,-0.102758,-0.060069,53
1429615169553,87,-0.264013,-0.168327,-0.14974,47
1429615169565,87,-0.327349,-0.223573,-0.224894,47
1429615169606,87,-0.322486,-0.2243,-0.24878,45
1429615169648,87,-0.252111,-0.185187,-0.213903,45
1429615169689,87,-0.243009,-0.191825,-0.230983,42
1429615169701,87,-0.22243,-0.191402,-0.228586,40
1429615169742,87,-0.131937,-0.127361,-0.14841,38
1429615169784,87,-0.0365018,-0.0574329,-0.074566,32
1429615169795,87,0.0864459,0.0325309,0.0439736,32
1429615169837,87,0.218958,0.123168,0.171023,26
1429615169848,87,0.319952,0.198846,0.276278,26
1429615169889,87,0.256437,0.140028,0.245879,22
1429615169901,87,0.0737463,0.0262822,0.10914,20
1429615169942,87,-0.226533,-0.174103,-0.132645,18
1429615169954,87,-0.483482,-0.331807,-0.367204,16
1429615169995,87,-0.549676,-0.35978,-0.450865,14
1429615170036,87,-0.309901,-0.16425,-0.274809,11
1429615170051,87,0.124128,0.173002,0.098702,15
1429615170092,87,0.554596,0.502356,0.486782,33
1429615170133,87,0.821917,0.698928,0.741091,55
1429615170151,87,0.761116,0.617352,0.677987,70
1429615170182,87,0.412166,0.297736,0.351691,72
1429615170223,87,-0.0760005,-0.121104,-0.118982,67
1429615170264,87,-0.490681,-0.467049,-0.530636,62
1429615170305,87,-0.685612,-0.610072,-0.709479,54
1429615170346,87,-0.59401,-0.513437,-0.592112,49
1429615170388,87,-0.304569,-0.243351,-0.26154,46
1429615170430,87,-0.0556505,-0.0261891,0.026338,46
1429615170470,87,0.114799,0.101987,0.210274,42
1429615170512,87,0.16438,0.121334,0.24878,40
1429615170553,87,0.124538,0.0783219,0.18945,33
1429615170594,87,0.117465,0.0786411,0.141707,29
1429615170636,87,0.143882,0.117284,0.126527,24
1429615170677,87,0.155337,0.144766,0.0985937,21
1429615170719,87,0.0937586,0.109995,0.0269719,17
1429615170760,87,-0.00347656,0.0114087,-0.0671227,14
1429615170803,87,-0.137875,-0.112474,-0.208463,20
1429615170845,87,-0.117,-0.107243,-0.193186,40
1429615170886,87,0.0183442,0.0261615,-0.0696966,69
1429615170929,87,0.199693,0.205752,0.129988,74
1429615170940,87,0.251869,0.284381,0.231709,73
1429615170982,86,0.15723,0.183457,0.196794,69
1429615171023,86,-0.000348759,7.37496e-05,0.0754917,62
1429615171034,86,-0.132999,-0.187332,-0.0825812,62
1429615171046,86,-0.244268,-0.314135,-0.259717,59
1429615171087,86,-0.347768,-0.365536,-0.367747,52
1429615171128,86,-0.296413,-0.275077,-0.298095,49
1429615171170,86,-0.211978,-0.163015,-0.1524,47
1429615171212,86,-0.0884419,-0.0515656,0.0178528,45
1429615171253,86,0.0327797,0.0118225,0.145177,40
1429615171294,86,0.0836098,0.0157084,0.164592,36
1429615171336,86,0.144298,0.054014,0.185278,30
1429615171378,86,0.10492,0.0445191,0.0915531,27
1429615171419,86,0.105111,0.106652,0.0613101,24
1429615171460,86,0.0643137,0.168607,0.0341168,21
1429615171501,86,0.0695625,0.240578,0.0795058,18
1429615171543,86,0.17657,0.320945,0.214041,16
1429615171584,86,0.267319,0.336167,0.309295,26
1429615171625,86,0.299226,0.286186,0.303823,55
1429615171667,86,0.167841,0.135378,0.126365,70
1429615171708,86,-0.0818608,-0.0707022,-0.163183,71
1429615171749,85,-0.244878,-0.191602,-0.336778,67
1429615171791,85,-0.234417,-0.212801,-0.32804,60
1429615171832,85,-0.14946,-0.183345,-0.208786,55
1429615171873,85,-0.0358186,-0.143104,-0.03866,49
1429615171916,85,0.0223652,-0.141459,0.0573871,47
1429615171957,85,0.061244,-0.135624,0.0912405,45
1429615171998,85,0.0562971,-0.139168,0.0163714,42
1429615172039,85,0.0801174,-0.0855364,-0.0383022,37
1429615172081,85,0.0886528,-0.00974392,-0.0681055,33
1429615172123,85,0.0103461,0.0222027,-0.0805898,28
1429615172170,85,-0.106434,0.0139412,-0.062226,25
1429615172181,85,-0.175775,-0.0136216,0.00167641,24
1429615172222,85,-0.226225,-0.0385059,0.0275412,21
1429615172264,85,-0.149481,0.0150889,0.1009,19
1429615172305,85,-0.0509561,0.104424,0.105352,16
1429615172347,85,0.0185116,0.160647,0.0449191,14
1429615172388,85,-0.0261631,0.102506,-0.0964044,28
1429615172430,85,-0.0556631,0.0171579,-0.179863,47
1429615172472,85,-0.0695556,-0.0689484,-0.209932,71
1429615172513,85,-0.0100067,-0.0470619,-0.130112,72
1429615172555,85,0.070064,-0.00821843,-0.00368849,69
1429615172596,85,0.135761,0.0484392,0.123993,62
1429615172638,85,0.169347,0.0721875,0.179096,57
1429615172679,85,0.163642,0.0746196,0.220865,50
1429615172721,85,0.182099,0.0526264,0.207353,48
1429615172763,85,0.167155,0.0103493,0.15167,46
1429615172774,85,0.110062,-0.031097,0.0758128,45
1429615172816,85,0.0042286,-0.0753421,0.00944253,41
1429615172857,85,-0.195321,-0.149951,-0.125212,37
1429615172869,85,-0.310976,-0.165051,-0.205195,37
1429615172910,85,-0.261791,-0.0815115,-0.177019,31
1429615172953,85,-0.0762804,0.0338487,-0.057839,28
1429615172964,85,0.0765091,0.104071,0.0408073,27
1429615173005,85,0.178594,0.122188,0.14112,24
1429615173047,85,0.238202,0.163898,0.218139,21
1429615173058,85,0.296485,0.225987,0.272031,20
1429615173099,85,0.295571,0.253054,0.232823,18
1429615173140,85,0.184011,0.156528,0.0433219,16
1429615173181,85,-0.0450368,-0.0482951,-0.229953,14
1429615173192,85,-0.171534,-0.179928,-0.351252,18
1429615173234,85,-0.237103,-0.243054,-0.355277,34
1429615173245,85,-0.0893625,-0.097462,-0.117201,43
1429615173286,85,0.0952416,0.0834027,0.170104,63
1429615173298,85,0.139192,0.142463,0.305288,69
1429615173339,85,0.037269,0.0699515,0.238397,71
1429615173381,85,-0.253277,-0.173298,-0.0695935,65
1429615173398,85,-0.572767,-0.422097,-0.445566,62
1429615173418,85,-0.713538,-0.519378,-0.651359,59
1429615173459,85,-0.643324,-0.44649,-0.633882,51
1429615173500,85,-0.372616,-0.231159,-0.385302,48
1429615173518,85,0.0616403,0.0874899,0.0432365,47
1429615173560,85,0.443723,0.332425,0.417715,45
1429615173583,85,0.668041,0.429832,0.618591,44
1429615173624,85,0.614437,0.363803,0.539126,42
1429615173650,85,0.415973,0.229227,0.344148,39
1429615173690,85,0.262492,0.176614,0.237425,35
1429615173732,85,0.14815,0.154518,0.170856,30
1429615173750,85,0.0662627,0.11745,0.130831,28
1429615173791,85,0.026183,0.0699832,0.106059,25
1429615173832,85,-0.0787398,-0.0386008,-0.00547467,21
1429615173850,85,-0.14696,-0.121885,-0.112837,19
1429615173891,85,-0.220988,-0.199441,-0.241882,17
1429615173919,85,-0.141217,-0.14619,-0.208999,15
1429615173961,85,-0.0484994,-0.0582621,-0.13506,11
1429615173983,85,0.0188501,0.0149006,-0.0459076,10
1429615174023,85,0.0541507,0.0655867,0.0156687,12
1429615174050,85,-0.00236555,0.0389531,-0.0172345,29
1429615174091,85,0.0116336,0.0469963,-0.0147394,51
1429615174119,85,0.069309,0.0707263,0.0441084,69
1429615174150,85,0.187475,0.127137,0.153485,71
1429615174182,85,0.181299,0.0953598,0.158494,67
1429615174223,85,0.0823996,0.00700866,0.0798151,61
1429615174250,85,-0.120846,-0.146056,-0.0986917,55
1429615174282,85,-0.361128,-0.299722,-0.316039,51
1429615174320,85,-0.476982,-0.355255,-0.42229,48
1429615174350,85,-0.468695,-0.318246,-0.432928,47
1429615174382,85,-0.280962,-0.1574,-0.235877,46
1429615174423,85,-0.0277634,0.0295602,0.0186983,44
1429615174450,85,0.221335,0.198366,0.281709,41
1429615174491,85,0.338036,0.251001,0.401537,38
1429615174533,85,0.23009,0.136944,0.26732,32
1429615174574,85,0.16364,0.0757843,0.149998,28
1429615174615,85,0.0377926,-0.00559026,-0.017789,23
1429615174656,85,-0.00177954,-0.00146467,-0.0892088,20
1429615174697,85,-0.0733593,-0.0252502,-0.165219,16
1429615174738,85,-0.0721813,-0.00445058,-0.152045,13
1429615174780,85,-0.0669705,-0.0115916,-0.148753,13
1429615174821,85,-0.0583212,-0.0468676,-0.144834,28
1429615174862,85,0.0748517,0.0354661,0.0256117,59
1429615174903,85,0.2433,0.178313,0.275937,69
1429615174945,84,0.430225,0.321249,0.520606,65
1429615174986,84,0.505042,0.396003,0.629779,60
1429615175028,84,0.385897,0.30679,0.483561,51
1429615175069,84,0.105656,0.100858,0.179784,48
1429615175111,84,-0.279559,-0.19006,-0.224667,47
1429615175153,84,-0.449445,-0.336125,-0.419904,47
1429615175198,84,-0.460324,-0.360226,-0.460704,43
1429615175209,84,-0.236336,-0.201149,-0.264071,43
1429615175252,84,0.0172149,-0.0088318,-0.0168569,38
1429615175294,84,0.0604922,0.0209954,0.0128199,32
1429615175335,84,-0.0520038,-0.065729,-0.0539054,28
1429615175381,84,-0.255118,-0.221484,-0.25167,24
1429615175392,84,-0.405076,-0.34167,-0.375898,24
1429615175433,84,-0.420115,-0.359612,-0.387625,20
1429615175474,84,-0.282269,-0.262511,-0.301829,17
1429615175515,84,-0.0249433,-0.0754805,-0.134052,23
1429615175559,84,0.287811,0.205058,0.128261,40
1429615175604,84,0.409235,0.359879,0.281632,65
1429615175617,84,0.438026,0.449899,0.383955,68
1429615175658,84,0.350239,0.417008,0.387893,67
1429615175699,83,0.185577,0.260836,0.262939,60
1429615175740,83,0.113742,0.134058,0.185491,54
1429615175782,83,0.0982133,0.0171341,0.128573,48
1429615175823,83,0.15389,0.00728972,0.176273,47
1429615175864,83,0.175971,0.0288739,0.226182,47
1429615175906,83,0.0815315,0.00825834,0.205972,45
1429615175947,83,-0.106235,-0.0741528,0.0564744,41
1429615175988,83,-0.297523,-0.197667,-0.147764,38
1429615176030,83,-0.459832,-0.316164,-0.353377,33
1429615176072,83,-0.505709,-0.376286,-0.524941,31
1429615176113,83,-0.393864,-0.31818,-0.534341,28
1429615176155,83,-0.08904,-0.106399,-0.3395,27
1429615176196,83,0.187309,0.10652,-0.0880187,32
1429615176239,83,0.42883,0.329368,0.225845,45
1429615176250,83,0.436301,0.374679,0.378621,52
1429615176291,83,0.306833,0.295958,0.375048,65
1429615176333,83,0.034158,0.0878761,0.181954,67
1429615176374,83,-0.175531,-0.113696,-0.0388068,63
1429615176416,83,-0.315956,-0.240371,-0.214137,56
1429615176457,83,-0.296825,-0.261136,-0.224265,52
1429615176499,83,-0.268744,-0.218172,-0.20434,49
1429615176540,83,-0.0829926,-0.0621536,-0.00542723,48
1429615176582,83,0.0523407,0.0416341,0.115697,47
1429615176626,83,0.182021,0.123477,0.154686,44
1429615176638,83,0.240583,0.153484,0.122645,43
1429615176680,83,0.167021,0.0866297,0.0129525,39
1429615176722,83,0.113303,0.0416484,-0.0113024,37
1429615176763,83,0.0863915,0.0308129,0.0303492,35
1429615176804,83,0.158283,0.114988,0.161076,33
1429615176848,83,0.214994,0.201592,0.280205,31
1429615176859,83,0.176944,0.21317,0.257922,31
1429615176900,83,0.072645,0.145093,0.171659,39
1429615176941,83,-0.106069,-0.0180378,-0.0334674,51
1429615176982,83,-0.243086,-0.177755,-0.221605,65
1429615177023,83,-0.237075,-0.255107,-0.333298,66
1429615177064,83,-0.228153,-0.286097,-0.360605,64
1429615177106,83,-0.201612,-0.259578,-0.309577,58
1429615177148,83,-0.229313,-0.224972,-0.219245,51
1429615177160,83,-0.266388,-0.190754,-0.124682,51
1429615177201,83,-0.267041,-0.140825,-0.0599971,48
1429615177243,83,-0.0827133,-0.00454944,0.0658912,47
1429615177254,83,0.13844,0.122807,0.150525,47
1429615177295,83,0.336189,0.220325,0.227522,45
1429615177337,83,0.335067,0.186239,0.170824,40
1429615177378,83,0.235489,0.114101,0.109326,38
1429615177420,83,0.0765107,0.0350298,0.0349552,35
1429615177462,83,0.0653614,0.0877615,0.0318322,33
1429615177473,83,0.0958605,0.157115,0.0400321,33
1429615177515,83,0.129582,0.197528,0.02974,31
1429615177556,83,0.0386965,0.109769,-0.0305038,30
1429615177598,83,-0.0782436,-0.0110956,-0.0310218,32
1429615177609,83,-0.157078,-0.0786071,0.0245842,36
1429615177650,83,-0.160768,-0.082014,0.0988595,53
1429615177692,83,0.0287423,0.07686,0.289745,63
1429615177705,83,0.267694,0.249656,0.437857,65
1429615177748,83,0.419534,0.337496,0.46429,65
1429615177761,83,0.337396,0.229128,0.269396,64
1429615177803,83,0.0174772,-0.0840846,-0.11302,60
1429615177816,83,-0.323521,-0.384783,-0.483681,58
1429615177857,83,-0.511843,-0.547902,-0.702184,53
1429615177898,83,-0.466343,-0.497069,-0.668784,49
1429615177939,83,-0.287726,-0.325476,-0.472576,47
1429615177981,83,-0.0955041,-0.128808,-0.211497,46
1429615177992,83,-0.0572585,-0.0679199,-0.0624483,46
1429615178033,83,-0.0318909,-0.0367334,-0.00402667,43
1429615178044,83,0.0381165,0.0379804,0.0763223,42
1429615178085,83,0.141532,0.183319,0.197459,38
1429615178097,83,0.220756,0.31721,0.314957,38
1429615178138,83,0.151343,0.316884,0.32103,35
1429615178152,83,-0.0183507,0.165381,0.143466,34
1429615178193,83,-0.156302,0.0041762,-0.0464169,33
1429615178218,83,-0.0600786,0.022621,-0.0140012,32
1429615178259,83,0.107174,0.116442,0.0903878,31
1429615178282,83,0.360653,0.303116,0.300261,31
1429615178324,83,0.51113,0.417693,0.443054,29
1429615178351,83,0.572156,0.459466,0.505056,31
1429615178392,83,0.450463,0.330217,0.411027,45
1429615178433,83,0.0797806,-0.0275875,0.0646121,58
1429615178452,83,-0.27619,-0.359634,-0.281667,65
1429615178493,83,-0.625366,-0.697984,-0.655686,37
1429615178519,83,-0.748093,-0.769611,-0.80799,0
1429615178552,83,-0.805793,-0.761044,-0.839381,0
1429615178582,83,-0.72582,-0.63123,-0.694388,0
1429615178623,83,-0.504382,-0.388189,-0.418212,0
1429615178651,83,-0.115524,-0.0337464,0.0273863,0
1429615178682,83,0.273998,0.307615,0.412852,0
1429615178723,83,0.507244,0.497771,0.627064,0
1429615178764,83,0.564903,0.523799,0.620557,0
1429615178805,83,0.427454,0.38346,0.429891,0
1429615178846,83,0.2235,0.178084,0.178741,0
1429615178891,83,0.0777353,0.0404237,-0.0239251,0
1429615178932,83,0.103629,0.0783069,-0.035158,0
1429615178973,83,0.234196,0.207832,0.0842092,0
1429615179015,83,0.367758,0.34642,0.263939,0
1429615179057,83,0.460871,0.453286,0.441456,0
1429615179098,83,0.471551,0.476335,0.53833,0
1429615179140,83,0.295117,0.330145,0.384476,0
1429615179181,83,-0.0667693,-0.0186056,-0.018586,0
1429615179222,83,-0.480059,-0.427327,-0.488986,0
1429615179264,83,-0.757768,-0.699075,-0.815498,7
1429615179305,83,-0.773847,-0.720157,-0.830285,44
1429615179347,83,-0.526117,-0.494459,-0.539378,63
1429615179388,83,-0.0269775,-0.0677407,0.00114931,70
1429615179429,83,0.363186,0.242629,0.389172,68
1429615179471,83,0.540097,0.363173,0.498063,63
1429615179513,83,0.445896,0.292293,0.321303,56
1429615179554,83,0.043356,-0.0265434,-0.09326,49
1429615179595,83,-0.330844,-0.269425,-0.382295,47
1429615179636,83,-0.651153,-0.491179,-0.598983,44
1429615179679,83,-0.796385,-0.563771,-0.65814,41
1429615179721,83,-0.669824,-0.452289,-0.526399,35
1429615179763,83,-0.359333,-0.221482,-0.236439,31
1429615179804,83,0.0205231,0.0580838,0.0875873,27
1429615179845,83,0.38797,0.318996,0.376909,25
1429615179887,83,0.680413,0.537039,0.633655,22
1429615179928,83,0.865604,0.687614,0.827574,21
1429615179969,83,0.777473,0.606732,0.759639,18
1429615180011,83,0.514475,0.385308,0.559466,17
1429615180052,83,0.111693,0.0747359,0.224839,15
1429615180093,83,-0.345243,-0.273,-0.169223,13
1429615180137,83,-0.673634,-0.52202,-0.558997,11
1429615180149,83,-0.605521,-0.433449,-0.58567,11
1429615180193,83,-0.261112,-0.148451,-0.365316,10
1429615180204,83,0.227987,0.241354,0.0380813,12
1429615180246,83,0.567671,0.496915,0.348268,29
1429615180291,83,0.506585,0.412939,0.333894,66
1429615180303,83,0.296429,0.202061,0.191282,66
1429615180344,83,-0.0396599,-0.093216,-0.0848502,85
1429615180385,83,-0.278005,-0.315614,-0.254722,85
1429615180426,83,-0.275192,-0.304412,-0.223386,78
1429615180471,83,-0.188438,-0.208204,-0.15586,69
1429615180482,83,-0.19288,-0.199424,-0.192468,69
1429615180524,83,-0.294336,-0.298306,-0.329012,58
1429615180565,83,-0.346954,-0.36112,-0.340913,54
1429615180607,83,-0.282114,-0.318078,-0.220209,50
1429615180648,83,-0.0793917,-0.122554,0.0514847,47
1429615180690,83,0.204924,0.16672,0.374747,40
1429615180738,83,0.377565,0.368182,0.507812,35
1429615180749,83,0.396887,0.420812,0.447434,33
1429615180791,83,0.316779,0.385704,0.280879,28
1429615180832,83,0.155663,0.265543,0.118722,25
1429615180874,83,0.0480272,0.182434,0.0433158,22
1429615180915,83,-0.0252804,0.112087,0.0225806,20
1429615180957,83,-0.0385352,0.0651052,0.0247595,18
1429615180998,83,-0.0180688,0.0545739,0.000643736,16
1429615181039,83,0.0796753,0.0547464,-0.0161888,13
1429615181081,83,0.152806,0.0750944,-0.0473449,11
1429615181123,83,0.114667,0.0186906,-0.0992895,9
1429615181165,83,-0.0971834,-0.155133,-0.24845,8
1429615181206,83,-0.285115,-0.322311,-0.333485,22
1429615181248,83,-0.395467,-0.409712,-0.36272,45
1429615181289,83,-0.366229,-0.403474,-0.295261,77
1429615181331,83,-0.234672,-0.279694,-0.151459,81
1429615181372,83,-0.037885,-0.0765127,0.0514255,78
1429615181414,83,0.106842,0.105671,0.21478,71
1429615181455,83,0.17552,0.218839,0.308509,65
1429615181496,83,0.21946,0.283993,0.389963,55
1429615181539,83,0.202375,0.240638,0.378165,50
1429615181581,83,0.111852,0.0876242,0.238768,47
1429615181623,83,-0.174307,-0.248895,-0.113901,44
1429615181664,83,-0.362608,-0.465366,-0.436636,38
1429615181705,83,-0.469377,-0.540191,-0.640769,33
1429615181746,83,-0.254524,-0.297516,-0.506932,28
1429615181791,83,0.0400932,0.0427184,-0.203547,24
1429615181803,83,0.428157,0.44458,0.244525,24
1429615181845,83,0.57214,0.610612,0.523466,21
1429615181886,83,0.560287,0.599966,0.648049,20
1429615181929,83,0.314693,0.345654,0.447109,17
1429615181940,83,-0.014207,0.0158216,0.0458748,17
1429615181982,83,-0.34742,-0.29595,-0.415504,15
1429615182023,83,-0.41461,-0.346195,-0.57271,13
1429615182065,83,-0.14699,-0.0961218,-0.339104,11
1429615182076,83,0.296646,0.285451,0.139855,10
1429615182117,83,0.594415,0.550913,0.544165,9
1429615182158,83,0.556772,0.503739,0.619454,7
1429615182169,83,0.117762,0.102503,0.322732,7
1429615182211,83,-0.4825,-0.452414,-0.220976,23
1429615182252,83,-0.767579,-0.679449,-0.572119,45
1429615182265,83,-0.570067,-0.452672,-0.520882,58
1429615182306,83,-0.134527,-0.0271534,-0.214799,74
1429615182348,83,0.37688,0.394704,0.255647,73
1429615182359,83,0.787925,0.694744,0.718711,70
1429615182401,83,0.732999,0.536894,0.778568,65
1429615182413,83,0.41506,0.215186,0.543157,62
1429615182454,83,-0.103358,-0.220277,0.0529252,56
1429615182466,83,-0.519774,-0.509924,-0.395681,53
1429615182507,83,-0.684852,-0.597148,-0.689147,49
1429615182548,83,-0.648741,-0.507735,-0.741999,45
1429615182561,83,-0.412704,-0.305119,-0.535207,45
1429615182602,83,-0.23244,-0.191672,-0.30893,43
1429615182619,83,-0.109382,-0.149786,-0.129704,41
1429615182662,83,-0.145437,-0.251004,-0.0998623,36
1429615182682,83,-0.0864761,-0.1867,-0.0093208,34
1429615182723,83,-0.00448079,-0.058817,0.043597,30
1429615182750,83,0.0999366,0.116301,0.0672572,26
1429615182791,83,0.103729,0.187096,0.0193291,24
1429615182833,83,0.128641,0.242389,0.0129452,21
1429615182850,83,0.105981,0.198705,-0.00270649,20
1429615182891,83,0.084932,0.114272,0.037647,19
1429615182918,83,0.107005,0.0793755,0.12745,18
1429615182959,83,0.148376,0.0808245,0.215741,16
1429615183002,83,0.20052,0.145332,0.29181,14
1429615183044,83,0.270006,0.262381,0.33434,12
1429615183086,83,0.275204,0.33857,0.32896,11
1429615183127,83,0.297506,0.385051,0.360734,9
1429615183169,83,0.29962,0.347757,0.34876,8
1429615183211,83,0.199632,0.186936,0.213047,27
1429615183253,83,0.1851,0.110417,0.119802,49
1429615183295,83,0.023988,-0.0470859,-0.0986101,73
1429615183336,83,-0.154039,-0.19424,-0.25985,71
1429615183379,83,-0.282945,-0.279639,-0.335001,61
1429615183420,83,-0.25275,-0.229936,-0.226874,55
1429615183461,83,-0.108453,-0.0990725,-0.0363419,47
1429615183502,83,-0.0452934,-0.0712965,-0.00918731,44
1429615183543,83,-0.0440146,-0.137144,-0.0820143,43
1429615183584,83,-0.264839,-0.373408,-0.367161,42
1429615183626,83,-0.461344,-0.536071,-0.563857,40
1429615183667,83,-0.590121,-0.581361,-0.641328,34
1429615183708,83,-0.502588,-0.427169,-0.442679,30
1429615183749,83,-0.261447,-0.166037,-0.130768,25
1429615183790,83,0.0461976,0.120287,0.219009,22
1429615183832,83,0.199935,0.235867,0.325874,20
1429615183878,83,0.320016,0.339723,0.360989,18
1429615183889,83,0.375096,0.384457,0.33898,18
1429615183931,83,0.297705,0.305306,0.189901,16
1429615183972,83,0.268512,0.272416,0.137188,15
1429615184014,83,0.287442,0.292646,0.172927,13
1429615184055,83,0.300823,0.337923,0.234618,11
1429615184096,83,0.23225,0.322646,0.208505,8
1429615184138,83,0.0935341,0.197455,0.122436,8
1429615184179,83,-0.00433672,0.0779162,0.0786877,34
1429615184220,83,-0.154377,-0.113138,-0.0564118,57
1429615184262,83,-0.227237,-0.255409,-0.161195,72
1429615184304,83,-0.142184,-0.212144,-0.102332,67
1429615184345,83,0.0154614,-0.109729,0.0346961,56
1429615184387,83,0.067016,-0.0709026,0.0755601,49
1429615184428,83,0.00709634,-0.11957,0.00745357,41
1429615184469,83,-0.164257,-0.260332,-0.176151,40
1429615184510,83,-0.30408,-0.367993,-0.334624,41
1429615184552,83,-0.383078,-0.388728,-0.475621,40
1429615184593,83,-0.298194,-0.257965,-0.423422,38
1429615184635,83,0.00779636,0.0712971,-0.134489,32
1429615184676,83,0.378124,0.433157,0.323358,27
1429615184717,83,0.588624,0.631015,0.648611,22
1429615184758,83,0.679419,0.680082,0.885521,19
1429615184800,83,0.489071,0.446057,0.743655,16
1429615184841,83,0.200253,0.126577,0.418174,15
1429615184884,83,-0.0923523,-0.15554,0.0270986,13
1429615184925,83,-0.349758,-0.376074,-0.334312,12
1429615184966,83,-0.482811,-0.450302,-0.548457,11
1429615185008,83,-0.509378,-0.439203,-0.616678,9
1429615185049,83,-0.48998,-0.397503,-0.600831,8
1429615185095,83,-0.33394,-0.246885,-0.442183,24
1429615185106,83,-0.204919,-0.102775,-0.289315,36
1429615185148,83,0.0544056,0.134671,-0.017692,69
1429615185191,83,0.315742,0.35774,0.261911,74
1429615185203,83,0.489648,0.467684,0.432738,71
1429615185245,83,0.440713,0.353715,0.345525,62
1429615185287,83,0.16747,0.0697854,0.0254848,49
1429615185328,83,-0.133669,-0.194642,-0.275191,42
1429615185369,83,-0.356743,-0.373627,-0.450608,38
1429615185411,83,-0.370211,-0.360169,-0.402384,40
1429615185452,83,-0.156386,-0.157717,-0.117455,40
1429615185493,83,0.036609,0.0136127,0.119947,39
1429615185535,83,0.207369,0.172039,0.318749,33
1429615185576,83,0.163193,0.174961,0.339032,28
1429615185617,83,0.0633465,0.128607,0.327932,22
1429615185659,83,-0.0365216,0.0590704,0.266593,19
1429615185700,83,-0.0237132,0.0760445,0.243785,15
1429615185742,83,0.0439425,0.112748,0.208914,13
1429615185785,83,0.208898,0.216366,0.22252,10
1429615185798,83,0.323523,0.268557,0.218049,10
1429615185839,83,0.296798,0.199847,0.130138,8
1429615185851,83,0.07855,-0.0260738,-0.0954643,7
1429615185892,83,-0.219407,-0.321925,-0.413305,7
1429615185933,83,-0.426391,-0.493506,-0.577942,36
1429615185974,83,-0.584566,-0.594343,-0.686874,63
1429615186015,83,-0.483518,-0.440628,-0.504595,82
1429615186057,81,-0.191647,-0.131638,-0.153279,76
1429615186069,81,0.224143,0.250922,0.281353,71
1429615186110,81,0.49956,0.483432,0.523744,62
1429615186153,81,0.446072,0.391157,0.401314,49
1429615186165,81,0.20659,0.149642,0.134767,49
1429615186206,81,-0.1385,-0.127122,-0.181929,44
1429615186218,81,-0.30245,-0.231462,-0.299596,44
1429615186259,81,-0.176769,-0.0807951,-0.142439,45
1429615186270,81,0.019805,0.111267,0.0545149,46
1429615186311,81,0.170332,0.229154,0.17598,45
1429615186323,81,0.0759721,0.0977751,0.00871015,43
1429615186365,81,-0.102545,-0.10293,-0.194601,40
1429615186406,81,-0.222125,-0.242395,-0.301367,32
1429615186418,81,-0.254824,-0.269187,-0.277339,29
1429615186459,81,-0.18546,-0.196918,-0.14099,25
1429615186482,81,-0.02575,-0.0205492,0.106328,23
1429615186523,81,0.166165,0.157948,0.337893,17
1429615186550,81,0.410755,0.378931,0.593864,16
1429615186591,81,0.579155,0.512926,0.736668,12
1429615186632,81,0.652941,0.553701,0.776655,12
1429615186673,81,0.550077,0.460867,0.641087,43
1429615186685,81,0.287385,0.225653,0.30017,57
1429615186726,81,-0.0449971,-0.0710023,-0.130314,82
1429615186751,81,-0.387714,-0.355432,-0.530051,86
1429615186782,82,-0.608876,-0.530607,-0.765979,84
1429615186822,82,-0.660458,-0.572406,-0.810324,72
1429615186849,82,-0.589697,-0.495432,-0.693381,68
1429615186881,82,-0.437773,-0.365598,-0.529227,60
1429615186919,82,-0.23644,-0.188263,-0.289797,51
1429615186977,82,-0.13225,-0.11833,-0.181916,51
1429615187020,82,-0.133945,-0.135941,-0.144754,43
1429615187108,82,-0.222068,-0.232127,-0.205872,40
1429615187150,82,-0.253023,-0.281973,-0.212873,21
1429615187255,82,-0.118853,-0.176497,-0.0704696,20
1429615187302,82,0.1825,0.0999971,0.227894,26
1429615187344,82,0.484297,0.404836,0.526122,47
1429615187386,82,0.726633,0.66114,0.780094,81
1429615187431,82,0.835795,0.783015,0.882409,86
1429615187443,82,0.744437,0.717386,0.776157,85
1429615187484,83,0.493225,0.47558,0.48276,75
1429615187526,83,0.0965284,0.115666,0.0727704,68
1429615187567,83,-0.180716,-0.139379,-0.166228,61
1429615187608,83,-0.321463,-0.289593,-0.286376,55
1429615187650,83,-0.327792,-0.303961,-0.264529,54
1429615187691,83,-0.218948,-0.187514,-0.131544,52
1429615187732,83,-0.128453,-0.0724307,-0.0650696,49
1429615187774,83,-0.173603,-0.0722904,-0.164412,40
1429615187815,83,-0.230993,-0.113991,-0.286522,36
1429615187856,83,-0.314749,-0.213539,-0.4235,29
1429615187898,83,-0.33249,-0.297273,-0.468982,26
1429615187939,83,-0.279623,-0.308336,-0.409379,21
1429615187981,83,-0.133256,-0.213103,-0.19249,27
1429615188023,83,0.0632632,-0.033824,0.093493,57
1429615188065,83,0.220293,0.142416,0.306822,78
1429615188106,83,0.274785,0.23885,0.371998,84
1429615188149,84,0.226555,0.242782,0.290666,79
1429615188190,84,0.138318,0.198425,0.146136,71
1429615188232,84,0.124254,0.181056,0.116892,64
1429615188273,84,0.2592,0.25589,0.271018,55
1429615188315,84,0.406106,0.299764,0.424512,53
1429615188356,84,0.39561,0.212725,0.409882,51
1429615188398,84,0.217913,0.0215024,0.215502,48
1429615188439,84,-0.152253,-0.27771,-0.192975,40
1429615188480,84,-0.463189,-0.482874,-0.532106,35
1429615188521,84,-0.669926,-0.575145,-0.751396,29
1429615188563,84,-0.618524,-0.464992,-0.655874,26
1429615188604,84,-0.456961,-0.243895,-0.395004,23
1429615188646,84,-0.257098,-0.0410816,-0.108734,21
1429615188687,84,-0.162673,0.0292881,-0.0661698,22
1429615188728,84,-0.00347507,0.107805,-0.0437143,45
1429615188773,84,0.159518,0.17052,-0.0318244,76
1429615188790,84,0.378308,0.307026,0.149292,81
1429615188802,84,0.525526,0.411558,0.383615,81
1429615188844,84,0.499475,0.382125,0.523489,81
1429615188855,84,0.328849,0.231533,0.454803,79
1429615188897,84,0.149446,0.084398,0.330454,75
1429615188938,84,0.0364361,0.000418564,0.195708,69
1429615188979,84,-0.0151356,-0.0218855,0.069385,59
1429615189020,84,-0.0772094,-0.0538995,-0.0759376,55
1429615189061,84,-0.191737,-0.14903,-0.219566,51
1429615189102,84,-0.204478,-0.200667,-0.242924,49
1429615189143,84,-0.157689,-0.207434,-0.18455,42
1429615189185,84,-0.0168967,-0.119118,-0.0357169,37
1429615189234,84,0.147286,0.0312561,0.141252,30
1429615189245,84,0.227649,0.147427,0.235255,29
1429615189287,84,0.108126,0.120569,0.128164,26
1429615189328,84,-0.0897046,0.000759685,-0.0800453,23
1429615189369,84,-0.237769,-0.10874,-0.254554,22
1429615189411,84,-0.335337,-0.196499,-0.363793,19
1429615189452,84,-0.321257,-0.198671,-0.339387,18
1429615189497,84,-0.198947,-0.111887,-0.176538,15
1429615189508,84,0.0312543,0.0751994,0.0850128,13
1429615189550,84,0.24379,0.226784,0.270351,14
1429615189591,84,0.319147,0.244678,0.274195,40
1429615189633,84,0.317523,0.203733,0.218701,65
1429615189675,84,0.223467,0.10722,0.11007,84
1429615189686,84,0.0998725,0.0252842,0.0411286,84
1429615189727,84,0.00643343,-0.0207861,-0.0061554,81
1429615189769,84,-0.0506966,-0.0396801,-0.0395364,76
1429615189811,84,-0.1052,-0.0763727,-0.0891206,66
1429615189822,84,-0.104314,-0.09415,-0.0674713,66
1429615189863,84,-0.0894294,-0.103573,-0.0156551,57
1429615189905,84,-0.134431,-0.167889,-0.046139,53
1429615189947,84,-0.150358,-0.172572,-0.0857509,49
1429615189958,84,-0.128656,-0.129269,-0.108859,48
1429615189999,84,-0.0661926,-0.0546127,-0.087793,44
1429615190040,84,-0.00318922,0.00406227,-0.0556457,40
1429615190081,84,0.00705956,0.0288294,-0.0404864,32
1429615190092,84,0.0149155,0.06277,-0.00616429,30
1429615190133,84,-0.0120196,0.0685646,0.00492305,27
1429615190145,84,-0.00200792,0.100949,0.0470781,26
1429615190187,84,0.0485722,0.123788,0.119765,24
1429615190228,84,0.109147,0.136088,0.179889,21
1429615190239,84,0.0916066,0.0770973,0.123401,21
1429615190281,84,0.00774375,-0.0328477,-0.0160309,19
1429615190292,84,-0.0675369,-0.115368,-0.141796,18
1429615190333,84,-0.051752,-0.0931424,-0.149045,16
1429615190375,84,0.0819502,0.0279642,0.011563,13
1429615190386,84,0.258103,0.207116,0.240048,13
1429615190428,84,0.31947,0.274155,0.354989,11
1429615190439,84,0.277294,0.258946,0.331679,11
1429615190480,84,0.122497,0.126066,0.149147,8
1429615190491,84,-0.00233533,0.0142578,-0.000326098,8
1429615190533,84,-0.0542344,-0.0324036,-0.0682891,14
1429615190551,84,-0.0627381,-0.0364234,-0.0720822,24
1429615190592,84,-0.102017,-0.0693842,-0.11349,64
1429615190619,84,-0.188338,-0.153355,-0.204771,76
1429615190649,84,-0.267882,-0.254219,-0.30422,86
1429615190690,84,-0.279344,-0.305516,-0.327361,85
1429615190719,84,-0.23235,-0.304646,-0.279367,80
1429615190751,84,-0.118894,-0.207981,-0.117996,75
1429615190781,84,0.0151561,-0.065041,0.0870038,68
1429615190823,84,0.0864574,0.0447928,0.196914,61
1429615190849,84,0.102996,0.107694,0.198005,57
1429615190890,84,0.0430372,0.0753754,0.0484489,54
1429615190919,84,-0.0957493,-0.0380877,-0.18476,51
1429615190950,84,-0.173614,-0.0991527,-0.288513,48
1429615190983,84,-0.142276,-0.0754694,-0.217608,43
1429615191019,84,0.0415987,0.0970192,0.0590735,38
1429615191049,84,0.327916,0.364027,0.45471,33
1429615191081,84,0.462426,0.490041,0.626997,29
1429615191120,84,0.365515,0.383334,0.493341,26
1429615191150,84,0.118424,0.124686,0.135345,24
1429615191181,84,-0.144029,-0.149753,-0.244152,22
1429615191221,84,-0.285893,-0.286643,-0.433444,20
1429615191250,84,-0.215774,-0.217137,-0.322776,19
1429615191281,84,-0.0376405,-0.0425169,-0.0606542,17
1429615191317,84,0.106033,0.0908113,0.183456,15
1429615191349,84,0.194946,0.152882,0.293192,13
1429615191381,84,0.140312,0.0708332,0.181996,10
1429615191417,84,-0.0119072,-0.0780731,-0.0920816,8
1429615191459,84,-0.17845,-0.213113,-0.33405,6
1429615191500,84,-0.24441,-0.239804,-0.39787,24
1429615191542,84,-0.168977,-0.146643,-0.243929,50
1429615191583,84,-0.025277,-0.0109855,-0.0344902,80
1429615191624,84,0.114887,0.104398,0.14756,80
1429615191665,84,0.179944,0.156832,0.218635,72
1429615191706,84,0.12945,0.117527,0.170884,66
1429615191749,84,-0.00229235,0.0167452,0.0591841,56
1429615191790,84,-0.172245,-0.105029,-0.0722281,52
1429615191831,84,-0.296357,-0.204671,-0.177865,49
1429615191874,84,-0.350517,-0.257628,-0.258911,47
1429615191915,84,-0.209844,-0.166187,-0.151399,41
1429615191956,84,-0.00289063,-0.0265444,0.00356746,36
1429615191998,84,0.218874,0.138562,0.20027,28
1429615192039,84,0.267413,0.189267,0.238336,24
1429615192081,84,0.243044,0.189293,0.223535,20
1429615192123,84,0.123382,0.0949721,0.119487,18
1429615192164,84,-0.0179803,-0.0270371,-0.00509531,16
1429615192206,84,-0.0953511,-0.103431,-0.0955384,14
1429615192247,84,-0.0735076,-0.0793654,-0.101958,12
1429615192288,84,0.0193494,0.031965,-0.0563313,9
1429615192330,84,0.0971255,0.116643,-0.0520476,6
1429615192371,84,0.185607,0.209986,-0.0118693,3
1429615192413,84,0.237497,0.249604,0.0821179,7
1429615192454,84,0.179243,0.167354,0.118968,31
1429615192496,84,0.111742,0.0881943,0.193333,73
1429615192537,84,0.0539026,0.0433931,0.250615,83
1429615192578,84,-0.0427559,-0.0194093,0.150075,77
1429615192620,84,-0.13864,-0.081295,-0.00889422,69
1429615192661,84,-0.179565,-0.113017,-0.132261,61
1429615192702,84,-0.152943,-0.114517,-0.157555,52
1429615192743,84,-0.0552692,-0.0772018,-0.0463876,49
1429615192785,84,0.0566675,-0.0395585,0.1047,48
1429615192826,84,0.0520068,-0.0801145,0.114721,45
1429615192867,84,-0.0275007,-0.134255,0.0218683,38
1429615192908,84,-0.203792,-0.226019,-0.213991,32
1429615192949,84,-0.387171,-0.313973,-0.477952,24
1429615192990,84,-0.416698,-0.27496,-0.558358,20
1429615193032,84,-0.349668,-0.193148,-0.503988,15
1429615193073,84,-0.135291,-0.0251958,-0.243275,13
1429615193115,84,0.11092,0.139895,0.07741,9
1429615193157,84,0.290675,0.248434,0.321331,7
1429615193198,84,0.3891,0.292915,0.418636,3
1429615193240,84,0.354267,0.263041,0.355304,1
1429615193281,84,0.243882,0.169337,0.195517,0
1429615193323,84,0.127397,0.101098,0.0831281,0
1429615193370,84,0.0387443,0.0520451,0.0424345,21
1429615193382,84,-0.0163917,0.021632,0.0452669,38
1429615193423,84,0.0252841,0.0667688,0.144511,70
1429615193464,84,0.0701698,0.0963494,0.213602,88
1429615193505,84,0.0906292,0.0906426,0.2179,60
1429615193547,84,0.0561693,0.0282298,0.122334,56
1429615193588,84,-0.0753878,-0.118423,-0.0915303,49
1429615193630,84,-0.129159,-0.187615,-0.221549,45
1429615193671,84,-0.125505,-0.190216,-0.249559,44
1429615193712,84,-0.0317045,-0.0845467,-0.125413,44
1429615193753,84,0.0383782,0.0227228,0.0160999,41
1429615193794,84,0.0682048,0.0977886,0.11568,39
1429615193835,84,0.0327942,0.0988855,0.129324,34
1429615193876,84,-0.0400205,0.0259192,0.0305948,31
1429615193918,84,-0.176854,-0.117271,-0.164538,26
1429615193959,84,-0.289756,-0.241441,-0.341199,24
1429615194001,84,-0.353287,-0.289778,-0.409561,20
1429615194042,84,-0.303675,-0.233482,-0.328894,18
1429615194084,84,-0.152402,-0.106385,-0.12983,16
1429615194125,84,0.0504247,0.0457195,0.123009,14
1429615194167,84,0.266546,0.202933,0.343076,13
1429615194179,84,0.418767,0.307498,0.457347,13
1429615194220,84,0.433664,0.315356,0.398901,13
1429615194262,84,0.326167,0.232685,0.228333,24
1429615194274,84,0.150608,0.104503,0.0297085,33
1429615194315,84,-0.00574312,0.00657262,-0.104909,52
1429615194356,84,-0.123001,-0.0627478,-0.185696,66
1429615194398,84,-0.173929,-0.0956876,-0.194836,63
1429615194439,84,-0.162611,-0.103197,-0.159086,55
1429615194481,84,-0.135253,-0.0977424,-0.122154,49
1429615194492,84,-0.149464,-0.121109,-0.127469,47
1429615194533,84,-0.186366,-0.136817,-0.144438,44
1429615194545,84,-0.197183,-0.120838,-0.139355,44
1429615194586,84,-0.187322,-0.100064,-0.117984,44
1429615194628,84,-0.105686,-0.0526053,-0.0615351,43
1429615194640,84,0.0312104,0.012606,0.0484908,42
1429615194682,84,0.157926,0.0626557,0.13482,40
1429615194693,84,0.242806,0.0807502,0.193577,39
1429615194734,84,0.256157,0.0772244,0.220161,33
1429615194746,84,0.206655,0.0538457,0.198255,33
1429615194787,84,0.131952,0.0311206,0.151885,28
1429615194829,84,0.027181,0.00221046,0.0759931,24
1429615194840,84,-0.0514363,-0.00402566,0.00798777,23
1429615194881,84,-0.066953,0.0237903,-0.0110157,21
1429615194922,84,-0.0157573,0.0911448,0.0277229,18
1429615194933,84,0.0815483,0.167041,0.0812577,18
1429615194974,84,0.129864,0.180196,0.0826718,16
1429615194985,84,0.108536,0.129225,0.0355294,16
1429615195026,84,-0.00896981,0.0064564,-0.0792839,15
1429615195051,84,-0.132377,-0.119109,-0.166862,16
1429615195081,84,-0.278599,-0.244676,-0.275376,27
1429615195122,84,-0.31886,-0.26739,-0.290165,55
1429615195152,84,-0.253636,-0.206432,-0.232568,70
1429615195181,84,-0.0922766,-0.0637528,-0.0669701,72
1429615195222,82,0.0993478,0.0884368,0.137312,67
1429615195249,82,0.239471,0.192673,0.311996,64
1429615195281,82,0.250302,0.183215,0.326511,58
1429615195319,82,0.228926,0.165192,0.299643,51
1429615195349,82,0.212961,0.16374,0.234066,50
1429615195391,82,0.125467,0.0909432,0.0849633,48
1429615195418,82,-0.0276819,-0.0380315,-0.124436,48
1429615195450,82,-0.176139,-0.168775,-0.282815,47
1429615195491,82,-0.258151,-0.241629,-0.340631,43
1429615195519,82,-0.197617,-0.183994,-0.233707,40
1429615195549,82,-0.0817389,-0.0727728,-0.0908783,38
1429615195591,82,-0.0105853,-0.0027568,-0.039081,32
1429615195619,82,-0.0303434,-0.00713644,-0.0852872,31
1429615195649,82,-0.0227817,0.00145019,-0.0764324,27
1429615195691,82,-0.0634898,-0.0394274,-0.0890488,23
1429615195732,82,-0.0297092,-0.0257344,-0.0108554,21
1429615195773,82,0.0283778,0.0100805,0.0783273,18
1429615195815,82,0.0552683,0.0385081,0.0816054,17
1429615195857,82,0.112906,0.0995022,0.133096,19
1429615195898,82,0.0846813,0.0796459,0.0786238,35
1429615195939,82,0.0423536,0.0376498,0.0426167,63
1429615195981,82,0.0266968,0.0176522,0.0400125,72
1429615196023,82,0.0168708,0.00690032,0.0723494,69
1429615196064,81,0.0478806,0.0474102,0.142974,64
1429615196105,81,0.0183928,0.0416227,0.115785,57
1429615196148,81,-0.0259577,0.0214103,0.0552455,54
1429615196189,81,-0.0682364,-0.0294356,-0.0464176,52
1429615196230,81,-0.072287,-0.0546995,-0.0765219,51
1429615196271,81,-0.0506571,-0.0613185,-0.0637066,48
1429615196313,81,0.0169301,-0.0108916,0.0147687,44
1429615196357,81,0.0351062,0.0108906,0.0359731,40
1429615196368,81,0.0465024,0.0357028,0.0369083,40
1429615196409,81,-0.00206167,-0.0011932,-0.0604055,35
1429615196450,81,-0.0558092,-0.0643378,-0.166148,32
1429615196491,81,-0.0757602,-0.0977969,-0.205886,28
1429615196534,81,-0.0356771,-0.0678848,-0.151876,26
1429615196546,81,0.0218386,-0.00867103,-0.0419664,25
1429615196587,81,0.0736106,0.0549683,0.0801592,22
1429615196629,81,0.112345,0.100189,0.169092,22
1429615196670,81,0.0743943,0.0605464,0.141568,40
1429615196711,81,0.0143943,0.00236539,0.0640189,55
1429615196752,81,-0.0639628,-0.0543361,-0.0485538,66
1429615196794,81,-0.14577,-0.0929386,-0.147325,65
1429615196835,80,-0.196747,-0.104377,-0.187032,62
1429615196879,80,-0.125395,-0.0387432,-0.090236,55
1429615196891,80,-0.00754167,0.0324365,0.042269,53
1429615196932,80,0.121806,0.102378,0.156712,51
1429615196973,80,0.184454,0.121817,0.195627,49
1429615197014,80,0.140343,0.0772974,0.117286,48
1429615197056,80,0.0919649,0.0457839,0.0560925,45
1429615197098,80,0.0385499,0.0104339,0.0160349,42
1429615197140,80,0.0380316,0.0222354,0.0588626,38
1429615197182,80,0.0243305,0.0220753,0.0759934,35
1429615197223,80,0.0334991,0.0436699,0.0989849,31
1429615197264,80,-0.000692095,0.030123,0.0403684,30
1429615197305,80,-0.0209001,0.00663542,-0.0148154,27
1429615197346,80,-0.0700311,-0.038943,-0.0684688,25
1429615197387,80,-0.129681,-0.101463,-0.118144,24
1429615197429,80,-0.148329,-0.123814,-0.157684,23
1429615197470,80,-0.0910734,-0.0713418,-0.134505,33
1429615197511,80,0.00980859,0.0133555,-0.0777693,55
1429615197552,80,0.159513,0.130681,0.0600569,63
1429615197594,80,0.233464,0.179251,0.156206,62
1429615197635,79,0.209356,0.147221,0.178657,58
1429615197677,79,0.0681585,0.021281,0.0762152,52
1429615197718,79,-0.108273,-0.125526,-0.10067,49
1429615197760,79,-0.233787,-0.223862,-0.249542,47
1429615197801,79,-0.259129,-0.227813,-0.261705,46
1429615197843,79,-0.238671,-0.208923,-0.26094,44
1429615197885,79,-0.0952824,-0.10311,-0.125797,41
1429615197926,79,0.00680858,-0.0361677,-0.0307868,37
1429615197967,79,0.0832291,0.0120699,0.0410604,34
1429615198009,79,0.0848182,0.0294892,0.0386868,31
1429615198050,79,0.021125,-0.00784217,-0.0618079,29
1429615198092,79,-0.0519466,-0.0471129,-0.185285,26
1429615198133,79,-0.0744459,-0.0739303,-0.259523,25
1429615198174,79,-0.00964156,-0.0440333,-0.255807,22
1429615198216,79,0.0874956,0.0329381,-0.164582,20
1429615198257,79,0.17202,0.113809,-0.0292283,27
1429615198298,79,0.162266,0.132454,0.0793714,41
1429615198340,79,0.0880696,0.085752,0.124991,56
1429615198385,79,-0.0126587,0.00476988,0.118604,62
1429615198397,79,-0.0646645,-0.0460273,0.120684,61
1429615198438,78,-0.0108775,-0.0169453,0.171779,57
1429615198479,78,0.0835758,0.0666212,0.212599,51
1429615198521,78,0.124352,0.138272,0.221833,48
1429615198564,78,0.105569,0.16236,0.194745,46
1429615198575,78,0.00993002,0.124806,0.12852,46
1429615198617,78,-0.0522697,0.0773026,0.0802572,45
1429615198658,78,-0.0923828,0.0219172,0.0437986,43
1429615198699,78,-0.113972,-0.0269431,0.0218678,40
1429615198740,78,-0.151366,-0.084247,-0.00400707,38
1429615198782,78,-0.183747,-0.112892,-0.0262682,33
1429615198823,78,-0.179717,-0.117504,-0.0402677,31
1429615198864,78,-0.123543,-0.0836376,-0.0328025,29
1429615198905,78,-0.0116806,-0.0281963,-0.00183858,28
1429615198947,78,0.0808477,0.0167384,0.0189138,26
1429615198988,78,0.150826,0.054371,0.020703,24
1429615199029,78,0.175236,0.0706388,0.00057504,25
1429615199070,78,0.156803,0.0763601,-0.0301582,35
1429615199112,78,0.140836,0.0820431,-0.0460107,55
1429615199124,78,0.155612,0.104306,-0.0304541,55
1429615199167,78,0.14427,0.0937599,-0.0178459,60
1429615199179,78,0.100972,0.0585106,-0.0186224,59
1429615199220,79,-0.0146593,-0.0185787,-0.0531804,55
1429615199262,79,-0.112605,-0.0938711,-0.0860458,49
1429615199273,79,-0.196122,-0.161017,-0.117879,49
1429615199314,79,-0.218298,-0.17864,-0.121946,44
1429615199326,79,-0.185012,-0.141921,-0.09011,44
1429615199368,79,-0.109869,-0.0715344,-0.0379934,44
1429615199380,79,-0.00598359,0.014622,0.0203524,44
1429615199421,79,0.0438369,0.0564422,0.0532689,43
1429615199463,79,0.0250618,0.0429763,0.0489628,40
1429615199474,79,-0.0100406,0.0131002,0.0326194,40
1429615199515,79,-0.0207445,-0.00990751,0.0214837,36
1429615199526,79,0.0289051,0.0160984,0.0366243,36
1429615199569,79,0.0664315,0.0369052,0.0457964,32
1429615199582,79,0.0699701,0.0495064,0.0465627,30
1429615199623,79,0.0490772,0.0406748,0.0356117,28
1429615199651,79,-0.00796023,0.00827706,0.0109819,26
1429615199686,79,-0.0142949,-0.00897822,0.00324737,25
1429615199717,79,0.0547555,0.0158765,0.025568,23
1429615199758,79,0.156211,0.0657043,0.0666073,21
1429615199782,79,0.228352,0.120195,0.103893,25
1429615199823,79,0.204118,0.128981,0.103678,38
1429615199850,79,0.0755292,0.0793222,0.0655969,53
1429615199887,79,-0.12598,-0.0155929,-0.00823416,63
1429615199917,79,-0.288372,-0.109175,-0.0772634,63
1429615199958,78,-0.337236,-0.156314,-0.114678,60
1429615200000,78,-0.262036,-0.145478,-0.114318,54
1429615200041,78,-0.120512,-0.0903186,-0.0826406,51
1429615200082,78,0.0421841,-0.018445,-0.0361006,47
1429615200123,78,0.109641,0.0245888,-0.00515,47
1429615200166,78,0.115943,0.035169,0.00876565,46
1429615200207,78,0.0861794,0.028996,0.0145323,43
1429615200249,78,0.0544519,0.0126383,0.0179078,39
1429615200295,78,0.0498298,0.00754495,0.0243031,35
1429615200306,78,0.0456131,-0.00217991,0.0168773,35
1429615200347,78,0.0608587,0.00549925,0.00990574,31
1429615200388,78,0.0392059,-5.7381e-05,-0.00975051,30
1429615200429,78,0.0209178,0.00928209,-0.0228966,27
1429615200470,78,-0.00742577,0.0266713,-0.0200537,26
1429615200512,78,-0.0192382,0.0441254,-0.00741121,25
1429615200553,78,-0.0339938,0.0421574,0.00159818,35
1429615200594,78,-0.0335586,0.0245303,0.00994943,55
1429615200640,78,-0.00976767,0.00777408,0.022397,64
1429615200651,78,0.0189237,0.000536201,0.0282671,65
1429615200692,78,0.0239762,-0.00363686,0.0198712,63
1429615200733,77,-0.0179945,-0.020379,-0.00775268,59
1429615200774,77,-0.0317039,-0.0196338,-0.0257956,55
1429615200816,77,-0.0250329,-0.018103,-0.0228133,50
1429615200857,77,-0.0166623,-0.0277446,-0.0121182,48
1429615200899,77,0.00194059,-0.032501,0.00219321,46
1429615200940,77,-0.0169413,-0.0480918,-0.00347609,44
1429615200981,77,-0.0423018,-0.0504905,-0.0164718,40
1429615201023,77,-0.0973973,-0.0606925,-0.0317616,38
1429615201067,77,-0.102321,-0.0427906,-0.0246468,34
1429615201079,77,-0.0273291,0.00107026,0.00879545,33
1429615201121,77,0.0865485,0.0603769,0.051648,32
1429615201163,77,0.170241,0.105308,0.0794067,30
1429615201204,77,0.172824,0.114326,0.0733563,29
1429615201245,77,0.112317,0.0907035,0.0463279,28
1429615201286,77,0.00246069,0.0390082,0.00538934,26
1429615201328,77,-0.0872875,-0.00797467,-0.0221309,27
1429615201369,77,-0.126741,-0.0364292,-0.0316015,43
1429615201410,77,-0.0982395,-0.0329109,-0.0215848,56
1429615201451,77,-0.0274279,-0.0130051,-0.0104462,63
1429615201492,77,0.0676514,0.0191859,0.00610755,61
1429615201534,76,0.115449,0.0297756,0.0110338,56
1429615201575,76,0.0945251,0.011768,0.00453318,53
1429615201617,76,0.0104257,-0.0339029,-0.0188803,48
1429615201658,76,-0.0642755,-0.0715955,-0.035723,46
1429615201699,76,-0.0590439,-0.0636294,-0.0302083,45
1429615201741,76,-0.0392214,-0.0477432,-0.0234579,43
1429615201782,76,0.0210509,-0.0109498,-0.00573952,39
1429615201826,76,0.0437464,0.010738,0.00573593,36
1429615201837,76,0.0140648,0.00873997,0.00218986,35
1429615201878,76,-0.0685388,-0.0166458,-0.0108838,33
1429615201920,76,-0.144105,-0.0476621,-0.0308528,30
1429615201961,76,-0.16186,-0.0586745,-0.0361494,29
1429615202002,76,-0.103489,-0.0353987,-0.0239882,27
1429615202044,76,-0.00188279,0.00917895,-0.00349423,26
1429615202085,76,0.0883541,0.0583168,0.0161569,24
1429615202127,76,0.143071,0.0867625,0.0308024,23
1429615202173,76,0.151047,0.0924475,0.0386104,21
1429615202185,76,0.125091,0.0770378,0.0409036,23
1429615202229,76,0.0857876,0.0520377,0.0339072,34
1429615202241,76,0.0504407,0.0265824,0.0300796,41
1429615202282,76,0.0217044,0.00617086,0.0233623,61
1429615202323,76,0.00654623,-0.00683258,0.0178538,63
1429615202364,76,0.00388261,-0.00824555,0.0146992,60
1429615202407,76,-0.0299808,-0.0191209,0.00323059,55
1429615202448,76,-0.0781154,-0.0419522,-0.0148798,51
1429615202490,76,-0.152885,-0.0817353,-0.0453107,47
1429615202531,76,-0.142449,-0.0810948,-0.0530512,45
1429615202572,76,-0.0832735,-0.0620686,-0.0459179,44
1429615202614,76,-0.00404067,-0.0298806,-0.0264634,42
1429615202655,76,0.024021,-0.0159663,-0.0146591,39
1429615202696,76,-0.000106342,-0.0191188,-0.00557786,35
1429615202738,76,-0.0653013,-0.0364532,-0.0126943,31
1429615202779,76,-0.113305,-0.0461436,-0.023019,29
1429615202820,76,-0.111455,-0.0308207,-0.0262199,26
1429615202862,76,-0.0395326,0.0148343,-0.00673294,25
1429615202903,76,0.0471642,0.0642471,0.0188242,23
1429615202944,76,0.134846,0.107473,0.0501525,21
1429615202985,76,0.186059,0.124316,0.0714444,18
1429615203027,76,0.189829,0.104665,0.0729688,16
1429615203068,76,0.157635,0.069532,0.0579577,16
1429615203110,76,0.108317,0.0237579,0.0270892,28
1429615203152,76,0.0515049,-0.0118472,-0.00607032,54
1429615203194,76,0.00112076,-0.0296402,-0.0299645,64
1429615203235,76,-0.0575328,-0.0418995,-0.0502785,61
1429615203276,76,-0.117437,-0.0533304,-0.062144,57
1429615203287,76,-0.128244,-0.0559616,-0.059197,54
1429615203329,76,-0.0956176,-0.0434827,-0.0315991,50
1429615203341,76,-0.0179783,-0.0161409,0.00726103,48
1429615203382,76,0.0625571,0.0190027,0.0468734,45
1429615203423,76,0.0856066,0.0385783,0.0589531,44
1429615203464,76,0.0467571,0.0299457,0.0447569,43
1429615203505,76,-0.00736512,0.00276942,0.00957581,40
1429615203547,76,-0.0762681,-0.0399024,-0.0314368,37
1429615203559,76,-0.118274,-0.0758387,-0.0563163,36
1429615203571,76,-0.129745,-0.0864889,-0.0600456,34
1429615203612,76,-0.0936046,-0.0602948,-0.0430495,30
1429615203623,76,-0.0299448,-0.0100442,-0.00771703,29
1429615203665,76,0.0701311,0.0611601,0.0413958,26
1429615203679,76,0.127635,0.0995841,0.0659133,25
1429615203690,76,0.12934,0.0965351,0.0663695,23
1429615203731,76,0.0789157,0.0613231,0.0408182,21
1429615203772,76,0.00825591,0.0124699,0.0094945,18
1429615203814,76,-0.0772044,-0.0410959,-0.0303513,17
1429615203825,76,-0.113071,-0.0636618,-0.0537018,16
1429615203867,76,-0.117367,-0.0679073,-0.0616037,15
1429615203908,76,-0.0567336,-0.0367767,-0.0400658,14
1429615203949,76,0.0402889,0.014916,0.00279249,25
1429615203991,76,0.127005,0.0562954,0.0409652,52
1429615204002,76,0.153146,0.0653957,0.0568136,52
1429615204043,76,0.134316,0.0549434,0.0526093,66
1429615204055,76,0.0878338,0.0304172,0.0326424,65
1429615204096,76,0.0378521,0.00428338,0.00577335,60
1429615204117,76,0.0127083,-0.00718286,-0.0124959,58
1429615204158,76,-0.0408614,-0.0301813,-0.0337202,50
1429615204200,76,-0.0674606,-0.0365479,-0.0361958,46
1429615204243,76,-0.0893436,-0.0431539,-0.035446,44
1429615204284,76,-0.107932,-0.0457851,-0.0373256,44
1429615204325,76,-0.0938277,-0.034793,-0.0312575,42
1429615204367,76,-0.0613405,-0.0162835,-0.0159946,40
1429615204409,76,-0.0466384,-0.00500336,-0.00453601,34
1429615204451,76,-0.0271942,0.00342211,0.0145732,30
1429615204492,76,-0.0227176,0.00741667,0.0245374,25
1429615204537,76,0.00402347,0.01166,0.02766,21
1429615204578,76,0.0132274,0.00871889,0.0152293,19
1429615204619,76,0.0379846,0.0102039,0.00500545,16
1429615204662,76,0.0746592,0.017482,0.00601821,16
1429615204703,76,0.10162,0.0250015,0.0115166,35
1429615204744,76,0.147879,0.0525911,0.0385746,53
1429615204785,76,0.153016,0.0631876,0.0555209,66
1429615204826,76,0.113329,0.0561573,0.0537582,66
1429615204867,77,0.0207268,0.0129794,0.0215677,61
1429615204909,77,-0.0773786,-0.036697,-0.0257294,52
1429615204951,77,-0.151013,-0.0820013,-0.064114,48
1429615204993,77,-0.177178,-0.0895912,-0.0756127,45
1429615205034,77,-0.153347,-0.0715015,-0.0625842,45
1429615205075,77,-0.094689,-0.032109,-0.0300175,44
1429615205116,77,-0.0597224,-0.0147013,-0.0106202,41
1429615205158,77,-0.0527912,-0.0186919,-0.00744122,36
1429615205199,77,-0.0551417,-0.0275161,-0.0121758,32
1429615205241,77,-0.0159598,-0.00869604,-0.00264343,27
1429615205283,77,0.0488262,0.0300423,0.0148568,24
1429615205324,77,0.090027,0.0632431,0.0270301,20
1429615205366,77,0.115653,0.0785581,0.0338328,20
1429615205408,77,0.110342,0.070726,0.0286721,37
1429615205451,77,0.119638,0.0634623,0.0308396,54
1429615205492,77,0.141734,0.0642814,0.0365658,68
1429615205536,78,0.121477,0.0515839,0.0376997,66
1429615205547,78,0.0249384,0.00656019,0.0161814,64
1429615205589,78,-0.0869924,-0.047619,-0.0136697,57
1429615205630,78,-0.175097,-0.0957596,-0.0459067,52
1429615205671,78,-0.205874,-0.123256,-0.0676296,49
1429615205712,78,-0.15725,-0.112055,-0.0675462,47
1429615205753,78,-0.105996,-0.0885867,-0.0580119,47
1429615205794,78,-0.0306818,-0.0456886,-0.0301809,44
1429615205836,78,0.0362459,-0.00475716,0.00764833,41
1429615205877,78,0.115051,0.0498413,0.0496671,36
1429615205918,78,0.161894,0.0905111,0.0754851,33
1429615205960,78,0.150868,0.0948956,0.0703368,28
1429615206001,78,0.0868895,0.0753545,0.046404,26
1429615206042,78,-0.0268024,0.0257397,-0.00363721,25
1429615206083,78,-0.0556924,0.00891144,-0.0237163,35
1429615206124,78,-0.0342326,0.0119316,-0.018205,56
1429615206166,78,0.0403606,0.0322881,0.00612957,65
1429615206209,78,0.134871,0.0587546,0.0466575,64
1429615206252,79,0.133461,0.0370667,0.0471736,60
1429615206263,79,0.071871,-0.00213138,0.0259575,58
1429615206304,79,-0.0698045,-0.0663204,-0.0188251,54
1429615206346,79,-0.214552,-0.126789,-0.0734717,49
1429615206358,79,-0.329987,-0.169512,-0.117797,48
1429615206399,79,-0.330219,-0.150619,-0.123048,47
1429615206441,79,-0.240358,-0.0899659,-0.0887779,45
1429615206482,79,-0.0620128,0.00155091,-0.0210955,43
1429615206523,79,0.151206,0.0934659,0.0566766,39
1429615206566,79,0.3157,0.150235,0.112439,36
1429615206607,79,0.351368,0.146919,0.112161,32
1429615206648,79,0.258997,0.102084,0.0717926,30
1429615206690,79,0.121136,0.0494428,0.0292126,29
1429615206733,79,-0.0223477,0.00777859,-0.00882591,28
1429615206745,79,-0.0961273,-0.011913,-0.0249386,30
1429615206787,79,-0.124318,-0.0208496,-0.0344206,40
1429615206799,79,-0.0910409,-0.0159238,-0.0344711,46
1429615206840,79,-0.0123014,0.00574941,-0.0247278,58
1429615206881,79,0.0838608,0.0340543,7.20258e-05,64
1429615206923,79,0.150534,0.0390756,0.0268037,62
1429615206964,80,0.134555,0.0135609,0.044391,57
1429615206977,80,0.00963346,-0.04709,0.0339497,55
1429615207018,80,-0.116452,-0.0856217,0.0175641,52
1429615207060,80,-0.203815,-0.0966809,0.000798586,48
1429615207101,80,-0.256086,-0.0913051,-0.0321705,47
1429615207143,80,-0.240646,-0.0663483,-0.050674,45
1429615207154,80,-0.175402,-0.0384983,-0.0611758,45
1429615207195,80,-0.0665486,-0.00388261,-0.0454902,41
1429615207236,80,0.0848371,0.042422,-0.00333572,39
1429615207278,80,0.211506,0.0801502,0.0508998,35
1429615207289,80,0.272427,0.0971289,0.084071,35
1429615207331,80,0.243422,0.0872604,0.0796367,32
1429615207372,80,0.0928636,0.0357465,0.0204018,31
1429615207414,80,-0.101161,-0.0356365,-0.0535884,30
1429615207427,80,-0.230287,-0.0886693,-0.104492,29
1429615207468,80,-0.235278,-0.0999281,-0.104856,29
1429615207510,80,-0.0931186,-0.0421392,-0.0498759,39
1429615207522,80,0.061442,0.0228524,0.0155197,39
1429615207564,80,0.207723,0.09589,0.0781509,56
1429615207578,80,0.273539,0.121757,0.0995946,60
1429615207589,80,0.315187,0.128013,0.0998634,60
1429615207631,80,0.237059,0.0729949,0.0556001,62
1429615207643,80,0.105098,0.00272633,-0.00086876,61
1429615207685,80,0.00478564,-0.0353168,-0.0259525,59
1429615207702,80,-0.0773089,-0.0538898,-0.0381741,58
1429615207718,80,-0.184692,-0.0718926,-0.0507892,56
1429615207760,80,-0.29923,-0.109209,-0.0671999,51
1429615207785,80,-0.366944,-0.136121,-0.0793699,49
1429615207826,80,-0.361141,-0.150124,-0.0869669,47
1429615207849,80,-0.264392,-0.127067,-0.0765669,46
1429615207891,80,-0.0953779,-0.0694059,-0.0385751,45
1429615207932,80,0.0722154,0.00729103,0.00962446,41
1429615207949,80,0.172001,0.0781491,0.061447,40
1429615207990,80,0.191463,0.121897,0.108324,37
1429615208033,80,0.143228,0.123556,0.116769,34
1429615208049,80,0.0891929,0.0971095,0.0954996,33
1429615208090,80,0.0522534,0.0671123,0.0502918,31
1429615208117,80,0.0500538,0.0295399,-0.00286485,30
1429615208159,80,0.0465121,0.015926,-0.0428218,29
1429615208186,80,0.102563,0.0569359,-0.0326437,28
1429615208217,80,0.160784,0.129305,0.00772286,27
1429615208258,80,0.177653,0.170635,0.0586023,26
1429615208287,80,0.174686,0.167914,0.0784882,25
1429615208317,80,0.15584,0.114861,0.0829315,23
1429615208358,80,0.0878329,0.00134034,0.0418977,22
1429615208385,80,-0.0310769,-0.131514,-0.0247602,23
1429615208426,80,-0.143029,-0.234376,-0.0961738,33
1429615208468,80,-0.179478,-0.232529,-0.117081,55
1429615208510,80,-0.0955517,-0.0964099,-0.0723993,65
1429615208551,80,-0.000740031,0.0507083,0.00875412,65
1429615208592,80,-0.0367145,0.0622602,0.0374327,62
1429615208634,80,-0.217756,-0.0822304,-0.0319842,58
1429615208675,80,-0.510409,-0.335409,-0.19202,54
1429615208716,80,-0.670046,-0.501832,-0.328041,49
1429615208760,80,-0.554517,-0.471113,-0.336772,47
1429615208805,80,-0.234659,-0.259045,-0.197833,45
1429615208848,80,0.166472,0.0374286,0.00780987,41
1429615208889,80,0.395377,0.244215,0.160451,39
1429615208930,80,0.493935,0.38982,0.263338,35
1429615208972,80,0.402391,0.390534,0.269774,33
1429615209014,80,0.232496,0.28418,0.207718,31
1429615209055,80,0.120528,0.194424,0.148475,30
1429615209097,80,0.214791,0.257771,0.239699,28
1429615209139,80,0.34169,0.339146,0.323756,27
1429615209180,80,0.446238,0.425581,0.390593,25
1429615209221,80,0.404729,0.395595,0.365051,24
1429615209263,80,0.206028,0.259846,0.222125,22
1429615209304,80,-0.0873986,0.0410613,0.00031452,20
1429615209346,80,-0.411695,-0.237117,-0.2587,18
1429615209387,80,-0.585394,-0.454292,-0.440592,21
1429615209428,80,-0.606944,-0.550318,-0.524292,34
1429615209469,80,-0.35343,-0.390085,-0.421766,59
1429615209511,80,-0.131836,-0.221302,-0.304953,67
1429615209553,80,0.065601,0.00294411,-0.132455,66
1429615209595,80,0.0751228,0.0748061,-0.0145403,64
1429615209636,80,0.167965,0.215005,0.180019,59
1429615209677,80,0.227797,0.272401,0.343924,55
1429615209718,80,0.169762,0.206725,0.358081,50
1429615209759,80,0.0611764,0.0542488,0.204429,48
1429615209800,80,0.00776445,-0.0833474,0.00325704,45
1429615209841,80,-0.0769242,-0.188492,-0.188559,43
1429615209882,80,-0.119171,-0.236434,-0.236015,39
1429615209924,80,-0.2036,-0.265815,-0.2018,36
1429615209965,80,-0.217544,-0.237473,-0.0710922,33
1429615210007,80,-0.11453,-0.0792457,0.0983662,32
1429615210050,80,0.0120026,0.0701084,0.194881,30
1429615210092,80,0.200402,0.203116,0.222439,28
1429615210135,80,0.359938,0.239698,0.191874,27
1429615210147,80,0.380038,0.155032,0.0674845,26
1429615210188,80,0.143865,-0.0923278,-0.16786,25
1429615210229,80,-0.0532209,-0.18132,-0.183088,23
1429615210271,80,-0.286448,-0.226534,-0.154135,21
1429615210312,80,-0.350731,-0.0986688,-0.010695,19
1429615210355,80,-0.234534,0.0811481,0.119185,18
1429615210398,80,-0.102062,0.207778,0.116319,36
1429615210410,80,0.0850898,0.278567,0.0297468,36
1429615210452,80,0.238359,0.286547,-0.0570272,60
1429615210494,80,0.318758,0.264338,-0.0693563,67
1429615210535,80,0.338588,0.206921,0.00732256,65
1429615210576,80,0.19941,0.0820962,0.0278443,61
1429615210617,80,0.00868367,-0.0772817,0.0257158,55
1429615210659,80,-0.121949,-0.194265,0.0503736,51
1429615210700,80,-0.161463,-0.247574,0.0586093,48
1429615210742,80,-0.129467,-0.235101,0.0611652,46
1429615210783,80,-0.0917232,-0.199094,0.0148604,43
1429615210825,80,-0.0242277,-0.124047,-0.0424666,41
1429615210866,80,-0.0871549,-0.113876,-0.168326,37
1429615210907,80,-0.239627,-0.156563,-0.320391,34
1429615210948,80,-0.487329,-0.295437,-0.509448,32
1429615210990,80,-0.649394,-0.402029,-0.556938,29
1429615211032,80,-0.443343,-0.257702,-0.296997,27
1429615211045,80,-0.021668,0.031032,0.111108,27
1429615211086,80,0.40303,0.295271,0.406131,25
1429615211129,80,0.660736,0.500913,0.556628,24
1429615211140,80,0.631099,0.49104,0.457218,23
1429615211181,80,0.502832,0.443021,0.341015,22
1429615211227,80,0.32878,0.36813,0.250339,19
1429615211239,80,0.0310414,0.178837,0.0532805,18
1429615211280,80,-0.142845,0.0501418,-0.0238382,17
1429615211322,80,-0.146408,0.0185192,0.0383661,16
1429615211363,80,0.103036,0.115026,0.259934,27
1429615211405,80,0.268617,0.139063,0.403001,54
1429615211446,80,0.387458,0.149081,0.442983,66
1429615211487,80,0.262912,0.0257262,0.20106,65
1429615211528,80,0.0408929,-0.137404,-0.108446,61
1429615211570,80,-0.176464,-0.274313,-0.374261,54
1429615211612,80,-0.428037,-0.422087,-0.61062,50
1429615211654,80,-0.570898,-0.49427,-0.687469,46
1429615211695,80,-0.675448,-0.549749,-0.660683,45
1429615211737,80,-0.589873,-0.485565,-0.486284,43
1429615211749,80,-0.322694,-0.289753,-0.120631,43
1429615211790,80,-0.0344312,-0.0694616,0.21957,39
1429615211832,80,0.227354,0.132026,0.397551,36
1429615211873,80,0.281069,0.195977,0.292173,31
1429615211915,80,0.105614,0.0948811,-0.061632,28
1429615211956,80,-0.0636501,-0.00844507,-0.32924,25
1429615211967,80,-0.131984,-0.0133263,-0.379544,25
1429615212009,80,-0.0324995,0.128674,-0.191399,22
1429615212020,80,0.0699244,0.267145,-0.0266509,21
1429615212062,80,0.21589,0.373685,0.18481,20
1429615212103,80,0.310964,0.396477,0.310552,18
1429615212115,80,0.260135,0.288282,0.355308,18
1429615212157,80,0.259742,0.221006,0.421039,16
1429615212168,80,0.317436,0.228546,0.546036,16
1429615212210,80,0.41633,0.31134,0.591388,14
1429615212252,80,0.419048,0.327409,0.536081,14
1429615212263,80,0.380266,0.28973,0.393979,15
1429615212305,80,0.256934,0.133998,0.145347,37
1429615212346,80,0.0461528,-0.114493,-0.122701,56
1429615212387,80,-0.236077,-0.37098,-0.391028,70
1429615212399,80,-0.472593,-0.568739,-0.591612,70
1429615212440,80,-0.673313,-0.651375,-0.711465,64
1429615212451,80,-0.610368,-0.535059,-0.585789,64
1429615212493,80,-0.472435,-0.364102,-0.432976,56
1429615212517,80,-0.223296,-0.160936,-0.214849,53
1429615212558,80,-0.094857,-0.0788201,-0.107872,46
1429615212586,80,-0.0777924,-0.0516868,-0.0653355,45
1429615212629,80,-0.117087,-0.0603322,-0.0391924,44
1429615212649,80,-0.146666,-0.0227092,0.0265017,43
1429615212690,80,-0.0142808,0.110656,0.216221,40
1429615212731,80,0.20061,0.250747,0.410068,37
1429615212773,80,0.430668,0.360032,0.524731,31
1429615212814,80,0.484929,0.354093,0.431128,27
1429615212855,80,0.322232,0.243114,0.180488,23
1429615212896,80,0.0600714,0.105838,-0.0712201,20
1429615212938,80,-0.185638,-0.0320477,-0.255365,17
1429615212979,80,-0.28909,-0.104234,-0.284488,16
1429615213020,80,-0.258604,-0.116186,-0.245436,14
1429615213062,80,-0.0768363,-0.0694667,-0.149894,13
1429615213104,80,0.166661,0.0226378,-0.0100586,13
1429615213145,80,0.360839,0.121803,0.130667,13
1429615213187,80,0.476647,0.202187,0.275719,30
1429615213228,80,0.488051,0.269056,0.381783,49
1429615213269,80,0.272219,0.185412,0.287495,70
1429615213311,80,0.0127898,0.05325,0.108628,68
1429615213352,80,-0.287471,-0.151384,-0.139447,63
1429615213394,80,-0.482659,-0.283053,-0.314929,52
1429615213442,80,-0.493658,-0.309131,-0.353246,45
1429615213453,80,-0.350109,-0.23018,-0.287126,43
1429615213495,80,-0.257841,-0.204885,-0.247462,42
1429615213537,80,-0.15042,-0.159172,-0.159115,40
1429615213579,80,-0.0424982,-0.0871968,-0.0278225,39
1429615213619,80,0.0660473,-2.34294e-05,0.0823528,36
1429615213662,80,0.0528963,-0.0173083,0.0511226,30
1429615213710,80,0.0870873,-0.0014776,0.0385289,25
1429615213721,80,0.0396012,-0.0258297,-0.0243846,24
1429615213762,80,0.141346,0.0841676,0.13406,21
1429615213803,80,0.223503,0.186913,0.286802,19
1429615213844,80,0.253683,0.244982,0.388908,17
1429615213886,80,0.184578,0.19577,0.316364,17
1429615213927,80,0.121115,0.127812,0.182356,16
1429615213968,80,-0.00472028,0.0378358,-0.0420524,15
1429615214009,80,-0.0132741,0.0679193,-0.149487,23
1429615214050,80,0.105915,0.21137,-0.0884174,40
1429615214092,80,0.281186,0.366651,0.109002,67
1429615214133,80,0.358635,0.389646,0.260933,71
1429615214174,80,0.269584,0.25496,0.278816,63
1429615214216,80,-0.0212194,-0.0496497,0.0529791,56
1429615214257,80,-0.347013,-0.373835,-0.230901,47
1429615214298,80,-0.581839,-0.618115,-0.487114,43
1429615214340,80,-0.645003,-0.682518,-0.603904,41
1429615214382,80,-0.459285,-0.527809,-0.497478,41
1429615214423,80,-0.167335,-0.225326,-0.227196,38
1429615214464,80,0.0849478,0.0532194,0.0118884,35
1429615214505,80,0.201513,0.193564,0.0881587,31
1429615214546,80,0.18299,0.187421,0.00748643,27
1429615214587,80,0.113534,0.0864281,-0.15735,24
1429615214629,80,0.0475693,-0.0130702,-0.262065,21
1429615214670,80,-0.0316683,-0.0873849,-0.294262,20
1429615214711,80,-0.0891368,-0.103012,-0.242254,25
1429615214753,80,-0.115898,-0.0529046,-0.129374,40
1429615214794,80,-0.109305,0.0281806,0.0492793,68
1429615214836,80,-0.000340617,0.179462,0.364421,74
1429615214877,81,0.168691,0.320616,0.746745,68
1429615214918,81,0.324475,0.425589,1.04729,62
1429615214960,81,0.374955,0.401041,1.08184,53
1429615215001,81,0.276843,0.25927,0.851539,49
1429615215043,81,0.146399,0.0870413,0.470575,48
1429615215084,81,-0.0759674,-0.133637,-0.0185854,48
1429615215125,81,-0.263381,-0.303581,-0.422002,44
1429615215170,81,-0.347089,-0.360619,-0.675851,41
1429615215182,81,-0.21595,-0.240394,-0.609671,40
1429615215223,81,0.0326819,-0.0263848,-0.336595,36
1429615215265,81,0.257769,0.152057,-0.0333261,30
1429615215276,81,0.332213,0.192807,0.083292,28
1429615215320,81,0.242695,0.0979073,0.0143167,26
1429615215332,81,0.0705951,-0.0311105,-0.169516,25
1429615215374,81,-0.0932426,-0.11292,-0.314506,29
1429615215416,81,-0.205407,-0.126174,-0.386163,51
1429615215458,81,-0.254187,-0.117535,-0.364042,67
1429615215500,81,-0.279269,-0.110646,-0.271331,70
1429615215511,81,-0.334728,-0.16214,-0.222215,68
1429615215553,82,-0.362169,-0.20428,-0.191188,64
1429615215595,82,-0.322054,-0.218968,-0.161425,56
1429615215607,82,-0.159109,-0.168559,-0.083472,56
1429615215648,82,0.0611198,-0.0500911,0.061182,51
1429615215660,82,0.283946,0.112321,0.267775,50
1429615215701,82,0.404037,0.261797,0.410503,50
1429615215743,82,0.41814,0.348243,0.475898,48
1429615215754,82,0.292878,0.311632,0.388066,48
1429615215795,82,0.128985,0.19258,0.224533,44
1429615215836,82,-0.037386,0.0355713,0.0281594,41
1429615215878,82,-0.114668,-0.093237,-0.1,37
1429615215919,82,-0.0695891,-0.101397,-0.081501,34
1429615215960,82,0.00621668,-0.0564283,-0.023166,30
1429615216002,82,0.0443813,-0.00915485,0.0548396,34
1429615216043,82,0.0696735,0.0539726,0.167332,44
1429615216054,82,0.0348273,0.0696939,0.215919,51
1429615216095,82,0.0230512,0.0773417,0.231107,66
1429615216106,82,0.0149593,0.0592141,0.149827,66
1429615216148,82,0.0556172,0.0656158,0.062938,65
1429615216160,82,0.0330356,0.0246715,-0.0917636,63
1429615216201,83,-0.0746038,-0.0809989,-0.276878,60
1429615216243,83,-0.210295,-0.215081,-0.419705,56
1429615216254,83,-0.318647,-0.313713,-0.463699,54
1429615216295,83,-0.338118,-0.334745,-0.420946,49
1429615216308,83,-0.232681,-0.238758,-0.274727,49
1429615216352,83,-0.103803,-0.0883632,-0.0977868,48
1429615216364,83,0.0850925,0.0953846,0.0983914,48
1429615216405,83,0.175024,0.204074,0.207939,46
1429615216417,83,0.245491,0.288352,0.322703,45
1429615216458,83,0.220985,0.281163,0.332253,42
1429615216486,83,0.175718,0.238438,0.297827,40
1429615216517,83,0.136178,0.178625,0.219575,37
1429615216558,83,0.0908352,0.0934186,0.123152,35
1429615216584,83,0.120857,0.0688228,0.118591,33
1429615216625,83,0.160477,0.0634549,0.13107,32
1429615216650,83,0.231843,0.107334,0.176629,36
1429615216687,83,0.233783,0.108818,0.161322,44
1429615216717,83,0.152126,0.0546399,0.0731818,55
1429615216758,83,-0.02553,-0.052587,-0.0645234,61
1429615216785,83,-0.239995,-0.195468,-0.25469,62
1429615216826,83,-0.409401,-0.326404,-0.443498,60
1429615216849,85,-0.466604,-0.394112,-0.527859,57
1429615216890,85,-0.450705,-0.389057,-0.507697,54
1429615216931,85,-0.36684,-0.313129,-0.381286,49
1429615216973,85,-0.225967,-0.17662,-0.173615,47
1429615217014,85,-0.135064,-0.0696945,-0.0477378,45
1429615217057,85,0.0257779,0.0658146,0.0953877,44
1429615217098,85,0.179838,0.164836,0.157886,40
1429615217139,85,0.374514,0.29262,0.292702,39
1429615217181,85,0.446023,0.328052,0.343227,35
1429615217223,85,0.358016,0.24209,0.293548,34
1429615217266,85,0.160091,0.0753639,0.175222,32
1429615217307,85,-0.0527848,-0.0972318,0.022386,31
1429615217348,85,-0.183527,-0.172788,-0.0752541,32
1429615217389,85,-0.106297,-0.0603122,-0.00223357,40
1429615217430,85,0.0736447,0.115412,0.116957,54
1429615217472,85,0.260656,0.293284,0.237522,60
1429615217513,85,0.3044,0.335025,0.270707,60
1429615217554,85,0.226895,0.276557,0.217455,58
1429615217595,85,0.0564791,0.127688,0.102662,53
1429615217637,85,-0.142706,-0.0667467,-0.0573221,50
1429615217678,85,-0.304654,-0.249526,-0.225588,47
1429615217719,85,-0.386603,-0.374362,-0.339724,45
1429615217760,85,-0.363781,-0.382419,-0.368348,44
1429615217801,85,-0.314762,-0.346734,-0.364163,41
1429615217843,85,-0.212251,-0.255534,-0.305063,39
1429615217884,85,-0.156242,-0.201029,-0.279999,36
1429615217926,85,-0.0446405,-0.0914318,-0.169323,35
1429615217967,85,0.0725372,0.0210651,-0.0193191,33
1429615218008,85,0.205619,0.173313,0.178333,33
1429615218050,85,0.273159,0.289491,0.324663,30
1429615218153,85,0.278117,0.331011,0.374421,29
1429615218194,85,0.202176,0.272873,0.301818,39
1429615218263,85,0.0578627,0.131174,0.118378,43
1429615218305,85,-0.0284986,0.000273376,-0.0290863,62
1429615218402,85,-0.0455626,-0.0428312,-0.0935578,32
1429615218899,85,0.105955,0.0531076,0.019138,32
1429615218949,85,0.275964,0.185915,0.194527,31
1429615218990,85,0.38067,0.265277,0.325331,30
1429615219031,85,0.32452,0.205422,0.315371,28
1429615219073,85,0.109868,0.0382657,0.136073,27
1429615219114,85,-0.234599,-0.226775,-0.193383,27
1429615219157,85,-0.452587,-0.377507,-0.404326,26
1429615219198,85,-0.522564,-0.40581,-0.47763,25
1429615219239,85,-0.317544,-0.225013,-0.275407,27
1429615219281,85,-0.0110393,0.0237972,0.00988458,37
1429615219322,85,0.230621,0.204855,0.223971,56
1429615219363,85,0.319074,0.289205,0.297745,64
1429615219404,85,0.207811,0.21985,0.176308,64
1429615219446,85,-0.00946181,0.0747461,-0.0457215,62
1429615219488,85,-0.208874,-0.091126,-0.225732,57
1429615219529,85,-0.284354,-0.204239,-0.293701,54
1429615219570,85,-0.229241,-0.23407,-0.21527,49
1429615219613,85,-0.178671,-0.27088,-0.15119,47
1429615219625,85,-0.137677,-0.275889,-0.0947684,47
1429615219666,85,-0.131165,-0.260095,-0.0507015,45
1429615219707,85,-0.111921,-0.17623,-0.0137883,41
1429615219749,85,-0.00367459,-0.00392784,0.0979974,39
1429615219791,85,0.149095,0.198292,0.247714,36
1429615219832,85,0.292056,0.333374,0.34841,35
1429615219873,85,0.318927,0.338358,0.348003,33
1429615219915,85,0.242223,0.235419,0.212928,32
1429615219956,85,0.0698113,0.0712762,-0.0257935,31
1429615219997,85,-0.0893552,-0.0449683,-0.232447,30
1429615220038,85,-0.143207,-0.0681718,-0.309177,28
1429615220081,85,0.031941,0.0909243,-0.13133,28
1429615220122,85,0.203376,0.214721,0.0517487,26
1429615220164,85,0.347943,0.298124,0.207129,26
1429615220205,85,0.330467,0.227183,0.201104,24
1429615220246,85,0.181866,0.101999,0.130492,25
1429615220288,85,-0.0618087,-0.0644809,0.0207367,39
1429615220329,85,-0.265511,-0.187759,-0.0739121,51
1429615220370,85,-0.375501,-0.255224,-0.156528,62
1429615220411,85,-0.318377,-0.210944,-0.165592,62
1429615220453,85,-0.164558,-0.108802,-0.0974777,59
1429615220494,85,0.0323819,0.0196052,0.0291076,56
1429615220538,85,0.180845,0.112365,0.150469,50
1429615220549,85,0.154835,0.0618134,0.143089,50
1429615220591,85,0.0220111,-0.0747855,0.025423,46
1429615220633,85,-0.224936,-0.268796,-0.210944,45
1429615220674,85,-0.400044,-0.402213,-0.388582,43
1429615220716,85,-0.407686,-0.372776,-0.40513,40
1429615220728,85,-0.214058,-0.168057,-0.233264,40
1429615220769,85,0.0558162,0.0910385,0.0353051,36
1429615220811,85,0.270303,0.283632,0.294207,34
1429615220851,85,0.351283,0.340701,0.418257,32
1429615220893,85,0.260404,0.214885,0.337965,31
1429615220934,85,0.0215282,-0.00823661,0.0864988,30
1429615220975,85,-0.11714,-0.151625,-0.108884,28
1429615220986,85,-0.0886324,-0.110644,-0.13526,28
1429615221027,85,0.0594251,0.0526748,-0.0414752,27
1429615221039,85,0.21047,0.240772,0.111957,27
1429615221080,85,0.328301,0.376191,0.236523,26
1429615221121,85,0.311968,0.366694,0.243219,24
1429615221162,85,0.180057,0.185651,0.127696,23
1429615221204,85,-0.0159391,-0.0337076,-0.043717,22
1429615221245,85,-0.190564,-0.208019,-0.171785,23
1429615221256,85,-0.338941,-0.334329,-0.26963,27
1429615221297,85,-0.30206,-0.272899,-0.21962,40
1429615221339,85,-0.181508,-0.118985,-0.107722,59
1429615221380,85,0.0162873,0.110438,0.0594748,62
1429615221421,85,0.151275,0.240347,0.147882,59
1429615221463,85,0.140128,0.194487,0.0978371,56
1429615221504,85,0.0810473,0.055645,-0.011304,51
1429615221546,85,0.0100457,-0.101166,-0.105727,47
1429615221587,85,-0.0342385,-0.186912,-0.126072,45
1429615221628,85,-0.0825002,-0.219385,-0.0757165,44
1429615221669,85,-0.0511445,-0.174227,0.0250912,42
1429615221712,85,-0.0923737,-0.172191,0.0402575,40
1429615221753,85,-0.112914,-0.15623,0.00579703,36
1429615221795,85,-0.14009,-0.157327,-0.0701191,34
1429615221836,85,-0.0978125,-0.096155,-0.101332,32
1429615221878,85,-0.0812876,-0.0155774,-0.0957938,30
1429615221919,85,-0.0520248,0.0771585,-0.049726,29
1429615221960,85,-0.0765631,0.1238,-0.0310632,28
1429615222001,85,-0.094538,0.129412,-0.0155108,27
1429615222043,85,-0.0994761,0.0788604,-0.0129623,26
1429615222084,85,-0.0573031,0.0176176,-0.0189058,25
1429615222125,85,0.0440548,0.0340063,0.030079,24
1429615222167,85,0.312194,0.183534,0.210717,22
1429615222208,85,0.477124,0.31441,0.333791,22
1429615222249,85,0.654517,0.465541,0.490048,33
1429615222290,85,0.689657,0.499214,0.521729,54
1429615222331,85,0.511942,0.352252,0.353924,62
1429615222373,85,0.282241,0.168715,0.141786,60
1429615222414,85,0.0170807,-0.0271555,-0.0890036,56
1429615222455,85,-0.168413,-0.158695,-0.23507,50
1429615222496,85,-0.29761,-0.240601,-0.302976,46
1429615222539,85,-0.430365,-0.333145,-0.35885,43
1429615222581,85,-0.620476,-0.461487,-0.444187,43
1429615222622,85,-0.754332,-0.560676,-0.490257,41
1429615222664,85,-0.811886,-0.59818,-0.508047,39
1429615222705,85,-0.709307,-0.538459,-0.437099,34
1429615222746,85,-0.476447,-0.384999,-0.295381,31
1429615222787,85,-0.125783,-0.145897,-0.0692436,29
1429615222829,85,0.242633,0.131838,0.196608,26
1429615222870,85,0.483649,0.329817,0.36323,25
1429615222911,85,0.575528,0.432878,0.436854,23
1429615222952,85,0.556292,0.482659,0.448136,22
1429615222994,85,0.404548,0.427075,0.345775,21
1429615223034,85,0.212929,0.316192,0.202474,19
1429615223076,85,0.121404,0.239261,0.112737,17
1429615223117,85,0.111873,0.162475,0.061195,16
1429615223159,85,0.191874,0.119351,0.0806636,19
1429615223200,85,0.216206,0.0328516,0.0759626,35
1429615223242,85,0.213047,-0.00800421,0.0772054,60
1429615223283,85,0.179527,-0.0185266,0.0532168,65
1429615223325,83,0.0692256,-0.0315301,-0.00484124,59
1429615223366,83,-0.0234789,-0.0221999,-0.0437462,54
1429615223407,83,-0.0431164,-0.00432815,-0.0545393,46
1429615223449,83,0.0269623,0.0557042,0.012683,43
1429615223490,83,-0.0300065,0.0169116,0.00205375,42
1429615223531,83,-0.186399,-0.0832222,-0.0650168,43
1429615223573,83,-0.389683,-0.205914,-0.187884,42
1429615223614,83,-0.562428,-0.354578,-0.35983,39
