1429009289027,120,-0.365946,-0.303995,-0.362895,56
1429009289038,120,-0.353074,-0.302641,-0.304398,47
1429009289081,120,-0.335204,-0.307012,-0.263237,42
1429009289092,120,-0.293966,-0.273213,-0.165685,38
1429009289134,120,-0.236004,-0.223988,-0.0851714,23
1429009289146,120,-0.110064,-0.105736,0.0363883,19
1429009289187,120,-0.00257546,0.00822742,0.123225,14
1429009289210,120,0.14748,0.14993,0.231359,54
1429009289252,120,0.180587,0.186874,0.216938,83
1429009289278,120,0.198846,0.218374,0.202266,54
1429009289319,120,0.173266,0.207729,0.16014,46
1429009289342,120,0.193821,0.222256,0.173657,40
1429009289384,120,0.187327,0.177988,0.133639,25
1429009289411,120,0.188799,0.128873,0.0884626,17
1429009289446,120,0.148194,0.0565939,0.00194414,13
1429009289479,120,0.0657648,-0.0211793,-0.0975102,68
1429009289511,120,-0.0564606,-0.115957,-0.214937,90
1429009289543,120,-0.220831,-0.224989,-0.317825,54
1429009289579,120,-0.346588,-0.291144,-0.358391,47
1429009289611,120,-0.363781,-0.278141,-0.311294,41
1429009289646,120,-0.308295,-0.217901,-0.226214,28
1429009289679,120,-0.183064,-0.121236,-0.0877703,17
1429009289711,120,-0.029748,-0.00572009,0.0690978,14
1429009289743,120,0.0373635,0.0469389,0.158708,69
1429009289779,120,0.0720619,0.0769359,0.181214,91
1429009289811,120,0.118414,0.114616,0.197707,58
1429009289846,120,0.213832,0.184919,0.243044,47
1429009289878,120,0.240639,0.196872,0.238654,41
1429009289911,120,0.226299,0.177613,0.220729,30
1429009289943,120,0.0911888,0.0592437,0.0933489,18
1429009289979,120,-0.0689389,-0.0603496,-0.058544,11
1429009290013,120,-0.179488,-0.138362,-0.164704,47
1429009290046,120,-0.145295,-0.104924,-0.159416,90
1429009290079,120,-0.00620974,0.00136155,-0.0608308,55
1429009290111,120,0.163741,0.124014,0.0859016,43
1429009290143,120,0.254245,0.170179,0.153464,44
1429009290179,120,0.218781,0.124542,0.1089,33
1429009290211,120,0.0688011,-0.00025734,-0.0401024,20
1429009290246,120,-0.0697283,-0.100202,-0.151639,12
1429009290278,120,-0.160117,-0.16098,-0.204673,49
1429009290311,120,-0.221791,-0.200233,-0.221317,81
1429009290344,120,-0.192872,-0.166114,-0.158289,44
1429009290378,120,-0.142458,-0.1036,-0.0749608,36
1429009290411,120,-0.111666,-0.0546027,-0.0182071,33
1429009290447,120,-0.0792229,-0.00630896,0.0320647,19
1429009290479,120,-0.0534668,0.0224563,0.050479,8
1429009290518,120,0.000322683,0.0498497,0.047909,40
1429009290545,120,0.0210726,0.0430213,0.00895692,89
1429009290578,120,0.0197425,0.0329684,-0.016462,62
1429009290610,120,0.0268464,0.0186436,-0.025501,40
1429009290651,120,0.0565021,0.040956,0.0150456,40
1429009290678,120,0.1285,0.101378,0.103727,30
1429009290712,120,0.168702,0.139479,0.155903,19
1429009290746,120,0.140663,0.118888,0.150615,17
1429009290778,120,0.0715537,0.0518598,0.092783,83
1429009290813,119,0.0328177,-0.00314937,0.0547414,85
1429009290846,119,0.0514688,-0.0187563,0.0387357,48
1429009290880,119,0.101609,0.00323985,0.041825,47
1429009290913,119,0.128648,0.0354237,0.0545921,39
1429009290945,119,0.065602,0.0155677,0.0241138,28
1429009290980,119,-0.0441117,-0.0402532,-0.0455999,15
1429009291013,119,-0.237304,-0.159716,-0.164628,43
1429009291046,119,-0.385862,-0.254908,-0.246633,92
1429009291081,117,-0.464304,-0.294625,-0.270277,70
1429009291113,117,-0.321689,-0.181782,-0.147295,48
1429009291145,117,-0.115313,-0.0254037,-0.00907465,47
1429009291180,117,0.146474,0.156494,0.144829,39
1429009291213,117,0.318245,0.260538,0.204041,24
1429009291246,117,0.391869,0.292933,0.191859,14
1429009291287,117,0.340408,0.239958,0.114949,74
1429009291329,116,0.288236,0.199611,0.0985884,70
1429009291370,116,0.144987,0.0906183,0.0457051,41
1429009291411,116,0.0493146,0.0148653,0.0437591,39
1429009291452,116,-0.0204172,-0.0472301,0.0279045,23
1429009291493,116,-0.118279,-0.134972,-0.0584808,13
1429009291535,116,-0.164223,-0.183921,-0.135155,71
1429009291575,115,-0.154751,-0.183466,-0.170368,86
1429009291617,115,-0.135907,-0.158958,-0.154307,45
1429009291658,115,-0.098503,-0.0927346,-0.0776135,43
1429009291699,115,-0.0889968,-0.031352,-0.00461655,29
1429009291740,115,-0.0524832,0.0416371,0.0742471,15
1429009291785,115,-0.0323264,0.0666146,0.0824206,75
1429009291797,115,-0.0263024,0.0527787,0.0424796,94
1429009291838,114,-0.000598463,0.0418162,0.0103914,61
1429009291880,114,0.00251441,0.00697646,-0.0449908,46
1429009291921,114,0.0310331,0.000155406,-0.0583537,38
1429009291962,114,0.0438343,-0.00881746,-0.0435982,21
1429009292003,114,0.0347601,-0.00999215,-0.00885672,17
1429009292045,114,-0.0246892,-0.0408722,-0.0177071,89
1429009292086,114,-0.0569219,-0.0427095,-0.0132903,61
1429009292127,114,-0.0324545,-0.0191858,-0.00854615,44
1429009292168,114,-0.0118306,-0.0111597,-0.0184821,40
1429009292209,114,-0.0358966,-0.0393799,-0.0664943,25
1429009292253,114,-0.0453734,-0.0428342,-0.0576163,13
1429009292265,114,-0.0436697,-0.0293983,-0.0185783,27
1429009292306,114,0.0267831,0.0368889,0.0768851,86
1429009292347,106,0.132,0.125033,0.178894,48
1429009292388,106,0.209231,0.178805,0.245506,42
1429009292429,106,0.229126,0.195637,0.270043,32
1429009292470,106,0.183902,0.161895,0.208016,17
1429009292515,106,0.0963014,0.0837795,0.100213,19
1429009292527,106,0.0221938,0.0266055,0.00667894,42
1429009292568,99,-0.0272794,-0.01393,-0.0728384,81
1429009292610,99,-0.0796684,-0.0649005,-0.164841,40
1429009292651,99,-0.0937687,-0.0868521,-0.205396,40
1429009292692,99,-0.103349,-0.10967,-0.203034,27
1429009292735,99,-0.113879,-0.112239,-0.148599,13
1429009292746,99,-0.141912,-0.127871,-0.104947,9
1429009292787,99,-0.135725,-0.106542,-0.0561553,78
1429009292828,98,-0.14059,-0.104629,-0.0614963,80
1429009292869,98,-0.0955079,-0.0602209,-0.0385198,29
1429009292911,98,-0.0411112,-0.0218742,-0.0340325,39
1429009292922,98,0.0214957,0.0208368,0.0104958,45
1429009292964,98,0.0581088,0.0240996,0.027645,41
1429009292975,98,0.0709246,0.0200817,0.0543357,29
1429009293016,98,0.0809096,0.0172158,0.0567896,7
1429009293029,98,0.0783565,0.0258359,0.0531419,28
1429009293070,98,0.00765836,-0.00335536,-0.00377831,77
1429009293082,98,-0.0863352,-0.0385584,-0.0634177,54
1429009293122,98,-0.14393,-0.0574744,-0.0730625,74
1429009293134,98,-0.144154,-0.053144,-0.0522007,85
1429009293175,98,-0.0181007,0.0238607,0.0392104,92
1429009293186,98,0.0874484,0.0715236,0.105704,93
1429009293228,98,0.219998,0.150482,0.205763,126
1429009293248,98,0.226807,0.148817,0.208209,127
1429009293279,98,0.194065,0.134981,0.184938,124
1429009293311,98,0.138334,0.088404,0.114232,127
1429009293342,98,0.120943,0.0742239,0.0560222,88
1429009293378,98,0.0913632,0.0475415,-0.00414512,37
1429009293411,98,0.0688363,0.0339035,-0.0446948,18
1429009293448,98,-0.0211352,-0.00479699,-0.0850031,9
1429009293479,98,-0.0886052,-0.0376125,-0.103441,10
1429009293511,98,-0.135927,-0.0587064,-0.100265,4
1429009293542,98,-0.189914,-0.0996395,-0.124697,15
1429009293579,98,-0.187081,-0.111996,-0.107871,41
1429009293611,98,-0.185096,-0.127363,-0.0989888,30
1429009293647,98,-0.169017,-0.121831,-0.0739753,23
1429009293678,98,-0.172471,-0.125952,-0.0793213,25
1429009293711,98,-0.16594,-0.135414,-0.109449,21
1429009293742,98,-0.167682,-0.166355,-0.17454,17
1429009293779,98,-0.10234,-0.146411,-0.162845,23
1429009293811,98,0.0361499,-0.0529511,-0.0535044,49
1429009293846,98,0.15949,0.0653095,0.0831024,40
1429009293878,98,0.2429,0.16376,0.209746,30
1429009293911,98,0.292925,0.238975,0.289422,38
1429009293942,98,0.315643,0.252003,0.304698,32
1429009293979,98,0.319754,0.272731,0.300951,24
1429009294014,98,0.242025,0.220612,0.226677,35
1429009294046,98,0.0473865,0.0811723,0.0638719,70
1429009294087,98,-0.179829,-0.088925,-0.128781,54
1429009294111,98,-0.305552,-0.198002,-0.270037,46
1429009294142,98,-0.312713,-0.2208,-0.302734,44
1429009294178,98,-0.220814,-0.165372,-0.237126,37
1429009294211,98,-0.112408,-0.0943927,-0.131834,31
1429009294246,98,0.00447583,-0.0259024,-0.0259428,40
1429009294278,98,0.0690245,-0.00484309,0.022356,68
1429009294311,98,0.135697,0.0412368,0.0578644,59
1429009294344,98,0.117431,0.0530814,0.0353228,44
1429009294379,98,0.0685066,0.0530259,0.0168996,41
1429009294411,98,-0.0182462,0.0254409,0.00918147,37
1429009294446,98,-0.0871877,0.00297814,0.0393007,29
1429009294479,98,-0.0903973,-0.00703183,0.0784652,37
1429009294510,98,-0.0448487,-0.0185812,0.0898923,63
1429009294545,98,0.00270087,-0.0348855,0.0404594,50
1429009294579,98,0.0372509,-0.0403799,-0.00054226,41
1429009294610,98,0.0610958,-0.0335728,-0.0253256,40
1429009294647,98,0.0250528,-0.0435035,-0.0335389,33
1429009294679,98,0.0411521,-0.00203966,0.0269195,29
1429009294711,98,0.0983306,0.0692891,0.118182,52
1429009294746,98,0.172506,0.14961,0.185346,63
1429009294779,98,0.235299,0.217626,0.197405,44
1429009294812,98,0.226772,0.221934,0.120393,41
1429009294846,98,0.134744,0.145201,-0.0336945,39
1429009294878,98,-0.0493782,-0.0126918,-0.219442,32
1429009294913,98,-0.187338,-0.135263,-0.294466,39
1429009294945,98,-0.292038,-0.229796,-0.297708,65
1429009294978,98,-0.220711,-0.174022,-0.148112,53
1429009295013,98,-0.0816405,-0.0549904,0.0399246,43
1429009295047,98,-0.0120151,0.0267335,0.16129,42
1429009295080,98,-0.0512371,0.0157325,0.145171,36
1429009295113,98,-0.123735,-0.0233436,0.0506411,33
1429009295145,98,-0.179416,-0.080269,-0.0695448,53
1429009295180,98,-0.0870648,-0.0402053,-0.076141,58
1429009295213,98,0.0572752,0.028885,-0.0218875,42
1429009295246,98,0.224838,0.125015,0.0786411,42
1429009295281,98,0.277246,0.149126,0.119399,37
1429009295313,98,0.2054,0.0985567,0.0910581,31
1429009295345,98,0.0245434,-0.029909,-0.00914295,40
1429009295381,98,-0.119417,-0.121954,-0.0908847,65
1429009295413,98,-0.17656,-0.141527,-0.0824748,52
1429009295446,98,-0.0890184,-0.049679,0.0216693,44
1429009295487,98,0.0457216,0.0596325,0.150429,39
1429009295528,98,0.177186,0.155509,0.240992,31
1429009295569,98,0.190367,0.14241,0.200026,56
1429009295610,98,0.123189,0.0769418,0.0799539,51
1429009295654,98,0.00887868,-0.0239984,-0.095828,40
1429009295666,98,-0.120218,-0.12469,-0.253488,40
1429009295707,98,-0.233516,-0.195897,-0.342587,36
1429009295752,98,-0.269681,-0.204932,-0.321506,34
1429009295763,98,-0.1816,-0.118967,-0.186574,44
1429009295804,98,-0.120732,-0.059305,-0.0499013,62
1429009295846,98,-0.0041645,0.0233516,0.0933451,43
1429009295891,98,0.0605349,0.055615,0.151901,41
1429009295902,98,0.126558,0.0970142,0.181182,39
1429009295943,98,0.171871,0.13251,0.176616,31
1429009295985,98,0.133986,0.116217,0.119423,56
1429009296026,98,0.0906575,0.0900833,0.0626196,62
1429009296067,98,0.0443473,0.0529248,0.0231687,46
1429009296114,98,0.050984,0.0371349,0.0349751,42
1429009296127,98,0.0403702,0.0250636,0.0480374,38
1429009296169,98,0.0511477,0.0291587,0.0670868,29
1429009296211,98,0.0623595,0.0318062,0.0514842,51
1429009296252,98,0.0634587,0.0273585,0.0078511,65
1429009296293,98,0.0169009,-0.00443294,-0.0721764,45
1429009296334,98,-0.00715678,-0.0110626,-0.104244,43
1429009296375,98,-0.0766873,-0.0410318,-0.113064,35
1429009296416,98,-0.107902,-0.04557,-0.0651491,27
1429009296457,98,-0.151555,-0.0877918,-0.0547113,33
1429009296498,98,-0.222525,-0.155881,-0.103006,64
1429009296540,98,-0.185074,-0.1495,-0.0986633,45
1429009296581,98,-0.14494,-0.131851,-0.103184,41
1429009296622,98,-0.0793097,-0.0872207,-0.0798525,35
1429009296663,98,0.00191266,-0.0089737,-0.0270929,27
1429009296704,98,0.118474,0.104435,0.068038,31
1429009296746,98,0.146568,0.152059,0.113568,63
1429009296788,98,0.192888,0.201225,0.185466,43
1429009296830,98,0.113457,0.132099,0.145539,39
1429009296871,98,0.083855,0.0766376,0.121644,32
1429009296912,98,0.0226036,-0.0182233,0.0395582,25
1429009296953,98,-0.0259987,-0.106732,-0.0486881,23
1429009296995,98,-0.00522612,-0.117197,-0.0619002,62
1429009297036,98,0.0477199,-0.0576949,-0.0101658,56
1429009297077,98,0.0597393,-0.00205875,0.0365082,41
1429009297118,98,0.0786011,0.0661831,0.0862536,40
1429009297160,98,0.000328952,0.0280579,0.028584,29
1429009297202,98,-0.0680524,-0.0277154,-0.0586723,23
1429009297243,98,-0.116042,-0.0741869,-0.139036,57
1429009297289,98,-0.17885,-0.118235,-0.209515,52
1429009297300,98,-0.15456,-0.0913689,-0.182135,44
1429009297341,98,-0.0985411,-0.0239531,-0.0919218,40
1429009297382,98,0.0253627,0.0910242,0.0648397,33
1429009297423,98,0.0902917,0.147243,0.151867,25
1429009297464,98,0.139713,0.161799,0.183404,31
1429009297506,98,0.114268,0.101234,0.124038,60
1429009297548,98,0.0589006,0.0179994,0.0359556,40
1429009297559,98,0.0262428,-0.0184731,-0.0231452,36
1429009297600,98,-0.00193544,-0.0230383,-0.0262602,36
1429009297642,98,0.0568825,0.0464438,0.0576786,28
1429009297684,98,0.0344108,0.0361223,0.0777754,25
1429009297697,98,0.0332053,0.0226038,0.0940296,40
1429009297738,99,-0.0359754,-0.0692422,-0.000628433,60
1429009297779,99,-0.0729998,-0.129752,-0.0725117,40
1429009297790,99,-0.140573,-0.195253,-0.156902,38
1429009297831,99,-0.241737,-0.263769,-0.258425,35
1429009297873,99,-0.253709,-0.23932,-0.253935,27
1429009297888,99,-0.162538,-0.139382,-0.176391,23
1429009297900,99,0.0201123,0.0224094,-0.0264219,30
1429009297941,99,0.239963,0.226176,0.149743,65
1429009297982,100,0.329989,0.315251,0.221356,46
1429009297994,100,0.315153,0.3238,0.216169,42
1429009298036,100,0.15044,0.205971,0.122268,40
1429009298077,100,-0.00769624,0.0680628,0.0219525,32
1429009298088,100,-0.168852,-0.0927097,-0.0827713,29
1429009298129,100,-0.217101,-0.169264,-0.109053,41
1429009298147,100,-0.210704,-0.193494,-0.100414,62
1429009298188,101,-0.150832,-0.166264,-0.0796266,52
1429009298210,101,-0.0726238,-0.116996,-0.0319581,40
1429009298251,101,0.00785622,-0.0603433,0.0202209,38
1429009298278,101,0.0603456,-0.00407398,0.0705232,32
1429009298319,101,0.130672,0.088477,0.16072,24
1429009298346,101,0.174955,0.165476,0.215319,36
1429009298387,103,0.240717,0.235744,0.271675,60
1429009298411,103,0.235975,0.223216,0.232278,46
1429009298452,103,0.164526,0.121036,0.101363,37
1429009298478,103,0.0263914,-0.0217405,-0.0952068,35
1429009298520,103,-0.0989766,-0.125379,-0.248109,27
1429009298546,103,-0.153801,-0.138369,-0.300895,23
1429009298587,103,-0.0803292,-0.00374959,-0.165873,44
1429009298611,103,-0.00849959,0.114763,-0.00770303,58
1429009298652,104,0.0575519,0.198989,0.133197,40
1429009298679,104,-0.0108011,0.111787,0.100297,37
1429009298720,104,-0.123971,-0.0485242,-0.0351932,34
1429009298746,104,-0.246902,-0.211735,-0.218642,29
1429009298779,104,-0.249426,-0.263547,-0.297103,24
1429009298811,104,-0.148401,-0.195198,-0.243676,39
1429009298846,104,-0.0038285,-0.0797827,-0.0611742,54
1429009298878,104,0.050442,-0.0283992,0.0814893,39
1429009298910,104,0.0390387,-0.0470394,0.147032,37
1429009298946,104,0.0208247,-0.0734665,0.153467,34
1429009298979,104,0.0980471,-0.0158066,0.22465,30
1429009299010,104,0.163954,0.0235466,0.221643,25
1429009299047,104,0.210053,0.0577968,0.181347,49
1429009299078,105,0.157389,0.0611272,0.0647213,57
1429009299110,105,0.0840705,0.0813675,-0.0567426,39
1429009299146,105,-0.093035,0.0372446,-0.224189,38
1429009299178,105,-0.192397,0.00983887,-0.256381,35
1429009299210,105,-0.203488,-0.00372316,-0.188862,29
1429009299246,105,-0.126393,0.0225986,-0.0489713,27
1429009299278,105,-0.00522588,0.0714894,0.094972,53
1429009299312,106,0.0934604,0.12027,0.159566,58
1429009299346,106,0.124138,0.123168,0.156275,41
1429009299378,106,0.0892447,0.0849189,0.0859428,40
1429009299410,106,0.0605716,0.0542419,0.0435691,36
1429009299446,106,0.0548185,0.0152358,0.00483011,29
1429009299478,106,0.0236097,-0.052269,-0.0762677,26
1429009299513,106,-0.0265933,-0.131834,-0.186664,51
1429009299546,106,-0.0472788,-0.14198,-0.212555,59
1429009299578,106,-0.102559,-0.142964,-0.196292,42
1429009299612,106,-0.159673,-0.136437,-0.140831,40
1429009299646,106,-0.164553,-0.108435,-0.045671,35
1429009299687,106,-0.17241,-0.100213,-0.0148753,27
1429009299729,106,-0.10194,-0.0635422,0.0425544,27
1429009299771,106,0.0178858,0.00218435,0.129583,59
1429009299812,105,0.171619,0.10375,0.24704,44
1429009299854,105,0.289671,0.211709,0.349145,39
1429009299895,105,0.351412,0.308896,0.415787,35
1429009299936,105,0.251916,0.261141,0.297673,28
1429009299978,105,0.0968961,0.14041,0.0934731,26
1429009300019,105,-0.0637124,-0.0326393,-0.127902,54
1429009300060,105,-0.0936739,-0.0931661,-0.208647,40
1429009300102,105,-0.00409898,-0.00667913,-0.104422,36
1429009300143,105,0.0767028,0.0900018,0.000503035,32
1429009300185,105,0.119286,0.173378,0.084902,25
1429009300226,105,-0.0293137,0.0208845,-0.113265,27
1429009300268,105,-0.208684,-0.159843,-0.295832,56
1429009300309,104,-0.327735,-0.303603,-0.365319,43
1429009300350,104,-0.262801,-0.265655,-0.190418,36
1429009300391,104,-0.171232,-0.195462,-0.00139107,33
1429009300432,104,-0.0122154,-0.0486617,0.181474,27
1429009300478,104,0.0167418,-0.0131502,0.110744,33
1429009300489,104,0.0122634,-0.00534326,-0.0102321,44
1429009300531,103,0.0173253,0.00356054,-0.095304,50
1429009300574,103,0.0125717,0.00968636,-0.0782175,35
1429009300587,103,0.0426632,0.0492471,0.0104943,35
1429009300628,103,0.0811976,0.107535,0.134028,30
1429009300669,103,0.0942311,0.137803,0.182423,24
1429009300710,103,0.0459592,0.0963633,0.112132,25
1429009300753,103,-0.02964,0.0101606,-0.0340087,50
1429009300798,103,-0.0718396,-0.0602706,-0.155099,32
1429009300810,103,-0.0592988,-0.0834009,-0.206081,28
1429009300851,103,0.00192028,-0.0539866,-0.158296,28
1429009300893,103,0.0518952,-0.0226047,-0.0792378,16
1429009300934,103,0.0981489,0.0338137,0.0435959,6
1429009300975,103,0.0938444,0.0597954,0.123306,40
1429009301016,103,0.0832869,0.101879,0.16376,41
1429009301057,103,0.060608,0.107258,0.166257,25
1429009301099,103,0.0500224,0.086321,0.182266,24
1429009301140,103,0.0890005,0.052595,0.21835,15
1429009301182,103,0.156076,0.0305254,0.241957,10
1429009301223,103,0.142499,-0.0308033,0.142033,54
1429009301264,103,-0.0211687,-0.143741,-0.0604355,38
1429009301305,103,-0.211288,-0.229079,-0.250446,29
1429009301346,103,-0.343433,-0.243785,-0.359928,25
1429009301387,103,-0.362976,-0.193795,-0.361092,15
1429009301429,103,-0.303658,-0.122315,-0.296236,15
1429009301470,103,-0.235514,-0.0802779,-0.254552,65
1429009301512,102,-0.131032,-0.0324273,-0.173742,46
1429009301554,102,0.0740437,0.103382,-0.000215759,36
1429009301566,102,0.27373,0.245509,0.186025,35
1429009301607,102,0.386976,0.349977,0.312878,25
1429009301618,102,0.356489,0.342725,0.330235,22
1429009301659,102,0.201744,0.222569,0.260646,15
1429009301701,102,0.0404606,0.067919,0.18411,63
1429009301742,102,-0.084049,-0.0934772,0.119207,59
1429009301784,102,-0.0908806,-0.168346,0.128347,41
1429009301826,102,-0.00587007,-0.153969,0.118469,36
1429009301837,102,0.128825,-0.0382316,0.119132,32
1429009301878,102,0.142361,0.0154611,-0.00904693,20
1429009301919,102,0.10581,0.0444051,-0.157266,13
1429009301961,102,-0.0835154,-0.0715574,-0.38963,45
1429009302002,102,-0.211416,-0.147185,-0.48087,66
1429009302014,102,-0.373009,-0.271355,-0.494652,56
1429009302055,102,-0.395533,-0.301254,-0.399958,40
1429009302067,102,-0.322103,-0.261839,-0.208929,40
1429009302108,102,-0.0837817,-0.0709243,0.0655534,30
1429009302149,102,0.171945,0.122852,0.28441,19
1429009302190,102,0.324469,0.282022,0.396054,13
1429009302233,102,0.341622,0.32549,0.36424,11
1429009302245,102,0.234686,0.273726,0.238173,12
1429009302286,102,0.0430475,0.118425,0.0561831,64
1429009302328,102,-0.116294,-0.0148157,-0.0584798,55
1429009302339,102,-0.131041,-0.0453289,-0.0421852,46
1429009302381,102,-0.0050209,0.053752,0.0765247,42
1429009302391,102,0.26869,0.256826,0.288809,40
1429009302433,102,0.469206,0.396632,0.380567,28
1429009302445,102,0.487428,0.357416,0.307421,24
1429009302486,102,0.252044,0.123564,0.103355,16
1429009302498,102,-0.0583515,-0.142458,-0.100368,15
1429009302539,102,-0.357209,-0.361842,-0.222563,11
1429009302550,102,-0.423504,-0.394748,-0.182623,15
1429009302591,102,-0.419673,-0.37893,-0.164348,60
1429009302611,102,-0.340927,-0.322904,-0.168571,55
1429009302652,102,-0.21878,-0.269894,-0.225366,34
1429009302678,102,-0.134465,-0.21758,-0.280607,35
1429009302719,102,-0.0982477,-0.164275,-0.317712,28
1429009302746,102,-0.026879,-0.0358755,-0.23749,19
1429009302787,102,0.0592808,0.103978,-0.0832587,10
1429009302810,102,0.125842,0.19306,0.0625791,7
1429009302852,102,0.208044,0.241578,0.203942,16
1429009302879,102,0.219946,0.236093,0.277317,53
1429009302910,102,0.192313,0.205376,0.282537,52
1429009302946,102,0.036782,0.086107,0.108182,32
1429009302978,102,-0.111264,-0.0378673,-0.098721,30
1429009303014,102,-0.129094,-0.0836824,-0.183601,23
1429009303046,102,-0.0541359,-0.0564346,-0.147274,17
1429009303078,102,0.188054,0.102152,0.0992864,12
1429009303111,102,0.319684,0.229614,0.314398,11
1429009303147,102,0.315577,0.28495,0.401881,26
1429009303178,102,0.157149,0.232186,0.340203,72
1429009303210,102,-0.0265665,0.119933,0.160337,58
1429009303246,102,-0.184742,-0.0318096,-0.0672584,43
1429009303278,102,-0.196047,-0.105609,-0.1816,45
1429009303312,102,-0.11855,-0.128379,-0.241635,39
1429009303346,102,-0.0397788,-0.146524,-0.240074,27
1429009303378,102,-0.0120744,-0.147738,-0.201404,22
1429009303410,102,-0.0914845,-0.188677,-0.180947,20
1429009303446,102,-0.246119,-0.25439,-0.199159,56
1429009303478,102,-0.358167,-0.290108,-0.228228,79
1429009303512,102,-0.330338,-0.237552,-0.172082,57
1429009303547,102,-0.154961,-0.109093,-0.0444359,49
1429009303578,102,0.0704813,0.0491152,0.121298,45
1429009303612,102,0.346811,0.232684,0.309593,35
1429009303646,102,0.434826,0.279115,0.329744,27
1429009303678,102,0.318362,0.206696,0.201571,24
1429009303713,102,0.0476529,0.028319,-0.00999892,24
1429009303746,102,-0.190302,-0.100541,-0.132282,64
1429009303778,102,-0.255357,-0.136231,-0.131406,71
1429009303813,102,-0.202903,-0.100867,-0.0882194,50
1429009303846,102,-0.115236,-0.0668577,-0.0570552,50
1429009303887,102,-0.0225568,-0.0241482,-0.0274465,40
1429009303928,102,-0.00525542,-0.00310303,-0.0286411,28
1429009303969,102,0.0497925,0.0579643,-7.09072e-05,23
1429009304013,102,0.203549,0.19865,0.149388,48
1429009304054,102,0.384493,0.32435,0.295464,69
1429009304095,102,0.507557,0.384573,0.385056,46
1429009304136,102,0.420286,0.300743,0.317138,45
1429009304178,102,0.122856,0.0658301,0.0648959,35
1429009304219,102,-0.241904,-0.200742,-0.246339,25
1429009304260,102,-0.558467,-0.424534,-0.542656,29
1429009304302,102,-0.587067,-0.434962,-0.570509,74
1429009304343,101,-0.385493,-0.288001,-0.34508,52
1429009304384,101,-0.112918,-0.0884171,-0.0418292,42
1429009304426,101,0.185811,0.123485,0.297612,35
1429009304467,101,0.334343,0.217728,0.455336,24
1429009304508,101,0.307013,0.217067,0.433501,17
1429009304550,101,0.198591,0.152362,0.276043,46
1429009304591,100,0.0555327,0.0698951,0.0789694,78
1429009304633,100,-0.107488,-0.0348144,-0.12113,51
1429009304645,100,-0.19635,-0.110927,-0.232038,47
1429009304686,100,-0.203137,-0.1487,-0.264659,41
1429009304728,100,-0.156087,-0.137942,-0.222817,29
1429009304769,100,-0.0590171,-0.0608108,-0.104759,22
1429009304810,100,0.0100674,0.00989641,-0.0405592,20
1429009304851,100,0.0514869,0.0526805,0.00738594,62
1429009304893,100,0.0902355,0.0776681,0.0349952,80
1429009304934,100,0.12339,0.0737035,0.063568,55
1429009304976,100,0.159361,0.0724055,0.0887719,49
1429009305017,100,0.141613,0.0655898,0.105219,36
1429009305058,100,0.0880945,0.0675896,0.110107,24
1429009305100,100,0.00333661,0.0633488,0.0961085,19
1429009305142,100,-0.0958474,0.0222488,0.060021,15
1429009305183,100,-0.167562,-0.0433192,-0.0142863,14
1429009305224,100,-0.130521,-0.0710214,-0.0455501,73
1429009305266,100,0.0296764,-0.0359871,-0.0175571,81
1429009305307,100,0.0760631,-0.0499545,-0.0496887,60
1429009305349,100,-0.0500036,-0.153196,-0.177021,58
1429009305390,100,-0.281294,-0.291645,-0.349258,42
1429009305432,100,-0.49853,-0.397789,-0.467848,32
1429009305473,100,-0.500784,-0.346052,-0.419139,24
1429009305514,100,-0.153719,-0.0753943,-0.099363,19
1429009305555,100,0.269527,0.238535,0.278536,28
1429009305597,100,0.56502,0.449067,0.524623,77
1429009305609,100,0.700474,0.535384,0.645644,71
1429009305651,100,0.511145,0.38033,0.474005,45
1429009305693,100,0.29185,0.191301,0.261056,44
1429009305707,100,-0.0016915,-0.0278174,-0.0273919,39
1429009305749,100,-0.1496,-0.117127,-0.194518,26
1429009305790,100,-0.0532655,-0.0222594,-0.111968,18
1429009305832,100,0.0693567,0.100864,0.0542168,14
1429009305874,100,0.114501,0.114526,0.11866,12
1429009305885,100,0.0864358,0.0341712,0.0681729,18
1429009305926,100,-0.0996644,-0.147269,-0.140919,77
1429009305968,100,-0.241521,-0.255937,-0.293897,56
1429009305979,100,-0.345825,-0.278859,-0.386773,47
1429009306020,100,-0.352732,-0.215547,-0.326722,44
1429009306062,100,-0.259334,-0.0898902,-0.127519,32
1429009306073,100,-0.243199,-0.0482986,0.0461655,25
1429009306115,100,-0.284829,-0.0877958,0.0727847,15
1429009306155,100,-0.338695,-0.139121,0.0237412,11
1429009306197,100,-0.286161,-0.137399,-0.0471773,9
1429009306209,100,-0.0462757,-0.0267761,-0.00807401,20
1429009306250,100,0.359826,0.184263,0.204247,86
1429009306292,100,0.648091,0.317371,0.350061,62
1429009306303,100,0.779849,0.350185,0.389853,53
1429009306344,100,0.649096,0.260439,0.257963,48
1429009306355,100,0.342465,0.118043,0.0247255,46
1429009306396,100,0.104604,0.0533594,-0.0716796,30
1429009306407,100,-0.0830179,0.0113411,-0.126619,22
1429009306449,100,-0.204034,-0.0182022,-0.146162,14
1429009306461,100,-0.242105,-0.0290365,-0.124844,12
1429009306502,100,-0.236177,-0.0639255,-0.148315,9
1429009306514,100,-0.201182,-0.0808541,-0.142014,10
1429009306555,100,-0.149971,-0.0848268,-0.118725,73
1429009306578,100,-0.150075,-0.071674,-0.0661763,83
1429009306620,100,-0.195071,-0.100753,-0.0947784,50
1429009306646,100,-0.264691,-0.157913,-0.148962,45
1429009306687,100,-0.283714,-0.189254,-0.162339,39
1429009306710,100,-0.250895,-0.186115,-0.158836,27
1429009306751,100,-0.130581,-0.13821,-0.0825272,16
1429009306778,100,0.0332188,-0.0563211,0.0332551,13
1429009306819,100,0.19431,0.0225555,0.126807,10
1429009306846,100,0.196619,0.0294586,0.113607,18
1429009306887,100,0.0980605,0.0151689,0.0621281,83
1429009306910,100,-0.0817551,-0.0516451,-0.077213,78
1429009306952,100,-0.229058,-0.127056,-0.219155,48
1429009306978,100,-0.217038,-0.105172,-0.223482,49
1429009307019,100,0.0319963,0.0737998,0.018719,38
1429009307046,100,0.374211,0.305956,0.355784,29
1429009307088,100,0.638153,0.480936,0.62527,21
1429009307112,100,0.737398,0.523234,0.715419,19
1429009307146,100,0.54148,0.390226,0.532141,18
1429009307178,100,0.242704,0.197712,0.276415,17
1429009307211,100,-0.0250459,0.0364387,0.0390343,17
1429009307246,100,-0.124442,-0.0264127,-0.0239671,24
1429009307278,100,-0.108752,-0.042623,-0.027395,43
1429009307310,100,-0.0273265,-0.0339834,0.0206847,67
1429009307346,100,-0.0360799,-0.113926,-0.0682252,82
1429009307378,100,-0.0976272,-0.19963,-0.182714,82
1429009307411,100,-0.290456,-0.343041,-0.46724,73
1429009307446,100,-0.458007,-0.427323,-0.662519,61
1429009307478,100,-0.544065,-0.42063,-0.721665,53
1429009307510,100,-0.469822,-0.315411,-0.570379,51
1429009307546,100,-0.307163,-0.140278,-0.270612,52
1429009307578,100,-0.110451,0.0323061,0.0501715,53
1429009307610,100,0.0319887,0.143535,0.264955,53
1429009307646,100,0.15467,0.225413,0.426144,48
1429009307679,100,0.163028,0.228092,0.422297,43
1429009307712,100,0.165265,0.201654,0.350909,41
1429009307746,100,0.119187,0.112033,0.166356,35
1429009307779,100,0.0211745,-0.0647945,-0.159333,33
1429009307812,100,-0.0723011,-0.215029,-0.462664,29
1429009307847,100,-0.0745207,-0.27426,-0.58082,25
1429009307878,100,-0.0302589,-0.199521,-0.466958,24
1429009307912,100,0.0637148,-0.0294122,-0.168965,22
1429009307946,100,0.174855,0.171908,0.229768,21
1429009307987,100,0.336321,0.375845,0.650802,29
1429009308012,100,0.45964,0.467796,0.8822,38
1429009308046,100,0.454817,0.41492,0.79841,70
1429009308087,100,0.218335,0.170781,0.337764,81
1429009308129,100,-0.112653,-0.111643,-0.199774,75
1429009308170,100,-0.411588,-0.326032,-0.580272,64
1429009308213,100,-0.469395,-0.33322,-0.57873,52
1429009308254,100,-0.39081,-0.232266,-0.377732,50
1429009308296,100,-0.201149,-0.0874662,-0.0930549,51
1429009308337,100,0.0714971,0.0595747,0.199544,49
1429009308378,100,0.208024,0.101095,0.271893,42
1429009308419,100,0.283342,0.101034,0.252414,38
1429009308460,100,0.222761,0.0460335,0.126021,32
1429009308501,100,0.172981,0.0288188,0.0950254,30
1429009308543,100,0.121156,0.0317937,0.0992625,26
1429009308584,100,-0.00465585,-0.0136426,0.04327,24
1429009308626,100,-0.147672,-0.0868674,-0.0962737,32
1429009308667,100,-0.252505,-0.128238,-0.242844,63
1429009308708,100,-0.30082,-0.144962,-0.396732,83
1429009308749,100,-0.163334,-0.0229727,-0.283945,85
1429009308790,99,-0.0338874,0.0768602,-0.142246,74
1429009308835,99,0.173206,0.189184,0.117758,56
1429009308847,99,0.231963,0.158455,0.196958,52
1429009308888,99,0.100828,0.0324352,0.101581,49
1429009308929,99,-0.0307904,-0.0528581,0.0445174,49
1429009308973,99,-0.179452,-0.102994,0.000663751,47
1429009308984,99,-0.263291,-0.091835,-0.0192272,45
1429009309025,99,-0.244072,-0.0495555,-0.00257744,40
1429009309066,99,-0.107744,0.00889876,0.0787674,33
1429009309107,99,0.158459,0.112277,0.245919,28
1429009309148,99,0.314122,0.145124,0.319994,23
1429009309189,99,0.331501,0.115458,0.240695,20
1429009309231,99,0.230922,0.0468569,0.0395574,34
1429009309273,99,0.154934,0.0309712,-0.120547,57
1429009309315,99,0.0937715,0.0179092,-0.176618,93
1429009309356,99,0.00853524,-0.00508476,-0.150908,97
1429009309397,99,0.0145497,0.0340458,-0.0198433,82
1429009309438,99,0.0838143,0.136395,0.212902,70
1429009309479,99,0.0680359,0.149636,0.291193,58
1429009309520,99,-0.0328319,0.0843499,0.216614,56
1429009309561,99,-0.295969,-0.125654,-0.0755017,55
1429009309603,99,-0.496648,-0.330336,-0.360546,51
1429009309645,99,-0.564136,-0.455546,-0.549271,42
1429009309688,99,-0.467094,-0.435627,-0.517752,37
1429009309730,99,-0.176358,-0.273114,-0.335825,29
1429009309772,99,-0.00267936,-0.138747,-0.15483,25
1429009309813,99,0.0180251,-0.0974821,-0.114164,22
1429009309855,99,-0.00256553,-0.0634219,-0.070207,22
1429009309896,99,0.00203603,-0.0335683,-0.0494205,36
1429009309938,99,0.0889,0.0425279,0.0233494,76
1429009309979,99,0.348349,0.248304,0.211275,98
1429009310020,99,0.528835,0.416903,0.343532,98
1429009310061,97,0.603283,0.51965,0.457312,87
1429009310104,97,0.49419,0.492221,0.498783,69
1429009310115,97,0.323357,0.400488,0.508435,65
1429009310157,97,0.0422158,0.19798,0.369656,60
1429009310199,97,-0.149806,0.015491,0.244506,58
1429009310211,97,-0.358517,-0.253203,-0.0346166,58
1429009310252,97,-0.445119,-0.429705,-0.281634,53
1429009310294,97,-0.492662,-0.540163,-0.484254,46
1429009310335,97,-0.440549,-0.48241,-0.558094,37
1429009310376,97,-0.186749,-0.206614,-0.357672,31
1429009310418,97,0.00840533,0.0364848,-0.12394,24
1429009310462,97,0.115041,0.142368,0.0321947,20
1429009310474,97,0.100987,0.123571,0.0393256,19
1429009310517,97,0.179849,0.153606,0.0492432,16
1429009310529,97,0.337308,0.244572,0.0851044,16
1429009310570,97,0.439189,0.296544,0.103787,13
1429009310611,97,0.274771,0.168223,-0.00917471,11
1429009310652,97,-0.0486149,-0.0817627,-0.158034,8
1429009310694,97,-0.431743,-0.386277,-0.325228,7
1429009310705,97,-0.534239,-0.409902,-0.284545,6
1429009310746,97,-0.422005,-0.302995,-0.200366,5
1429009310788,97,0.0435866,0.139848,0.0919613,26
1429009310829,97,0.322988,0.364474,0.218034,58
1429009310870,97,0.36948,0.366507,0.208469,104
1429009310911,97,0.174517,0.140694,0.0780028,109
1429009310952,97,0.0144706,-0.0125807,0.0482188,66
1429009310964,97,0.136459,0.160755,0.264207,66
1429009311006,97,0.251257,0.302136,0.44475,56
1429009311048,97,0.316412,0.375167,0.556434,53
1429009311090,97,0.0809735,0.0696508,0.281909,51
1429009311102,97,-0.211381,-0.330766,-0.0731236,51
1429009311144,97,-0.427535,-0.643676,-0.372121,49
1429009311156,97,-0.477863,-0.710343,-0.500103,48
1429009311198,97,-0.32411,-0.515029,-0.40516,44
1429009311210,97,-0.100675,-0.184717,-0.20397,42
1429009311251,97,0.153565,0.199432,0.0567478,38
1429009311294,97,0.403903,0.527067,0.283997,35
1429009311305,97,0.443327,0.600935,0.332794,34
1429009311346,97,0.288373,0.400595,0.159489,32
1429009311358,97,-0.0652316,-0.0204582,-0.187857,31
1429009311400,97,-0.32974,-0.347509,-0.454848,29
1429009311412,97,-0.379977,-0.387143,-0.451628,29
1429009311453,97,-0.210259,-0.14546,-0.204797,28
1429009311478,97,0.0707491,0.239664,0.187781,28
1429009311519,97,0.284844,0.520902,0.492646,27
1429009311546,97,0.38927,0.629056,0.64008,28
1429009311587,97,0.335344,0.509416,0.548744,42
1429009311629,97,0.194549,0.293748,0.314945,56
1429009311646,97,0.0397139,0.0229719,0.0537798,62
1429009311687,97,-0.0276642,-0.140537,-0.0910206,65
1429009311710,97,-0.113639,-0.315072,-0.208686,63
1429009311751,97,-0.199813,-0.445066,-0.269911,53
1429009311778,97,-0.279357,-0.489476,-0.313958,50
1429009311819,97,-0.276749,-0.437055,-0.296347,46
1429009311846,97,-0.237081,-0.338104,-0.272289,46
1429009311887,97,-0.119586,-0.198831,-0.180911,45
1429009311912,97,0.0148021,-0.0368379,-0.0435386,44
1429009311946,97,0.0733932,0.00914185,0.0167708,42
1429009311978,97,0.106717,0.06605,0.0644355,40
1429009312014,97,0.0723349,0.0839741,0.0448862,37
1429009312046,97,-0.0673098,0.0341343,-0.0678944,35
1429009312078,97,-0.199697,-0.0426949,-0.155214,32
1429009312112,97,-0.267864,-0.0914793,-0.192697,31
1429009312146,97,-0.157371,-0.0249886,-0.0812628,29
1429009312179,97,0.0867589,0.150427,0.148009,28
1429009312213,97,0.385354,0.416234,0.436284,27
1429009312246,97,0.569389,0.594305,0.596726,28
1429009312278,97,0.543472,0.576715,0.514159,35
1429009312319,97,0.229173,0.251051,0.113174,53
1429009312360,97,-0.169349,-0.204369,-0.368806,60
1429009312401,97,-0.562106,-0.649024,-0.771229,57
1429009312443,97,-0.676349,-0.801883,-0.793498,50
1429009312484,97,-0.58048,-0.6832,-0.535707,43
1429009312525,97,-0.231901,-0.279293,-0.0160543,40
1429009312566,97,0.140959,0.127146,0.418218,41
1429009312609,97,0.42923,0.427269,0.645822,40
1429009312621,97,0.571924,0.564588,0.650407,40
1429009312662,97,0.494606,0.51233,0.447365,37
1429009312704,97,0.238347,0.295297,0.144318,33
1429009312746,97,-0.0542394,0.0663634,-0.116384,30
1429009312788,97,-0.356452,-0.219293,-0.371138,27
1429009312829,97,-0.473145,-0.366623,-0.470167,26
1429009312870,97,-0.370423,-0.32241,-0.405357,25
1429009312912,97,-0.119175,-0.143138,-0.171512,27
1429009312954,97,0.184207,0.102808,0.123168,41
1429009312995,97,0.332102,0.240001,0.296492,55
1429009313036,97,0.291424,0.232223,0.304867,63
1429009313078,96,0.1717,0.163799,0.248581,58
1429009313120,96,0.0541048,0.0707062,0.166354,47
1429009313161,96,0.0270335,0.0296278,0.10984,42
1429009313203,96,0.0459669,0.00603895,0.0565153,40
1429009313244,96,-0.00824613,-0.0632851,-0.0861651,40
1429009313285,96,-0.0439454,-0.111721,-0.185071,40
1429009313326,96,-0.0655457,-0.123659,-0.232637,37
1429009313367,96,-0.0174989,-0.0814679,-0.151056,33
1429009313409,96,0.0412945,-0.00200236,0.000710004,29
1429009313450,96,0.0866409,0.0812772,0.147487,26
1429009313493,96,-0.00355835,0.0538736,0.119663,24
1429009313534,96,-0.120976,-0.0278172,-0.000728446,22
1429009313575,96,-0.279522,-0.197674,-0.236065,23
1429009313616,96,-0.294072,-0.25281,-0.338581,32
1429009313657,96,-0.297071,-0.26741,-0.398266,56
1429009313699,96,-0.182189,-0.151566,-0.26128,67
1429009313740,96,-0.117851,-0.0569143,-0.106574,65
1429009313781,94,-0.0171697,0.0672724,0.0919708,58
1429009313822,94,0.0419881,0.129644,0.204645,48
1429009313863,94,0.0525317,0.117658,0.205793,44
1429009313905,94,0.0192953,0.0461385,0.118797,44
1429009313946,94,0.0417746,0.0117141,0.065361,43
1429009313987,94,0.166222,0.0757609,0.106388,41
1429009314028,94,0.292182,0.156797,0.167873,36
1429009314070,94,0.358944,0.195701,0.187474,33
1429009314111,94,0.237368,0.0909687,0.0759026,29
1429009314152,94,0.088915,-0.00551185,-0.00807782,27
1429009314193,94,-0.07374,-0.108845,-0.109309,25
1429009314235,94,-0.105537,-0.0961892,-0.0653408,28
1429009314276,94,-0.0823579,-0.0791239,-0.0421165,47
1429009314317,94,0.078991,0.0337759,0.0757195,62
1429009314359,94,0.137242,0.0840464,0.122628,68
1429009314400,94,0.0864275,0.072965,0.126022,62
1429009314441,94,0.0219517,0.0594539,0.120412,50
1429009314483,94,-0.054591,0.0312105,0.0601811,45
1429009314524,94,-0.0568422,0.0391522,0.0265521,43
1429009314565,94,-0.0621605,0.0236649,-0.0326585,43
1429009314607,94,-0.104004,-0.028206,-0.11523,40
1429009314648,94,-0.186989,-0.115131,-0.203952,37
1429009314690,94,-0.242101,-0.182852,-0.259865,32
1429009314702,94,-0.181023,-0.172727,-0.232838,32
1429009314743,94,-0.104471,-0.16023,-0.189698,28
1429009314785,94,-0.04324,-0.130156,-0.117203,26
1429009314826,94,-0.0149692,-0.067926,-0.0217096,24
1429009314868,94,-0.100024,-0.07364,-0.0105754,24
1429009314909,94,-0.121676,-0.00836692,0.0469231,39
1429009314951,94,-0.0932773,0.0558071,0.0782396,54
1429009314993,94,0.0591479,0.156552,0.13583,68
1429009315034,93,0.202883,0.236925,0.145363,65
1429009315076,93,0.35109,0.313502,0.191566,53
1429009315118,93,0.526922,0.421575,0.341067,47
1429009315160,93,0.510139,0.377061,0.375552,44
1429009315171,93,0.365256,0.230173,0.355531,44
1429009315212,93,0.175232,0.0487824,0.256567,45
1429009315253,93,0.0430012,-0.0820373,0.135362,44
1429009315295,93,-0.0759599,-0.145957,0.00646532,40
1429009315336,93,-0.172252,-0.185598,-0.140766,37
1429009315377,93,-0.33161,-0.297062,-0.369646,33
1429009315419,93,-0.46457,-0.415724,-0.568768,31
1429009315460,93,-0.53842,-0.488251,-0.68546,28
1429009315502,93,-0.551747,-0.481614,-0.671636,28
1429009315543,93,-0.38872,-0.326673,-0.46048,33
1429009315585,93,-0.139534,-0.0963866,-0.154263,44
1429009315626,93,0.136425,0.173942,0.199151,63
1429009315638,93,0.332578,0.379306,0.450245,63
1429009315679,93,0.447222,0.503139,0.590234,65
1429009315720,92,0.429983,0.500711,0.571144,59
1429009315762,92,0.274552,0.335329,0.373893,48
1429009315773,92,0.0386998,0.058075,0.0553456,48
1429009315815,92,-0.171615,-0.20565,-0.24518,43
1429009315827,92,-0.248283,-0.361244,-0.392244,43
1429009315868,92,-0.168404,-0.314796,-0.315159,43
1429009315910,92,-0.00214071,-0.128277,-0.0635585,40
1429009315921,92,0.113563,0.0582658,0.185196,40
1429009315962,92,0.183115,0.219686,0.355386,35
1429009315974,92,0.195911,0.289068,0.39773,35
1429009316015,92,0.213613,0.281434,0.354358,30
1429009316027,92,0.181992,0.189107,0.227906,29
1429009316067,92,0.0754972,0.0337302,0.040132,26
1429009316109,92,0.0221594,-0.0238266,-0.075613,24
1429009316150,92,-0.100063,-0.101827,-0.222244,23
1429009316162,92,-0.186331,-0.148754,-0.324944,25
1429009316204,92,-0.331895,-0.232943,-0.418219,36
1429009316215,92,-0.408172,-0.290513,-0.417118,43
1429009316256,92,-0.390737,-0.290455,-0.326917,56
1429009316278,92,-0.225081,-0.174963,-0.131654,62
1429009316319,93,0.0767022,0.0611618,0.142368,59
1429009316360,93,0.329607,0.245022,0.293322,48
1429009316378,93,0.39906,0.28532,0.296962,45
1429009316420,93,0.176967,0.0886452,0.0404203,41
1429009316446,93,-0.104274,-0.161575,-0.210069,40
1429009316487,93,-0.339485,-0.345806,-0.348149,41
1429009316512,93,-0.254834,-0.257694,-0.193944,40
1429009316553,93,-0.0456552,-0.0522064,0.0530582,39
1429009316596,93,0.205257,0.188287,0.279196,34
1429009316638,93,0.289343,0.29045,0.347954,31
1429009316680,93,0.258945,0.309519,0.330636,28
1429009316721,93,0.198156,0.276362,0.274642,26
1429009316762,93,0.164326,0.228088,0.198121,26
1429009316803,93,0.132002,0.17415,0.091487,35
1429009316844,93,0.1115,0.103682,0.0168454,58
1429009316885,93,0.100661,0.0580976,-0.0143275,68
1429009316926,93,0.0356669,-0.0345949,-0.053168,67
1429009316967,93,-0.0164725,-0.0925738,-0.0783838,57
1429009317009,93,-0.0950365,-0.172435,-0.138922,50
1429009317050,93,-0.17472,-0.242024,-0.170772,44
1429009317092,93,-0.333124,-0.392313,-0.285365,43
1429009317133,93,-0.434705,-0.493144,-0.37253,42
1429009317175,93,-0.449211,-0.482527,-0.395779,40
1429009317217,93,-0.373,-0.359306,-0.33427,35
1429009317258,93,-0.174393,-0.0944121,-0.153531,31
1429009317299,93,0.043387,0.196386,0.0618707,26
1429009317340,93,0.225175,0.392506,0.237137,24
1429009317382,93,0.349829,0.472667,0.346815,31
1429009317423,93,0.396564,0.418535,0.405362,45
1429009317465,93,0.327676,0.280834,0.354729,65
1429009317507,93,0.192297,0.12822,0.263989,67
1429009317548,94,0.0738057,0.0553121,0.179964,57
1429009317589,94,-0.0789078,-0.0508942,-0.00545455,48
1429009317631,94,-0.175874,-0.133951,-0.172667,41
1429009317672,94,-0.223928,-0.234056,-0.323169,41
1429009317713,94,-0.129997,-0.218452,-0.283342,41
1429009317754,94,-0.0257681,-0.157003,-0.154476,40
1429009317796,94,0.063033,-0.0411456,0.0214834,34
1429009317837,94,-0.000915472,0.0069816,0.0687694,31
1429009317879,94,-0.13039,-0.00109427,0.0222386,26
1429009317920,94,-0.217707,-0.0387221,-0.0714598,24
1429009317961,94,-0.205127,-0.0654031,-0.0970312,29
1429009318002,94,-0.0202127,-0.00721972,0.0445307,50
1429009318044,94,0.292953,0.146746,0.28492,63
1429009318085,94,0.531567,0.302754,0.44432,64
1429009318126,95,0.448411,0.296015,0.30199,57
1429009318168,95,0.178601,0.168582,0.0320012,45
1429009318209,95,-0.0925761,0.0219436,-0.19813,41
1429009318251,95,-0.252497,-0.105784,-0.309504,40
1429009318292,95,-0.296653,-0.183272,-0.322462,40
1429009318333,95,-0.244348,-0.193157,-0.253445,37
1429009318375,95,-0.178275,-0.182667,-0.200388,34
1429009318417,95,-0.0631057,-0.10283,-0.12076,29
1429009318459,95,0.0402566,-0.018596,-0.04319,26
1429009318501,95,0.0962339,0.048807,-0.00217864,25
1429009318543,95,0.0518811,0.0336566,0.034552,32
1429009318584,95,-0.00184741,0.0112428,0.0881193,54
1429009318626,95,-0.0557516,-0.032535,0.14108,65
1429009318667,96,-0.0584357,-0.0403257,0.176218,63
1429009318709,96,-0.0642226,-0.0424635,0.140597,55
1429009318751,96,0.0122956,0.0497546,0.15857,43
1429009318793,96,0.0841502,0.107623,0.0939929,40
1429009318834,96,0.0877755,0.0971859,-0.0328073,41
1429009318876,96,0.0662385,0.0234474,-0.144605,40
1429009318918,96,0.0330724,-0.0542624,-0.17945,37
1429009318959,96,0.061178,-0.0521757,-0.0693673,34
1429009319000,96,0.107089,-0.0077019,0.0526541,29
1429009319042,96,0.096333,0.0441855,0.119567,27
1429009319083,96,0.0628082,0.0684208,0.119754,24
1429009319124,96,-0.0435371,0.0285781,0.0332272,29
1429009319165,96,-0.107143,-0.0136424,-0.0298053,41
1429009319207,96,-0.0467724,0.0173485,0.024493,61
1429009319249,96,0.0529619,0.0724065,0.098164,60
1429009319291,97,0.0825405,0.089245,0.0838407,52
1429009319332,97,0.0427932,0.0404262,0.00120616,44
1429009319373,97,-0.0264418,-0.0254618,-0.0900481,39
1429009319414,97,-0.0982355,-0.0851647,-0.130315,39
1429009319455,97,-0.0163787,-0.0366482,0.0100563,39
1429009319497,97,0.102972,0.0543626,0.199691,36
1429009319538,97,0.188952,0.136361,0.338182,32
1429009319580,97,0.153625,0.127127,0.304287,29
1429009319592,97,0.0526917,0.0674002,0.17801,28
1429009319632,97,-0.103121,-0.0630713,-0.0822441,26
1429009319674,97,-0.166796,-0.137811,-0.27798,23
1429009319686,97,-0.112524,-0.118372,-0.325046,24
1429009319728,97,-0.0128179,-0.0377449,-0.261447,31
1429009319740,97,-0.00108993,0.00414517,-0.234247,37
1429009319782,97,-0.0727305,-0.0020196,-0.231378,50
1429009319794,97,-0.159606,-0.0354694,-0.199768,56
1429009319835,97,-0.222151,-0.0925469,-0.182971,59
1429009319877,99,-0.213036,-0.126058,-0.13221,53
1429009319888,99,-0.193979,-0.143671,-0.106472,48
1429009319929,99,-0.167305,-0.142466,-0.107638,41
1429009319970,99,-0.16317,-0.143749,-0.189234,38
1429009319981,99,-0.102047,-0.102347,-0.190515,38
1429009320022,99,0.0699718,0.00130038,-0.0145125,40
1429009320034,99,0.326766,0.155447,0.346603,40
1429009320075,99,0.567702,0.314552,0.775164,38
1429009320117,99,0.653051,0.38848,0.989616,36
1429009320129,99,0.515104,0.339209,0.869662,34
1429009320170,99,0.16056,0.172271,0.390198,30
1429009320182,99,-0.203064,-0.0366197,-0.18175,30
1429009320223,99,-0.430326,-0.174212,-0.549778,26
1429009320247,99,-0.423742,-0.193233,-0.583074,25
1429009320278,99,-0.180703,-0.0732928,-0.270654,26
1429009320319,99,0.102961,0.0817221,0.0731562,43
1429009320346,99,0.275972,0.177395,0.275111,50
1429009320387,99,0.269271,0.155745,0.24859,63
1429009320412,101,0.113079,0.0275269,0.0331864,63
1429009320446,101,-0.0229126,-0.113186,-0.165559,56
1429009320487,101,-0.146051,-0.215253,-0.311785,43
1429009320512,101,-0.176677,-0.218388,-0.322596,41
1429009320546,101,-0.16796,-0.15391,-0.244683,39
1429009320577,101,-0.154171,-0.0808718,-0.109933,40
1429009320612,101,-0.110895,-0.013132,-0.0211958,40
1429009320646,101,-0.0428425,0.0268411,0.0449942,39
1429009320687,101,-0.0339031,0.00765106,0.0200197,35
1429009320711,101,-0.0639741,-0.0263153,-0.0620085,33
1429009320746,101,-0.0731049,-0.0204601,-0.0521603,30
1429009320787,101,-0.071104,0.00119117,-0.0560892,26
1429009320828,101,0.0332787,0.0592975,0.0131267,24
1429009320870,101,0.120898,0.0885241,0.0482795,34
1429009320911,101,0.164245,0.0899106,0.0351556,49
1429009320952,101,0.16495,0.0959269,0.0622269,68
1429009320993,102,0.105068,0.0713907,0.0543213,68
1429009321034,102,0.0205626,0.0446561,0.0679908,60
1429009321076,102,-0.0370106,0.00298873,0.0825156,47
1429009321117,102,-0.145587,-0.0973394,-0.0214976,43
1429009321158,102,-0.243233,-0.212132,-0.175724,42
1429009321199,102,-0.244899,-0.25629,-0.282469,42
1429009321241,102,-0.158753,-0.192866,-0.240083,39
1429009321282,102,0.0608947,-0.0207197,0.00517216,36
1429009321324,102,0.18572,0.124624,0.206912,31
1429009321365,102,0.251198,0.219366,0.408196,28
1429009321406,102,0.164854,0.18839,0.378845,25
1429009321447,102,0.0566485,0.102526,0.259557,31
1429009321488,102,-0.0317807,0.0131531,0.116506,53
1429009321530,102,0.00144377,-0.0180621,0.0455147,67
1429009321572,102,0.0645005,0.00644838,0.0444193,68
1429009321614,103,0.103744,0.0498281,0.0499843,60
1429009321655,103,0.0889287,0.0669105,0.0275644,47
1429009321696,103,0.0810788,0.0798807,0.00832882,43
1429009321737,103,-0.0343059,0.00164871,-0.123516,42
1429009321779,103,-0.184259,-0.108883,-0.302113,41
1429009321820,103,-0.337705,-0.210387,-0.481896,39
1429009321861,103,-0.34313,-0.228383,-0.523947,36
1429009321905,103,-0.192598,-0.14479,-0.374504,31
1429009321947,103,0.0529708,-0.00453571,-0.0910139,28
1429009321988,103,0.351064,0.174333,0.279739,23
1429009322030,103,0.450516,0.248587,0.490004,25
1429009322074,103,0.298898,0.200827,0.440583,45
1429009322088,103,0.0057751,0.058955,0.189621,54
1429009322132,103,-0.304574,-0.122272,-0.188495,67
1429009322144,103,-0.411175,-0.201808,-0.377354,70
1429009322186,103,-0.314897,-0.190899,-0.388982,67
1429009322235,103,-0.0869631,-0.0817299,-0.177146,54
1429009322247,103,0.141421,0.0400983,0.0803974,50
1429009322288,103,0.33233,0.147473,0.315472,43
1429009322329,103,0.335107,0.141082,0.384477,42
1429009322370,103,0.213949,0.0752424,0.314344,42
1429009322411,103,0.14626,0.0465581,0.332619,40
1429009322452,103,0.0337103,-0.0038552,0.259155,36
1429009322493,103,-0.0533668,-0.0418361,0.12102,31
1429009322534,103,-0.183208,-0.114516,-0.14649,28
1429009322577,103,-0.312295,-0.182586,-0.432048,24
1429009322590,103,-0.37446,-0.190085,-0.561442,23
1429009322631,103,-0.406427,-0.175065,-0.622546,23
1429009322673,103,-0.274575,-0.0879838,-0.448346,37
1429009322714,103,-0.109638,0.0163556,-0.241381,53
1429009322756,103,0.0938817,0.136231,0.0890836,69
1429009322797,103,0.274617,0.228805,0.362757,66
1429009322838,103,0.399093,0.270256,0.572216,58
1429009322879,103,0.41606,0.237517,0.640816,46
1429009322920,103,0.272789,0.0978298,0.445024,43
1429009322962,103,0.0722239,-0.055732,0.12855,43
1429009323003,103,-0.108,-0.163064,-0.208269,42
1429009323044,103,-0.105148,-0.132671,-0.320758,39
1429009323085,103,0.0416276,-0.00017299,-0.133899,35
1429009323126,103,0.142041,0.0987319,0.096178,30
1429009323167,103,0.0790634,0.0747294,0.142185,27
1429009323209,103,-0.133194,-0.0599045,-0.0283559,24
1429009323250,103,-0.23465,-0.142232,-0.160532,22
1429009323291,103,-0.175606,-0.13629,-0.193573,26
1429009323332,103,0.0334146,-0.0228587,-0.0646819,37
1429009323373,103,0.178131,0.0842286,0.0293898,58
1429009323415,103,0.189055,0.146489,0.0285064,63
1429009323457,101,0.0715913,0.123384,-0.0299927,60
1429009323470,101,-0.0311028,0.111378,0.0410484,56
1429009323512,101,-0.148833,0.0416501,0.0569566,44
1429009323553,101,-0.189359,-0.0250516,0.0933568,40
1429009323596,101,-0.174375,-0.105932,0.041847,41
1429009323608,101,-0.110265,-0.146502,-0.0302157,41
1429009323649,101,0.06177,-0.08614,0.0523821,40
1429009323690,101,0.192093,-0.0103023,0.119017,38
1429009323733,101,0.263177,0.0561582,0.170345,32
1429009323744,101,0.267901,0.0872795,0.162151,31
1429009323785,101,0.158566,0.057376,0.0431533,28
1429009323826,101,-0.0658247,-0.027384,-0.197121,24
1429009323867,101,-0.224383,-0.0776175,-0.332338,22
1429009323909,101,-0.309855,-0.0861633,-0.342655,28
1429009323949,101,-0.348198,-0.103389,-0.32173,40
1429009323991,101,-0.363218,-0.138564,-0.333663,53
1429009324032,101,-0.215413,-0.099213,-0.18624,59
1429009324073,101,0.0317572,-0.00152787,0.0340431,54
1429009324114,101,0.32044,0.144192,0.33268,41
1429009324156,101,0.456933,0.225292,0.500754,38
1429009324167,101,0.462119,0.228297,0.553011,37
1429009324208,101,0.319408,0.152201,0.451178,38
1429009324219,101,0.0424506,0.00298225,0.165669,39
1429009324261,101,-0.231372,-0.138562,-0.16703,38
1429009324272,101,-0.392708,-0.229383,-0.405508,38
1429009324313,101,-0.40205,-0.227675,-0.466851,34
1429009324325,101,-0.297717,-0.159223,-0.432737,34
1429009324366,101,-0.130505,-0.0531938,-0.265193,29
1429009324407,101,0.0508288,0.0777194,-0.0182492,26
1429009324418,101,0.18703,0.17129,0.192046,25
1429009324459,101,0.177785,0.183644,0.26182,23
1429009324478,101,0.117672,0.132804,0.230311,23
1429009324519,101,0.0616084,0.0668264,0.144784,31
1429009324560,101,0.0835166,0.0363429,0.104917,53
1429009324578,101,0.0802876,0.014653,0.0342751,61
1429009324619,101,0.138146,0.0363453,0.0563256,66
1429009324646,101,0.0461862,-0.0112693,-0.0297207,63
1429009324687,101,-0.116926,-0.101215,-0.147588,54
1429009324714,101,-0.164908,-0.152667,-0.140227,46
1429009324756,101,-0.153567,-0.160387,-0.0707382,42
1429009324778,101,0.0262973,-0.0669956,0.132104,41
1429009324819,101,0.25155,0.0809234,0.330105,42
1429009324845,101,0.322066,0.166571,0.327787,41
1429009324886,101,0.211277,0.136542,0.113376,39
1429009324914,101,-0.0605595,0.0105618,-0.209135,36
1429009324955,101,-0.241877,-0.0961913,-0.391567,32
1429009324978,101,-0.307529,-0.137039,-0.351705,29
1429009325013,101,-0.214198,-0.0831655,-0.145598,27
1429009325046,101,-0.158485,-0.0444952,-0.0200204,24
1429009325087,101,-0.0338165,0.0251768,0.126365,25
1429009325128,101,0.0370644,0.0719176,0.191418,40
1429009325170,101,0.0478435,0.0688237,0.131763,57
1429009325212,101,0.0471441,0.0441671,0.00920646,71
1429009325253,100,-0.0245152,-0.0227702,-0.203382,67
1429009325294,100,-0.0216384,-0.0650367,-0.308917,54
1429009325335,100,-0.0450219,-0.104234,-0.305837,47
1429009325376,100,-0.0178071,-0.0852909,-0.101589,44
1429009325418,100,0.0677645,-0.00484129,0.160172,43
1429009325461,100,0.138658,0.0527009,0.293888,41
1429009325512,100,0.161988,0.0758401,0.248984,37
1429009325529,100,0.0979993,0.0282674,0.0609101,35
1429009325541,100,0.020248,-0.0265605,-0.0732774,35
1429009325583,100,-0.0507692,-0.050239,-0.119627,30
1429009325634,100,-0.0301101,-0.0113891,0.00194238,25
1429009325647,100,0.0552127,0.0722278,0.196231,24
1429009325691,100,0.149475,0.150372,0.333896,22
1429009325702,100,0.234742,0.212531,0.357873,22
1429009325747,100,0.227766,0.217828,0.298632,33
1429009325758,100,0.0738139,0.118043,0.064006,33
1429009325799,100,-0.12993,-0.0280148,-0.188136,58
1429009325841,100,-0.246074,-0.118206,-0.292887,70
1429009325881,99,-0.341493,-0.2028,-0.395192,67
1429009325923,99,-0.367253,-0.242298,-0.393996,58
1429009325964,99,-0.347428,-0.24951,-0.381195,46
1429009326005,99,-0.294416,-0.223053,-0.326209,43
1429009326047,99,-0.194633,-0.150111,-0.23646,43
1429009326088,99,-0.0173672,-0.0232846,-0.048435,42
1429009326129,99,0.0696094,0.0548382,0.0739061,38
1429009326171,99,0.0988075,0.0701028,0.0998935,34
1429009326213,99,0.0456053,0.0188676,0.0290278,29
1429009326254,99,0.0437042,-0.0144457,0.00540046,26
1429009326295,99,0.213162,0.0697287,0.181382,24
1429009326336,99,0.443961,0.210856,0.464548,21
1429009326347,99,0.553124,0.308503,0.638357,20
1429009326389,99,0.482639,0.296124,0.577428,22
1429009326430,99,0.242104,0.179398,0.303425,40
1429009326471,99,-0.0261753,0.0157612,-0.0737903,58
1429009326512,99,-0.215988,-0.116094,-0.384899,69
1429009326554,98,-0.263598,-0.156034,-0.427673,64
1429009326595,98,-0.112809,-0.0754435,-0.172654,54
1429009326636,98,0.107391,0.0416407,0.235031,43
1429009326678,98,0.192473,0.100955,0.488981,41
1429009326719,98,0.0571648,0.0188855,0.311418,42
1429009326761,98,-0.125964,-0.0995506,-0.0270073,41
1429009326802,98,-0.273178,-0.180538,-0.353815,37
1429009326844,98,-0.344743,-0.195293,-0.532826,33
1429009326885,98,-0.346487,-0.141921,-0.516055,28
1429009326929,98,-0.27207,-0.0693072,-0.358719,25
1429009326941,98,-0.166153,-0.00687919,-0.164868,24
1429009326982,98,0.00578933,0.073311,0.082732,21
1429009327024,98,0.0378139,0.0440902,0.079738,20
1429009327065,98,-0.0408599,-0.0407584,-0.0975113,23
1429009327111,98,-0.115873,-0.10434,-0.250504,36
1429009327123,98,-0.099705,-0.0960186,-0.267542,43
1429009327165,98,0.0923729,0.0205639,-0.0162895,65
1429009327206,96,0.38328,0.185109,0.360296,66
1429009327248,96,0.597835,0.290846,0.69106,59
1429009327290,96,0.69204,0.330155,0.866503,45
1429009327301,96,0.553623,0.259646,0.741789,42
1429009327312,96,0.18321,0.0862341,0.279503,42
1429009327353,96,-0.193968,-0.0838385,-0.214854,40
1429009327395,96,-0.493141,-0.211506,-0.609612,41
1429009327436,96,-0.511838,-0.223365,-0.644461,40
1429009327477,96,-0.409127,-0.18467,-0.495956,38
1429009327518,96,-0.137094,-0.0775114,-0.126479,33
1429009327559,96,0.0449935,-0.0141504,0.123427,29
1429009327601,96,0.124168,0.0184181,0.246369,25
1429009327642,96,0.0550182,-0.00603102,0.168233,22
1429009327685,96,0.00262338,0.0122305,0.105197,20
1429009327696,96,-0.00893059,0.0552633,0.0401226,20
1429009327737,96,0.0136262,0.0783972,0.0108686,28
1429009327779,96,-0.0566576,-0.0035633,-0.153337,41
1429009327820,96,-0.120737,-0.0935325,-0.276648,60
1429009327861,95,-0.186188,-0.181115,-0.404577,60
1429009327903,95,-0.148227,-0.167157,-0.377711,49
1429009327944,95,-0.0160895,-0.0660647,-0.164979,40
1429009327956,95,0.139734,0.083919,0.165535,38
1429009327998,95,0.283978,0.206541,0.506384,35
1429009328039,95,0.297955,0.241679,0.67182,38
1429009328081,95,0.278896,0.224824,0.68053,38
1429009328123,95,0.157343,0.112696,0.392528,35
1429009328164,95,0.00095444,-0.0200838,-0.00565602,32
1429009328205,95,-0.187418,-0.14716,-0.395625,27
1429009328247,95,-0.287185,-0.19335,-0.545652,24
1429009328288,95,-0.293397,-0.171672,-0.522666,20
1429009328329,95,-0.181313,-0.0974243,-0.29568,23
1429009328371,95,0.0226271,0.0216294,0.0288054,43
1429009328412,95,0.158164,0.081637,0.192762,59
1429009328453,95,0.139535,0.0670627,0.140462,66
1429009328494,95,0.0637424,0.0418703,0.027847,59
1429009328507,95,-0.0273312,0.0217782,-0.0886752,55
1429009328518,95,-0.0912353,-0.00717714,-0.176469,50
1429009328561,95,-0.0692419,-0.0177139,-0.163903,42
1429009328573,95,0.0271414,0.00230843,-0.0262486,40
1429009328614,95,0.0798796,-0.00470767,0.0743916,38
1429009328626,95,0.0186906,-0.0481938,0.0801488,39
1429009328668,95,-0.0636061,-0.0730509,0.0258703,39
1429009328680,95,-0.113366,-0.0671842,0.0284223,39
1429009328722,95,-0.121255,-0.0463209,0.051773,36
1429009328747,95,-0.0366086,0.00701645,0.149238,34
1429009328778,95,0.0765529,0.0798835,0.281401,31
1429009328813,95,0.186055,0.135495,0.330148,27
1429009328855,95,0.208373,0.132356,0.197892,22
1429009328879,95,0.160321,0.0755735,-0.0185099,21
1429009328914,95,-0.00659352,-0.0257393,-0.269039,24
1429009328946,95,-0.111852,-0.0757629,-0.297928,38
1429009328987,95,-0.150789,-0.068873,-0.185419,64
1429009329014,95,-0.0826906,-0.01806,0.0367872,70
1429009329056,95,-0.00210889,0.0209962,0.196405,71
1429009329080,96,0.126481,0.0599273,0.288572,67
1429009329113,96,0.0665612,-0.00558246,0.119502,58
1429009329146,96,-0.0656735,-0.102105,-0.150136,49
1429009329187,96,-0.245354,-0.199057,-0.410505,44
1429009329214,96,-0.257951,-0.189008,-0.452516,44
1429009329255,96,-0.209815,-0.125195,-0.360548,44
1429009329278,96,-0.120481,-0.0514968,-0.234978,43
1429009329319,96,-0.0208051,0.0109185,-0.127223,39
1429009329361,96,0.0672421,0.0442853,0.0123376,35
1429009329402,96,0.0834132,0.0287834,0.0397769,30
1429009329443,96,0.0982808,0.0185115,0.0925329,27
1429009329485,96,0.210733,0.0795107,0.269921,27
1429009329533,96,0.294871,0.146759,0.411654,38
1429009329544,96,0.317417,0.223231,0.538628,45
1429009329585,96,0.132785,0.173226,0.388263,71
1429009329626,96,-0.0703493,0.0952675,0.169403,75
1429009329667,97,-0.290816,-0.0312949,-0.181687,70
1429009329709,97,-0.306596,-0.0874396,-0.348463,56
1429009329750,97,-0.24989,-0.120781,-0.449516,49
1429009329791,97,-0.0243939,-0.0537206,-0.212426,45
1429009329832,97,0.189068,0.0247336,0.0885579,44
1429009329876,97,0.311349,0.0784241,0.325409,42
1429009329918,97,0.278472,0.0598445,0.31909,39
1429009329959,97,0.0293195,-0.0877531,-0.0512906,33
1429009330000,97,-0.139908,-0.175202,-0.365562,30
1429009330041,97,-0.199895,-0.213654,-0.574714,26
1429009330082,97,-0.149406,-0.145233,-0.475145,23
1429009330124,97,-0.0209348,0.00159871,-0.0964041,30
1429009330168,97,0.156602,0.203819,0.455839,44
1429009330179,97,0.214979,0.29603,0.75865,54
1429009330220,97,0.243363,0.329763,0.806984,72
1429009330261,96,0.110519,0.188975,0.456496,70
1429009330302,96,-0.0385874,0.0259832,0.0419318,62
1429009330344,96,-0.20024,-0.145271,-0.333137,49
1429009330385,96,-0.326102,-0.269944,-0.5643,44
1429009330426,96,-0.328892,-0.296746,-0.57799,43
1429009330467,96,-0.168042,-0.182714,-0.304287,42
1429009330508,96,0.0663992,-0.0157546,0.037546,39
1429009330549,96,0.227928,0.118066,0.302529,36
1429009330590,96,0.255981,0.170805,0.378244,30
1429009330631,96,0.0868313,0.0846316,0.181192,27
1429009330673,96,-0.182083,-0.071561,-0.124142,23
1429009330715,96,-0.368442,-0.200827,-0.373228,22
1429009330756,96,-0.379397,-0.233207,-0.431043,22
1429009330797,96,-0.256782,-0.186687,-0.350269,33
1429009330842,96,-0.0732828,-0.0971886,-0.217116,58
1429009330853,96,0.0531183,-0.0157143,-0.0754132,58
1429009330897,96,0.0836993,0.0376415,-5.64179e-05,72
1429009330910,96,0.128842,0.124407,0.156223,71
1429009330952,96,0.24305,0.260554,0.384381,64
1429009330994,96,0.39815,0.367078,0.555966,51
1429009331035,96,0.517894,0.40251,0.596082,45
1429009331077,96,0.566196,0.367741,0.512119,44
1429009331118,96,0.530997,0.292965,0.376461,43
1429009331159,96,0.280858,0.107248,0.0835116,40
1429009331201,96,-0.0513531,-0.109216,-0.175227,37
1429009331243,96,-0.371612,-0.312684,-0.413364,31
1429009331284,96,-0.494241,-0.386715,-0.431701,28
1429009331326,96,-0.349277,-0.289967,-0.246585,24
1429009331367,96,-0.0432333,-0.04495,0.111986,22
1429009331408,96,0.170264,0.145504,0.288137,20
1429009331450,96,0.209602,0.224049,0.306149,19
1429009331491,96,-0.00260559,0.0999854,0.0305598,32
1429009331533,96,-0.265546,-0.0895258,-0.247516,47
1429009331575,96,-0.483233,-0.279638,-0.50313,66
1429009331616,96,-0.545922,-0.351709,-0.596325,65
1429009331658,96,-0.351463,-0.215369,-0.405497,53
1429009331699,96,-0.0223707,0.0259079,-0.0436833,45
1429009331740,96,0.33707,0.277391,0.377873,41
1429009331782,96,0.54657,0.410401,0.664143,41
1429009331823,96,0.428189,0.289314,0.521467,42
1429009331864,96,0.136972,0.0323099,0.156547,39
1429009331905,96,-0.128335,-0.190921,-0.204373,35
1429009331947,96,-0.286782,-0.301027,-0.418593,29
1429009331988,96,-0.261564,-0.247367,-0.385415,26
1429009332029,96,-0.15437,-0.112488,-0.216284,22
1429009332071,96,-0.0697296,0.00850775,-0.0440748,20
1429009332112,96,-0.00310502,0.107226,0.100586,20
1429009332153,96,-0.00894542,0.108907,0.0798982,29
1429009332198,96,-0.0126257,0.0421184,-0.0172248,53
1429009332209,96,0.0431115,-0.0124141,-0.0857079,60
1429009332250,96,0.137568,-0.00771849,-0.0459216,66
1429009332293,95,0.217895,0.04856,0.0729768,58
1429009332304,95,0.271215,0.153201,0.265441,58
1429009332346,95,0.18881,0.15296,0.294806,44
1429009332358,95,-0.0204076,0.0327608,0.0957197,44
1429009332400,95,-0.206565,-0.131176,-0.141464,38
1429009332443,95,-0.285684,-0.2355,-0.305439,40
1429009332454,95,-0.348891,-0.329817,-0.420862,40
1429009332496,95,-0.285053,-0.304232,-0.353239,39
1429009332509,95,-0.10656,-0.158614,-0.11073,38
1429009332550,95,0.108436,0.0371289,0.169111,34
1429009332592,95,0.286391,0.215922,0.374334,30
1429009332603,95,0.331963,0.27648,0.360498,28
1429009332645,95,0.269522,0.239617,0.211905,23
1429009332686,95,0.126032,0.146887,0.0273762,20
1429009332697,95,0.00242977,0.044409,-0.135245,19
1429009332738,95,-0.0373811,0.0347982,-0.135051,18
1429009332750,95,0.025863,0.0981112,0.0420799,20
1429009332793,95,0.13172,0.180894,0.245865,30
1429009332813,95,0.253336,0.263816,0.479906,47
1429009332855,95,0.277598,0.246143,0.519958,65
1429009332878,95,0.228505,0.172353,0.416437,72
1429009332919,96,0.0130399,-0.02885,0.0622716,68
1429009332945,96,-0.203358,-0.237729,-0.313801,58
1429009332987,96,-0.472051,-0.445308,-0.69548,48
1429009333014,96,-0.642611,-0.570605,-0.893424,41
1429009333056,96,-0.596491,-0.475482,-0.702558,40
1429009333078,96,-0.413076,-0.279446,-0.348088,40
1429009333120,96,-0.0992024,-0.0222373,0.058927,40
1429009333147,96,0.188126,0.195369,0.3621,39
1429009333178,96,0.321924,0.26643,0.420032,35
1429009333219,96,0.295837,0.22178,0.302976,30
1429009333246,96,0.200957,0.155058,0.172669,26
1429009333287,96,0.0539627,0.0548988,0.0130356,23
1429009333313,96,-0.0814352,-0.0465884,-0.133197,20
1429009333355,96,-0.0268851,-0.0173788,-0.112851,18
1429009333378,96,0.0363773,-0.0120937,-0.129291,18
1429009333414,96,0.1133,0.0268127,-0.0691779,28
1429009333455,96,0.122928,0.0219933,-0.0301571,46
1429009333484,96,0.109077,0.0464031,0.0917532,65
1429009333514,96,0.0641731,0.0501302,0.174653,72
1429009333555,96,-0.0358811,0.000674496,0.148137,69
1429009333596,96,-0.0986605,-0.0279953,0.126611,56
1429009333637,96,-0.162162,-0.0712236,0.0429368,47
1429009333679,96,-0.198934,-0.110893,-0.0747731,42
1429009333726,96,-0.0572887,-0.058534,-0.042719,42
1429009333737,96,0.108621,0.0112166,0.0293259,42
1429009333778,96,0.218235,0.0717372,0.120977,40
1429009333819,96,0.133831,0.0296927,0.0722103,37
1429009333860,96,-0.0917358,-0.0781606,-0.0714378,30
1429009333902,96,-0.370281,-0.234336,-0.347898,26
1429009333943,96,-0.439932,-0.264313,-0.445147,23
1429009333984,96,-0.247738,-0.130909,-0.304757,19
1429009334025,96,0.133834,0.126731,0.0397343,17
1429009334066,96,0.47358,0.320908,0.307469,29
1429009334107,96,0.662953,0.419038,0.466837,48
1429009334148,96,0.643063,0.427901,0.504998,72
1429009334190,96,0.482725,0.375577,0.464269,72
1429009334231,96,0.232486,0.262529,0.329645,59
1429009334274,96,-0.0973963,0.0749065,0.0627028,48
1429009334315,96,-0.356303,-0.12862,-0.190104,41
1429009334356,96,-0.518357,-0.302123,-0.37928,41
1429009334397,96,-0.486686,-0.331741,-0.335615,41
1429009334439,96,-0.30593,-0.244794,-0.152585,39
1429009334480,96,-0.0705601,-0.128263,0.00697681,34
1429009334522,96,0.0413306,-0.0882533,-0.000682204,30
1429009334563,96,0.0382487,-0.11998,-0.123573,24
1429009334604,96,-0.104468,-0.237688,-0.36206,21
1429009334645,96,-0.204838,-0.289129,-0.466947,19
1429009334686,96,-0.223725,-0.241113,-0.386196,17
1429009334727,96,-0.126569,-0.0985556,-0.157596,23
1429009334768,96,-0.0487114,0.0339522,0.0318276,48
1429009334810,96,0.0328697,0.142014,0.189111,66
1429009334851,96,0.0818481,0.193177,0.240196,69
1429009334892,95,0.166972,0.251077,0.28956,61
1429009334934,95,0.277958,0.298066,0.359776,46
1429009334976,95,0.391843,0.337705,0.447127,40
1429009335017,95,0.393397,0.29744,0.453707,40
1429009335058,95,0.248896,0.158098,0.295324,40
1429009335099,95,0.0696543,0.0122186,0.0941816,38
1429009335141,95,-0.12212,-0.156764,-0.170937,34
1429009335183,95,-0.200261,-0.205459,-0.27157,28
1429009335225,95,-0.24605,-0.230931,-0.322919,25
1429009335267,95,-0.163811,-0.144402,-0.204199,21
1429009335308,95,-0.0659516,-0.073642,-0.088844,19
1429009335349,95,0.0383637,0.00189763,-0.0066821,16
1429009335390,95,0.0981266,0.0462931,0.0289815,23
1429009335431,95,0.108577,0.0662598,0.0488179,47
1429009335472,95,0.0697942,0.0705783,0.0824789,62
1429009335514,95,0.0615278,0.100299,0.187063,65
1429009335555,94,0.0588738,0.111646,0.240451,54
1429009335596,94,0.00118022,0.0294189,0.0970224,43
1429009335639,94,-0.0912769,-0.0795467,-0.141917,34
1429009335681,94,-0.21575,-0.209517,-0.436105,34
1429009335722,94,-0.355643,-0.322374,-0.675062,37
1429009335763,94,-0.370181,-0.31737,-0.6769,35
1429009335804,94,-0.221228,-0.168272,-0.392685,30
1429009335846,94,-0.0441454,0.00197832,-0.0686945,27
1429009335888,94,0.144585,0.166518,0.266899,21
1429009335930,94,0.223175,0.215178,0.434073,18
1429009335972,94,0.310506,0.246669,0.576436,16
1429009335983,94,0.38957,0.298019,0.714196,18
1429009336025,94,0.410542,0.331551,0.75434,31
1429009336066,94,0.285586,0.262218,0.551295,59
1429009336108,94,0.0371387,0.094281,0.124406,69
1429009336149,94,-0.182798,-0.0818805,-0.274356,63
1429009336191,94,-0.351532,-0.246596,-0.587534,51
1429009336203,94,-0.378621,-0.327856,-0.673487,45
1429009336244,94,-0.324776,-0.327869,-0.604093,38
1429009336285,94,-0.164699,-0.22259,-0.333099,36
1429009336327,94,-0.0669431,-0.12251,-0.0990877,38
1429009336368,94,0.00682579,-0.0132025,0.103431,37
1429009336409,94,0.0367675,0.0583688,0.200842,34
1429009336451,94,0.0525579,0.0960321,0.202736,28
1429009336493,94,0.036344,0.0637607,0.10119,24
1429009336534,94,0.0413952,0.0276554,0.000847373,19
1429009336575,94,0.00140634,-0.0540294,-0.13576,17
1429009336616,94,-0.0328818,-0.0754775,-0.179248,23
1429009336657,94,-0.00809705,-0.0212504,-0.107857,51
1429009336699,94,0.0187265,0.0432394,-0.0312311,71
1429009336740,94,0.115652,0.145175,0.121416,77
1429009336782,94,0.147986,0.182711,0.175007,68
1429009336823,94,0.174502,0.17686,0.222422,51
1429009336836,94,0.237622,0.176008,0.334984,46
1429009336877,94,0.291511,0.174627,0.461027,42
1429009336889,94,0.268529,0.112044,0.443693,41
1429009336930,94,0.0949757,-0.0172852,0.217438,42
1429009336942,94,-0.120781,-0.144582,-0.10279,43
1429009336984,94,-0.262397,-0.202922,-0.318507,41
1429009336995,94,-0.16417,-0.098563,-0.209956,40
1429009337036,94,-0.0775179,-0.0239065,-0.108507,34
1429009337077,94,-0.0532933,-0.00283213,-0.0192171,30
1429009337118,94,-0.234036,-0.133106,-0.186178,26
1429009337129,94,-0.44346,-0.298261,-0.460786,24
1429009337171,94,-0.485013,-0.341237,-0.597571,20
1429009337182,94,-0.291085,-0.214737,-0.518764,20
1429009337223,94,0.108014,0.082093,-0.133645,28
1429009337265,94,0.449334,0.342546,0.251676,45
1429009337279,94,0.581522,0.450501,0.492472,56
1429009337322,94,0.47646,0.363788,0.49529,76
1429009337346,94,0.193303,0.139282,0.327453,76
1429009337387,94,-0.0903657,-0.0709587,0.134499,64
1429009337413,94,-0.256691,-0.196033,0.0263444,58
1429009337455,94,-0.210812,-0.150509,0.0681991,45
1429009337480,94,-0.0596264,-0.0369274,0.127777,43
1429009337514,94,0.00411467,0.00189344,0.0263258,42
1429009337545,94,0.00592416,-0.0167824,-0.163709,42
1429009337586,94,-0.121309,-0.142393,-0.436918,42
1429009337613,94,-0.259185,-0.25319,-0.640186,40
1429009337655,94,-0.216358,-0.217667,-0.503361,33
1429009337680,94,-0.107015,-0.112289,-0.237829,31
1429009337714,94,0.145122,0.0956417,0.220964,27
1429009337747,94,0.320696,0.257761,0.564791,24
1429009337778,94,0.331907,0.291443,0.634527,21
1429009337819,94,0.196891,0.203852,0.443163,21
1429009337860,94,0.0491599,0.0930445,0.15399,32
1429009337902,94,-0.0419949,0.00362166,-0.0837402,61
1429009337943,94,-0.0971445,-0.0596239,-0.246517,73
1429009337984,95,-0.12548,-0.0785414,-0.266214,72
1429009338025,95,-0.093149,-0.0506717,-0.17937,57
1429009338066,95,-0.110723,-0.0398667,-0.112654,47
1429009338108,95,-0.0544518,0.00408194,0.0351065,40
1429009338149,95,0.0382924,0.0506254,0.188037,40
1429009338190,95,0.0909555,0.0396958,0.208859,40
1429009338232,95,0.11805,0.012354,0.195663,39
1429009338273,95,0.0428264,-0.070427,0.0521878,33
1429009338314,95,-0.0383494,-0.141781,-0.107428,29
1429009338356,95,-0.0732758,-0.134212,-0.172614,24
1429009338396,95,-0.049778,-0.0671609,-0.14695,21
1429009338438,95,-0.00340268,0.00220573,-0.0973626,19
1429009338480,95,0.0103046,0.0375486,-0.0728707,26
1429009338522,95,0.0258431,0.0572039,-0.0405409,51
1429009338563,95,-0.0197084,0.0538342,-0.0246332,66
1429009338604,95,-0.0738821,0.0518653,-0.0093465,67
1429009338645,95,-0.0667869,0.0752893,0.0343966,58
1429009338687,95,-0.0607544,0.0476518,0.000706348,46
1429009338729,95,-0.038637,-0.010873,-0.0749512,42
1429009338771,95,0.0436365,-0.0467356,-0.09941,42
1429009338815,95,0.173735,-0.00928776,-0.00951002,42
1429009338831,95,0.220592,0.0224839,0.0645402,41
1429009338842,95,0.188292,0.0458026,0.116528,40
1429009338883,95,0.110952,0.055423,0.169755,38
1429009338925,95,0.0630308,0.0737328,0.236132,32
1429009338970,95,-0.0376173,0.0200684,0.150874,29
1429009338982,95,-0.115614,-0.0275409,0.0648132,27
1429009339023,95,-0.160642,-0.0778481,-0.0262132,23
1429009339064,95,-0.201431,-0.118452,-0.0991154,23
1429009339105,95,-0.255691,-0.157831,-0.203045,38
1429009339146,95,-0.237948,-0.138654,-0.207785,53
1429009339187,95,-0.146749,-0.0583008,-0.124832,63
1429009339229,96,-0.0115396,0.0507982,0.02006,61
1429009339270,96,0.131577,0.174973,0.179812,52
1429009339312,96,0.225254,0.244034,0.264088,41
1429009339353,96,0.293292,0.26073,0.262515,40
1429009339394,96,0.298623,0.19007,0.195674,41
1429009339435,96,0.277848,0.088093,0.132601,41
1429009339477,96,0.184519,-0.0310286,0.0413309,38
1429009339519,96,0.0695042,-0.107715,0.000832669,35
1429009339561,96,-0.0897871,-0.164485,-0.0805414,31
1429009339602,96,-0.190464,-0.166846,-0.173894,28
1429009339643,96,-0.234627,-0.16354,-0.268207,25
1429009339684,96,-0.234735,-0.150521,-0.335281,33
1429009339726,96,-0.15214,-0.104626,-0.277181,54
1429009339767,96,-0.0722473,-0.0186125,-0.137024,65
1429009339808,96,-0.0396866,0.053506,0.00534989,63
1429009339850,96,-0.0656738,0.0736931,0.0470597,55
1429009339891,96,-0.0537499,0.0887638,0.108294,44
1429009339932,96,-0.0477707,0.0355686,0.0736572,41
1429009339973,96,-0.1241,-0.0959294,-0.06823,42
1429009340014,96,-0.224842,-0.227739,-0.27272,41
1429009340055,96,-0.257701,-0.271814,-0.381686,40
1429009340096,96,-0.113894,-0.15396,-0.22896,35
1429009340138,96,0.0913043,0.0212012,0.0123556,31
1429009340179,96,0.326393,0.199562,0.294063,27
1429009340221,96,0.462446,0.305252,0.440711,26
1429009340262,96,0.460798,0.314146,0.426063,36
1429009340304,96,0.3538,0.265545,0.336962,52
1429009340345,96,0.214367,0.194887,0.241865,70
1429009340386,98,0.0914922,0.137119,0.223786,70
1429009340427,98,0.0835642,0.152804,0.30939,59
1429009340468,98,0.0362934,0.112101,0.294862,51
1429009340510,98,-0.0871337,-0.0282012,0.0670714,45
1429009340553,98,-0.27245,-0.211712,-0.307,44
1429009340564,98,-0.395337,-0.33802,-0.605867,44
1429009340605,98,-0.389469,-0.372091,-0.698891,43
1429009340646,98,-0.212245,-0.228435,-0.46221,39
1429009340687,98,-0.0728328,-0.106055,-0.19028,36
1429009340728,98,0.0465652,0.0112882,0.0945347,31
1429009340770,98,0.00737624,0.00520507,0.167611,28
1429009340811,98,-0.0229996,-0.0146695,0.160925,26
1429009340852,98,-0.0776122,-0.0693364,0.041333,33
1429009340893,98,-0.108605,-0.0998774,-0.0931798,56
1429009340934,98,-0.0951351,-0.0709442,-0.152407,70
1429009340975,98,-0.020094,0.0236776,-0.105384,73
1429009341016,99,0.0272143,0.0833636,-0.0342663,63
1429009341057,99,0.0715409,0.148274,0.0706923,54
1429009341099,99,0.152044,0.190478,0.157756,46
1429009341109,99,0.0988327,0.120006,0.126447,46
1429009341151,99,0.0281365,0.0217395,0.0518774,45
1429009341193,99,-0.124707,-0.135881,-0.0676237,44
1429009341234,99,-0.230952,-0.240283,-0.139578,40
1429009341245,99,-0.270034,-0.268979,-0.174459,38
1429009341287,99,-0.137716,-0.152771,-0.0760447,35
1429009341298,99,0.0504388,-0.00476096,0.0453061,33
1429009341339,99,0.285812,0.169445,0.199405,30
1429009341350,99,0.474764,0.315711,0.333562,28
1429009341391,99,0.649564,0.489697,0.528417,26
1429009341433,99,0.664491,0.5636,0.614186,23
1429009341474,99,0.532463,0.532513,0.559116,25
1429009341485,99,0.169955,0.290816,0.261517,30
1429009341526,99,-0.276292,-0.0764972,-0.181516,43
1429009341540,99,-0.657422,-0.449061,-0.611392,52
1429009341581,99,-0.745055,-0.625217,-0.811894,69
1429009341592,99,-0.565483,-0.568125,-0.731476,69
1429009341634,99,-0.199487,-0.308302,-0.377988,65
1429009341646,99,0.00897734,-0.099903,-0.0657019,61
1429009341687,99,0.116967,0.0614335,0.221272,53
1429009341713,99,0.0545898,0.0691287,0.298218,47
1429009341755,99,0.0494645,0.0882061,0.297171,44
1429009341778,99,0.0863467,0.100016,0.264234,43
1429009341819,99,0.169215,0.112775,0.19095,42
1429009341846,99,0.223006,0.146313,0.171016,40
1429009341887,99,0.191339,0.121347,0.0802636,38
1429009341913,99,0.07778,0.0656224,-0.0600459,34
1429009341955,99,-0.0720075,-0.00936143,-0.17509,31
1429009341978,99,-0.151017,-0.0580394,-0.181474,30
1429009342019,99,-0.0456192,0.0212599,-0.0149483,25
1429009342060,99,0.143111,0.159704,0.218798,23
1429009342101,99,0.308197,0.30617,0.372203,22
1429009342143,99,0.179038,0.199562,0.175327,21
1429009342185,99,-0.0327586,0.00648369,-0.138646,21
1429009342226,99,-0.277384,-0.219879,-0.430392,24
1429009342267,99,-0.327495,-0.285393,-0.477834,44
1429009342308,99,-0.275588,-0.274758,-0.379875,60
1429009342349,99,-0.175088,-0.204291,-0.223188,68
1429009342391,99,-0.109711,-0.182899,-0.158321,63
1429009342432,99,0.0250364,-0.0684061,-0.0399921,52
1429009342473,99,0.103243,-0.0121809,0.00453098,47
1429009342515,99,0.187743,0.100646,0.15805,44
1429009342557,99,0.17794,0.146463,0.279209,44
1429009342598,99,-0.0189387,0.0162617,0.221997,41
1429009342640,99,-0.195833,-0.120365,0.107905,38
1429009342681,99,-0.382776,-0.288911,-0.0899628,34
1429009342723,99,-0.422749,-0.353404,-0.267352,31
1429009342764,99,-0.176546,-0.180493,-0.188834,27
1429009342806,99,0.130388,0.0886891,0.0122603,25
1429009342847,99,0.442527,0.363371,0.321071,23
1429009342888,99,0.67836,0.622504,0.62147,22
1429009342930,99,0.702346,0.692521,0.720957,22
1429009342971,99,0.626767,0.654148,0.700583,21
1429009343012,99,0.421854,0.481954,0.47452,23
1429009343054,99,0.0915993,0.147189,0.0791306,33
1429009343095,99,-0.203013,-0.155676,-0.309084,47
1429009343136,99,-0.492224,-0.45662,-0.65993,64
1429009343177,99,-0.626849,-0.595497,-0.814466,64
1429009343219,99,-0.557559,-0.518902,-0.697054,54
1429009343260,99,-0.289272,-0.27,-0.366257,48
1429009343301,99,0.0116287,-0.0015592,-0.0204956,44
1429009343343,99,0.248212,0.164415,0.19428,44
1429009343384,99,0.261401,0.13925,0.176777,43
1429009343425,99,0.0338171,-0.0769367,-0.0619724,40
1429009343465,99,-0.186622,-0.242436,-0.24685,36
1429009343507,99,-0.355516,-0.339649,-0.358776,33
1429009343548,99,-0.288064,-0.232507,-0.210826,30
1429009343589,99,-0.0535764,-0.0205707,0.0487492,28
1429009343630,99,0.230441,0.221091,0.37742,26
1429009343671,99,0.410538,0.359628,0.553233,25
1429009343713,99,0.383764,0.323951,0.543039,24
1429009343754,99,0.201714,0.17933,0.346653,23
1429009343795,99,0.0235038,0.0526424,0.167524,23
1429009343837,99,-0.1282,-0.0545063,-0.0186854,36
1429009343878,99,-0.181798,-0.0833255,-0.12591,48
1429009343920,99,-0.221747,-0.117006,-0.278859,60
1429009343961,99,-0.243418,-0.140663,-0.39165,58
1429009344002,99,-0.157819,-0.118147,-0.35215,51
1429009344044,99,-0.0651943,-0.0689137,-0.201069,42
1429009344085,99,0.0898309,0.0254426,0.0935007,40
1429009344126,99,0.19095,0.103705,0.324808,40
1429009344167,99,0.227179,0.154304,0.428202,40
1429009344208,99,0.260428,0.197427,0.454582,38
1429009344250,99,0.173371,0.145172,0.267513,34
1429009344292,99,0.00696343,0.0153339,-0.0154266,31
1429009344303,99,-0.156897,-0.107759,-0.238567,29
1429009344344,99,-0.277422,-0.202018,-0.382546,27
1429009344385,99,-0.314394,-0.249157,-0.451042,25
1429009344426,99,-0.257066,-0.208759,-0.408502,23
1429009344468,99,-0.166506,-0.154446,-0.367588,22
1429009344510,99,-0.0149664,-0.0418881,-0.214988,24
1429009344551,99,0.17196,0.103883,0.0297208,40
1429009344592,99,0.275275,0.184175,0.181954,53
1429009344633,99,0.277307,0.233055,0.330501,60
1429009344675,99,0.171141,0.219121,0.401264,56
1429009344716,99,0.0316735,0.154692,0.359231,45
1429009344758,99,-0.0145599,0.0948344,0.297728,40
1429009344799,99,-0.0884678,-0.0336675,0.0857312,39
1429009344840,99,-0.152229,-0.159209,-0.145677,40
1429009344881,99,-0.256384,-0.277052,-0.392674,39
1429009344923,99,-0.239337,-0.270676,-0.394794,36
1429009344964,99,-0.0681906,-0.149528,-0.183028,33
1429009345005,99,0.208999,0.0554347,0.201423,28
1429009345047,99,0.386197,0.181628,0.408014,26
1429009345088,99,0.404864,0.228862,0.435971,23
1429009345129,99,0.27227,0.17192,0.242799,22
1429009345171,99,-0.0461427,0.00715779,-0.138688,23
1429009345182,99,-0.296633,-0.126862,-0.386928,23
1429009345223,99,-0.411213,-0.196071,-0.455251,40
1429009345264,99,-0.328804,-0.171568,-0.341886,56
1429009345305,99,-0.108894,-0.0655943,-0.108218,65
1429009345346,98,0.089432,0.040374,0.054202,60
1429009345388,98,0.134995,0.072763,0.076256,48
1429009345429,98,0.00570857,0.000956703,-0.080883,42
1429009345470,98,-0.155039,-0.0795348,-0.187499,40
1429009345512,98,-0.277049,-0.150184,-0.246696,40
1429009345554,98,-0.224179,-0.129394,-0.124589,39
1429009345565,98,-0.120701,-0.0610785,0.047063,39
1429009345606,98,-0.0214226,0.000826509,0.124547,36
1429009345649,98,0.135325,0.0901742,0.242948,33
1429009345690,98,0.281497,0.16821,0.358591,28
1429009345732,98,0.503088,0.287517,0.59118,26
1429009345773,98,0.580747,0.336611,0.700486,24
1429009345814,98,0.462631,0.281942,0.559079,22
1429009345856,98,0.182976,0.125418,0.197933,31
1429009345867,98,-0.112372,-0.0521777,-0.207499,31
1429009345909,98,-0.358226,-0.21691,-0.510977,53
1429009345919,98,-0.451232,-0.281411,-0.57693,61
1429009345961,98,-0.413802,-0.253157,-0.452433,68
1429009345973,98,-0.260105,-0.146303,-0.237708,68
1429009346014,97,-0.140133,-0.0651983,-0.156268,63
1429009346025,97,0.00144284,0.0190078,-0.0764021,59
1429009346066,97,0.100669,0.0600912,-0.0453001,51
1429009346079,97,0.113697,0.0428909,-0.0561764,47
1429009346121,97,0.0702789,-0.00929484,-0.0677611,42
1429009346145,97,0.00488701,-0.0684273,-0.115065,42
1429009346186,97,-0.0489959,-0.109266,-0.113829,42
1429009346213,97,-0.115233,-0.124727,-0.0977256,41
1429009346255,97,-0.160673,-0.120317,-0.0877462,38
1429009346278,97,-0.141853,-0.0717138,-0.0236202,36
1429009346318,97,-0.0216062,0.0266876,0.0995271,33
1429009346360,97,0.162777,0.15401,0.282474,29
1429009346401,97,0.346968,0.284854,0.447181,26
1429009346442,97,0.415645,0.33398,0.535334,24
1429009346484,97,0.367072,0.309773,0.529977,23
1429009346525,97,0.215635,0.203333,0.40894,30
1429009346567,97,0.0364014,0.0579305,0.185363,43
1429009346609,97,-0.126641,-0.0914583,-0.109316,64
1429009346650,97,-0.245088,-0.199869,-0.38096,66
1429009346692,96,-0.28802,-0.226814,-0.49529,57
1429009346734,96,-0.234601,-0.165279,-0.389805,49
1429009346775,96,-0.115179,-0.0636412,-0.159236,41
1429009346817,96,0.0439008,0.050242,0.119625,40
1429009346858,96,0.168748,0.117381,0.300774,40
1429009346899,96,0.209842,0.112693,0.315601,39
1429009346941,96,0.149519,0.0371593,0.219601,35
1429009346982,96,-0.0638985,-0.130064,-0.0882596,32
1429009347023,96,-0.242949,-0.241586,-0.333925,28
1429009347069,96,-0.273255,-0.234069,-0.392202,26
1429009347080,96,-0.178393,-0.134484,-0.306213,25
1429009347121,96,-0.0134153,0.00784997,-0.127984,23
1429009347162,96,0.0985567,0.109292,-0.000190382,22
1429009347203,96,0.137367,0.141424,0.0340086,22
1429009347245,96,0.105222,0.121644,0.0120221,37
1429009347286,96,0.0227459,0.0720971,-0.038644,51
1429009347327,96,-0.0412191,0.0305518,-0.0504539,62
1429009347368,95,-0.101301,-0.0110044,-0.0737325,58
1429009347409,95,-0.0550858,-0.00126788,-0.00409609,47
1429009347450,95,0.0396415,0.030304,0.103151,41
1429009347492,95,0.144764,0.0631972,0.210234,38
1429009347533,95,0.146961,0.0581608,0.214943,38
1429009347574,95,0.074506,0.0216057,0.182061,37
1429009347615,95,-0.0422321,-0.0409266,0.0692336,34
1429009347657,95,-0.134253,-0.0874822,-0.0296777,31
1429009347698,95,-0.14393,-0.102216,-0.0735229,28
1429009347739,95,-0.0600042,-0.0635748,-0.0317831,24
1429009347780,95,0.00241849,-0.040087,-0.0678372,22
1429009347822,95,0.0820909,0.00428408,-0.0421442,21
1429009347863,95,0.156415,0.0583266,0.0268345,20
1429009347905,95,0.20455,0.111985,0.107954,20
1429009347946,95,0.210211,0.132772,0.184469,25
1429009347987,95,0.140218,0.103164,0.154472,36
1429009348028,95,0.0333337,0.0569423,0.0821822,54
1429009348069,95,-0.114382,-0.0203716,-0.0889829,57
1429009348110,93,-0.257291,-0.0966032,-0.279539,50
1429009348152,93,-0.396426,-0.15825,-0.440496,43
1429009348193,93,-0.377172,-0.142449,-0.370011,38
1429009348234,93,-0.274182,-0.103735,-0.196937,38
1429009348275,93,-0.0901746,-0.0389774,0.0398968,39
1429009348317,93,0.106214,0.0159842,0.241686,38
1429009348358,93,0.235682,0.064179,0.365464,34
1429009348399,93,0.306548,0.0974747,0.399277,32
1429009348440,93,0.287273,0.11372,0.342806,29
1429009348481,93,0.212258,0.100931,0.204086,27
1429009348522,93,0.112629,0.0585049,-0.00947022,25
1429009348564,93,-0.00913538,-0.0193043,-0.252084,24
1429009348606,93,-0.069261,-0.0563465,-0.34064,24
1429009348649,93,-0.0214696,-0.0245264,-0.230281,36
1429009348660,93,-0.000705451,0.00300814,-0.09722,42
1429009348702,93,-0.0170675,0.0143262,0.0038583,55
1429009348744,93,-0.0761028,0.00542942,0.00969786,59
1429009348785,93,-0.14322,-0.0225786,-0.0847628,54
1429009348826,93,-0.125584,-0.0273586,-0.113872,43
1429009348867,93,-0.0749975,-0.0330713,-0.0888673,40
1429009348910,93,0.0891016,0.0291193,0.133151,39
1429009348951,93,0.179841,0.0676388,0.294739,40
1429009348992,93,0.157889,0.0640856,0.348358,38
1429009349034,93,0.0604274,0.0180055,0.251753,36
1429009349075,93,-0.0203589,-0.0296093,0.0997273,32
1429009349117,93,-0.0486298,-0.0527995,-0.0492177,30
1429009349158,93,-0.0156104,-0.0371754,-0.10457,28
1429009349200,93,0.0695218,0.0293527,-0.0250044,26
1429009349246,93,0.102157,0.0647192,0.0358073,26
1429009349257,93,0.106598,0.0822801,0.0625006,26
1429009349299,93,0.0257861,0.0422519,-0.0122984,41
1429009349340,93,-0.0691255,0.000505411,-0.10127,55
1429009349381,93,-0.191585,-0.0367561,-0.177099,65
1429009349422,93,-0.299794,-0.0882849,-0.264407,62
1429009349463,93,-0.35151,-0.129404,-0.337375,51
1429009349505,93,-0.215478,-0.105902,-0.250777,45
1429009349546,93,-0.0585587,-0.0828895,-0.13989,43
1429009349587,93,0.0985985,-0.0350017,0.0189823,43
1429009349628,93,0.18273,0.00141081,0.151658,42
1429009349670,93,0.195561,0.0204488,0.204872,40
1429009349712,93,0.0813527,-0.0348439,0.0866106,36
1429009349754,93,-0.0813319,-0.121289,-0.126088,33
1429009349765,93,-0.200774,-0.182433,-0.289789,32
1429009349806,93,-0.167798,-0.121746,-0.239438,30
1429009349848,93,-0.00969313,0.0200478,0.000394665,28
1429009349889,93,0.159827,0.180881,0.259293,28
1429009349900,93,0.304185,0.293936,0.480669,30
1429009349942,93,0.354879,0.324598,0.55095,40
1429009349983,93,0.298373,0.262485,0.4471,61
1429009349995,93,0.17406,0.133409,0.226215,66
1429009350035,93,0.0248641,-0.000988685,-0.00943271,69
1429009350077,93,-0.134369,-0.123591,-0.237618,64
1429009350118,93,-0.262737,-0.187464,-0.404635,54
1429009350159,93,-0.31245,-0.185288,-0.417504,48
1429009350201,93,-0.351718,-0.181766,-0.3744,45
1429009350212,93,-0.269003,-0.129436,-0.175727,45
1429009350253,93,-0.124521,-0.0621186,0.0378324,44
1429009350264,93,0.0307642,-0.0116075,0.170766,43
1429009350305,93,0.0878222,-0.00233852,0.152462,41
1429009350316,93,0.0329534,-0.03782,-0.0049026,40
1429009350357,93,-0.0384559,-0.0645192,-0.150261,37
1429009350398,93,-0.0572,-0.0625554,-0.260572,33
1429009350440,93,0.0778178,0.0214212,-0.152655,31
1429009350451,93,0.251179,0.12649,0.0552825,30
1429009350492,93,0.376447,0.211046,0.272123,28
1429009350504,93,0.41295,0.257906,0.424288,28
1429009350546,93,0.31043,0.209108,0.365892,26
1429009350558,93,0.125991,0.108679,0.175617,26
1429009350599,93,-0.0184669,0.0404676,0.0112694,32
1429009350645,93,-0.154357,-0.024977,-0.108001,50
1429009350656,93,-0.210047,-0.0645512,-0.145089,50
1429009350698,93,-0.258806,-0.115126,-0.148036,63
1429009350740,93,-0.24925,-0.141438,-0.0924546,61
1429009350781,93,-0.235717,-0.16059,-0.10381,52
1429009350823,93,-0.147784,-0.122346,-0.0419881,46
1429009350864,93,-0.0882726,-0.100165,-0.0240526,42
1429009350906,93,-0.0502812,-0.0820814,-0.00823142,41
1429009350947,93,-0.059291,-0.0882668,-0.0578111,40
1429009350990,93,-0.0448477,-0.0723211,-0.0971641,38
1429009351031,93,0.0181852,-0.0168293,-0.0946815,34
1429009351073,93,0.161672,0.0968075,0.0145291,31
1429009351114,93,0.292898,0.219646,0.193768,27
1429009351155,93,0.287721,0.240424,0.278834,25
1429009351197,93,0.196223,0.187211,0.286507,23
1429009351238,93,-0.0157157,0.0397687,0.1167,22
1429009351281,93,-0.18779,-0.0905603,-0.102684,22
1429009351322,93,-0.214383,-0.113771,-0.212252,21
1429009351363,93,-0.138413,-0.0763681,-0.237535,20
1429009351405,93,0.0134886,0.0200717,-0.114406,19
1429009351446,93,0.0783323,0.0494461,-0.0469914,20
1429009351488,93,0.132537,0.0695773,0.049553,34
1429009351529,93,0.115743,0.0373802,0.0706047,49
1429009351570,93,0.111413,0.00947237,0.0618283,61
1429009351611,93,0.024023,-0.0465505,-0.0336145,59
1429009351652,93,-0.0666413,-0.0867565,-0.128558,51
1429009351695,93,-0.133555,-0.0869808,-0.147606,46
1429009351736,93,-0.0991709,-0.0115399,-0.0202651,43
1429009351781,93,-0.0173215,0.0628341,0.139403,43
1429009351792,93,0.0861269,0.121348,0.275018,43
1429009351833,93,0.0491095,0.038481,0.177948,40
1429009351875,93,-0.0591618,-0.0972919,-0.0377729,39
1429009351916,93,-0.14562,-0.183998,-0.182387,35
1429009351957,93,-0.0848577,-0.133233,-0.132096,32
1429009351998,93,-0.0144156,-0.0484999,-0.0424506,30
1429009352040,93,0.055365,0.0314623,0.0377061,28
1429009352080,93,0.0240164,0.017802,-0.0290664,27
1429009352122,93,-0.0340411,-0.0298794,-0.146551,26
1429009352162,93,-0.0768611,-0.0729115,-0.206546,26
1429009352305,93,0.0232416,0.0104914,-0.0231342,30
1429009352346,93,0.196614,0.160294,0.262065,40
1429009352388,93,0.2983,0.260641,0.413162,53
1429009352429,93,0.318795,0.282512,0.431035,54
1429009352470,93,0.222356,0.206742,0.279318,47
1429009352512,93,0.089237,0.0919274,0.0919997,42
1429009352554,93,-0.0547982,-0.0348797,-0.110056,40
1429009352595,93,-0.146639,-0.101808,-0.19404,40
1429009352635,93,-0.231187,-0.15474,-0.270479,40
1429009352677,93,-0.230554,-0.13483,-0.202052,38
1429009352719,93,-0.215505,-0.126395,-0.138278,35
1429009352762,93,-0.142479,-0.0901491,-0.0538423,32
1429009352805,93,-0.0648102,-0.0586838,-0.00130178,28
1429009352835,93,0.0142045,-0.00637718,0.0481563,27
1429009352877,93,0.0347241,0.0124309,0.0132923,26
1429009352918,93,0.00226145,0.0165107,-0.034634,24
1429009352960,93,-0.0597767,-0.0180045,-0.107916,24
1429009353002,93,-0.0529163,-0.00732807,-0.0655267,23
1429009353015,93,-0.00366536,0.00873573,0.0127279,23
1429009353026,93,0.0805533,0.0329462,0.0873761,22
1429009353068,93,0.131744,0.030922,0.0864835,24
1429009353109,93,0.0926449,-0.00470806,-0.017633,33
1429009353150,93,-0.0218004,-0.0652945,-0.15485,49
1429009353192,93,-0.141983,-0.114486,-0.286851,54
1429009353234,93,-0.178242,-0.121439,-0.272256,50
1429009353275,93,-0.150928,-0.0975373,-0.174983,45
1429009353316,93,0.0348565,0.0145864,0.135076,40
1429009353358,93,0.222615,0.129797,0.431594,39
1429009353399,93,0.333091,0.189653,0.556149,40
1429009353440,93,0.248555,0.122643,0.361056,39
1429009353482,93,0.0666831,0.0170497,0.0392922,37
1429009353523,93,-0.133269,-0.0918396,-0.274178,33
1429009353567,93,-0.189741,-0.109326,-0.352825,29
1429009353578,93,-0.111705,-0.0267082,-0.217332,29
1429009353623,93,0.109302,0.134805,0.156785,26
1429009353634,93,0.255804,0.237865,0.451204,26
1429009353676,93,0.226301,0.217173,0.50433,25
1429009353718,93,-4.051e-05,0.0580949,0.228019,24
1429009353762,93,-0.305548,-0.169992,-0.24521,23
1429009353774,93,-0.540246,-0.369311,-0.706725,23
1429009353815,93,-0.568824,-0.421877,-0.896165,23
1429009353856,93,-0.318247,-0.282596,-0.648275,28
1429009353897,93,0.0249413,-0.0392221,-0.150736,39
1429009353939,93,0.322654,0.196899,0.351703,56
1429009353980,93,0.439517,0.318987,0.61724,59
1429009354022,93,0.38922,0.304989,0.610807,53
1429009354063,93,0.290237,0.213931,0.450874,47
1429009354104,93,0.114007,0.0672878,0.197056,41
1429009354145,93,0.00375889,-0.0315471,0.0311846,41
1429009354188,93,-0.116272,-0.112162,-0.160378,41
1429009354199,93,-0.161398,-0.135439,-0.257113,41
1429009354240,93,-0.13604,-0.101764,-0.216812,40
1429009354282,93,-0.0748632,-0.0620904,-0.140188,37
1429009354323,93,-0.00407328,-0.0246079,-0.00270688,33
1429009354365,93,0.0355314,-0.00965258,0.0460868,31
1429009354406,93,-0.0316971,-0.0531375,-0.038783,28
1429009354447,93,-0.160374,-0.112559,-0.22395,26
1429009354489,93,-0.202144,-0.129336,-0.304528,25
1429009354530,93,-0.144364,-0.0792825,-0.228827,24
1429009354542,93,0.0053271,0.0232734,-0.0347217,23
1429009354583,93,0.0651359,0.0822625,0.101773,23
1429009354625,93,0.0130441,0.0627199,0.0588089,30
1429009354638,93,-0.101604,0.00372041,-0.089073,36
1429009354649,93,-0.120507,-0.00437435,-0.164873,36
1429009354690,93,-0.0206574,0.0543331,-0.0834748,55
1429009354701,93,0.223824,0.17573,0.226178,55
1429009354743,93,0.448457,0.264588,0.560369,62
1429009354754,93,0.572044,0.296592,0.798692,60
1429009354795,90,0.474996,0.212704,0.728399,54
1429009354836,90,0.215054,0.0462684,0.372817,48
1429009354847,90,-0.115344,-0.129988,-0.0951684,46
1429009354889,90,-0.405514,-0.275037,-0.536599,42
1429009354930,90,-0.565693,-0.347073,-0.797881,42
1429009354972,90,-0.544857,-0.322907,-0.782547,41
1429009355013,90,-0.3293,-0.21015,-0.520632,40
1429009355054,90,-0.168995,-0.136063,-0.306001,36
1429009355095,90,-0.0768789,-0.0812098,-0.122683,33
1429009355137,90,-0.0774307,-0.0525744,-0.0176795,29
1429009355178,90,0.00830345,0.052773,0.204029,27
1429009355220,90,0.200979,0.22473,0.517068,25
1429009355265,90,0.457203,0.391201,0.780508,24
1429009355276,90,0.58224,0.437937,0.817367,24
1429009355317,90,0.465486,0.322584,0.567702,24
1429009355359,90,0.132387,0.0699365,0.0558508,28
1429009355400,90,-0.222565,-0.182805,-0.416554,38
1429009355441,90,-0.374329,-0.283438,-0.597566,57
1429009355482,90,-0.328771,-0.261226,-0.537818,62
1429009355524,88,-0.114223,-0.121839,-0.271995,56
1429009355565,88,0.0774811,0.00965135,0.000553156,50
1429009355611,88,0.181412,0.101655,0.213562,43
1429009355623,88,0.106886,0.0813214,0.186265,42
1429009355664,88,-0.0332408,0.00346784,0.0434662,42
1429009355708,88,-0.10028,-0.0588482,-0.0644069,42
1429009355749,88,-0.0285381,-0.056001,-0.0442836,40
1429009355790,88,0.0996501,0.00625561,0.0736089,37
1429009355831,88,0.255723,0.101146,0.20902,34
1429009355873,88,0.204036,0.103252,0.169922,30
1429009355915,88,-0.00128695,0.0130836,-0.0724806,28
1429009355956,88,-0.198436,-0.0811319,-0.255494,26
1429009355997,88,-0.299982,-0.134937,-0.307422,26
1429009356038,88,-0.29251,-0.135416,-0.230313,25
1429009356079,88,-0.269379,-0.12533,-0.150234,28
1429009356120,88,-0.176125,-0.0705338,-0.0507311,37
1429009356162,88,-0.112842,-0.0243411,-0.0303317,55
1429009356203,88,0.0420656,0.0897086,0.108483,59
1429009356244,86,0.171037,0.194571,0.257428,54
1429009356285,86,0.283716,0.261201,0.383786,47
1429009356327,86,0.296787,0.237646,0.362577,41
1429009356368,86,0.209942,0.121942,0.182905,40
1429009356409,86,0.0327545,-0.0501168,-0.0876347,41
1429009356450,86,-0.140159,-0.185278,-0.299893,40
1429009356492,86,-0.199096,-0.242131,-0.342251,38
1429009356533,86,-0.144886,-0.207479,-0.212107,36
1429009356575,86,-0.0018051,-0.10753,0.0189548,32
1429009356617,86,0.137565,0.0121015,0.229777,30
1429009356658,86,0.18361,0.0723593,0.243016,28
1429009356699,86,0.105929,0.0539197,0.0478583,27
1429009356740,86,0.0588064,0.0381569,-0.116359,37
1429009356782,86,0.0150209,0.0133772,-0.210009,47
1429009356823,86,-0.027756,-0.0132609,-0.224308,58
1429009356865,86,-0.0410081,-0.0243589,-0.169141,56
1429009356909,86,-0.0854798,-0.0351424,-0.105291,46
1429009356921,86,-0.0342005,0.0390601,0.0912555,46
1429009356963,86,-0.0198181,0.0831666,0.205021,40
