1429526283267,76,-0.00378819,0.00583848,0.0593484,41
1429526283308,76,0.0471569,0.06453,0.12581,35
1429526283320,76,0.083212,0.10471,0.158204,33
1429526283361,76,0.0986437,0.11898,0.153791,30
1429526283403,76,0.0917517,0.109688,0.12179,26
1429526283414,76,0.0731692,0.0853262,0.0795573,26
1429526283456,76,0.0492543,0.0562342,0.0401075,24
1429526283467,76,0.0254447,0.0301345,0.010847,24
1429526283508,76,0.00561323,0.0112847,-0.00573496,22
1429526283519,76,-0.00749029,0.00182057,-0.00796342,21
1429526283561,76,-0.014669,-0.00107541,-0.000444606,21
1429526283602,76,-0.0168278,-0.00181394,0.0102291,28
1429526283613,76,-0.0176135,-0.00606351,0.0139616,35
1429526283655,76,-0.0206537,-0.0177963,0.00202573,57
1429526283670,76,-0.0292098,-0.0388647,-0.0317763,62
1429526283711,76,-0.0430909,-0.0649079,-0.081944,64
1429526283738,76,-0.0596867,-0.0902518,-0.138511,59
1429526283780,76,-0.0726471,-0.105741,-0.182455,53
1429526283806,76,-0.0748551,-0.105446,-0.197886,45
1429526283847,76,-0.0615556,-0.0867043,-0.174098,40
1429526283871,76,-0.0324653,-0.051933,-0.111735,39
1429526283912,76,0.00721838,-0.00781202,-0.0239255,41
1429526283938,76,0.0461168,0.0347264,0.0656115,44
1429526283979,76,0.0736547,0.067303,0.134998,43
1429526284020,76,0.0825962,0.0840774,0.169583,39
1429526284061,76,0.0729763,0.0846463,0.165218,35
1429526284102,76,0.0514145,0.0746465,0.135367,27
1429526284144,76,0.0283387,0.0606995,0.0959491,23
1429526284185,76,0.0124539,0.0481294,0.0603574,19
1429526284227,76,0.00608629,0.0377509,0.0331727,17
1429526284270,76,0.00714083,0.0280499,0.0118601,17
1429526284311,76,0.0108257,0.0173348,-0.00891083,20
1429526284352,76,0.0131102,0.00640761,-0.0294296,31
1429526284395,76,0.0145516,-0.00102249,-0.0418917,50
1429526284436,76,0.0153226,-0.00245986,-0.0416209,58
1429526284482,76,0.0157207,0.0017655,-0.0245453,55
1429526284493,76,0.0128469,0.00680409,0.00167022,52
1429526284535,76,0.00424582,0.00680577,0.0266191,45
1429526284578,76,-0.0128895,-0.00326749,0.0362496,37
1429526284619,76,-0.0358108,-0.0224203,0.0261341,35
1429526284660,76,-0.0584893,-0.0448412,-0.000557129,39
1429526284701,76,-0.0719129,-0.061347,-0.0312178,41
1429526284743,76,-0.069541,-0.0644097,-0.0523223,39
1429526284784,76,-0.0519555,-0.0532852,-0.0580407,35
1429526284825,76,-0.024171,-0.0320983,-0.0472783,28
1429526284867,76,0.00378244,-0.00926701,-0.0278768,23
1429526284908,76,0.0215153,0.00567755,-0.011107,20
1429526284949,76,0.0240786,0.00831887,-0.00709616,18
1429526284991,76,0.0123143,-0.000559468,-0.0196679,17
1429526285032,76,-0.00762774,-0.0157623,-0.0474118,18
1429526285074,76,-0.0268544,-0.0300383,-0.0806183,33
1429526285116,76,-0.0381577,-0.037192,-0.105815,49
1429526285157,76,-0.0383801,-0.0349717,-0.111795,65
1429526285199,76,-0.028806,-0.0249741,-0.0937773,63
1429526285240,76,-0.0128155,-0.0103098,-0.0556621,55
1429526285281,76,0.0054416,0.00599751,-0.00400547,49
1429526285323,76,0.0218552,0.0199743,0.0460818,42
1429526285364,76,0.0316622,0.0283,0.0830683,41
1429526285405,76,0.0338828,0.0313398,0.102727,44
1429526285416,76,0.030019,0.0306148,0.106106,45
1429526285457,76,0.0221778,0.0290554,0.101026,46
1429526285499,76,0.0140502,0.0289873,0.0933488,43
1429526285540,76,0.00812847,0.0307057,0.0859535,39
1429526285581,76,0.00606311,0.0328544,0.0772708,36
1429526285622,76,0.00863913,0.0329489,0.0621489,31
1429526285664,76,0.0119457,0.027969,0.0374906,28
1429526285706,76,0.0144481,0.0180777,0.00621526,25
1429526285747,76,0.013516,0.00488693,-0.0257769,23
1429526285789,76,0.00863342,-0.00863051,-0.0511292,25
1429526285830,76,-8.24352e-05,-0.0195772,-0.0664037,43
1429526285872,76,-0.00912728,-0.0249413,-0.0688458,59
1429526285913,76,-0.0161895,-0.0254855,-0.064627,68
1429526285955,76,-0.0183643,-0.0222125,-0.0564308,64
1429526285996,76,-0.0156195,-0.0180133,-0.0492067,55
1429526286038,76,-0.00756015,-0.0130694,-0.0409479,48
1429526286079,76,0.004327,-0.00685208,-0.0280267,42
1429526286121,76,0.0187535,0.00279034,-0.0049024,43
1429526286162,76,0.0329954,0.0162239,0.0289313,45
1429526286203,76,0.0441966,0.0320714,0.0692631,44
1429526286245,76,0.0487218,0.0458155,0.105518,38
1429526286286,76,0.0447193,0.0525577,0.125765,32
1429526286328,76,0.0313489,0.047854,0.120448,24
1429526286371,76,0.0101389,0.0319188,0.0887311,20
1429526286382,76,-0.016085,0.0062228,0.0345888,19
1429526286424,76,-0.0409788,-0.0222438,-0.0273629,16
1429526286465,76,-0.0593143,-0.0467784,-0.0823764,14
1429526286506,76,-0.0682626,-0.0629043,-0.11949,15
1429526286553,76,-0.068209,-0.0694629,-0.134003,37
1429526286567,76,-0.0622362,-0.0689438,-0.129644,46
1429526286579,76,-0.0547252,-0.0650394,-0.114522,55
1429526286620,76,-0.0477292,-0.0595506,-0.0953604,66
1429526286665,76,-0.0404856,-0.0515973,-0.0749568,62
1429526286676,76,-0.0300125,-0.0385484,-0.0518575,59
1429526286717,76,-0.0127459,-0.0174888,-0.0216961,52
1429526286759,76,0.0119654,0.0114081,0.0175232,41
1429526286800,76,0.04207,0.0449948,0.0641444,37
1429526286841,76,0.0709738,0.0764092,0.109971,37
1429526286883,76,0.0918647,0.0986235,0.144815,40
1429526286924,76,0.0992639,0.106333,0.159164,40
1429526286965,76,0.0912921,0.0976484,0.14786,37
1429526287007,76,0.0705573,0.0748202,0.112742,32
1429526287048,76,0.0427389,0.0433549,0.0621734,26
1429526287089,76,0.0149195,0.0108929,0.00919378,22
1429526287131,76,-0.00697342,-0.0155702,-0.0335318,19
1429526287172,76,-0.0206776,-0.0318089,-0.0583793,18
1429526287214,76,-0.0267013,-0.0372094,-0.0643358,23
1429526287255,76,-0.0273295,-0.0340084,-0.0556735,40
1429526287297,76,-0.0259676,-0.0266978,-0.0405492,70
1429526287339,76,-0.024198,-0.0193056,-0.0259805,77
1429526287380,76,-0.0225425,-0.0148124,-0.0166247,69
1429526287421,76,-0.0208753,-0.0133541,-0.0121825,60
1429526287463,76,-0.0193696,-0.0149857,-0.0129955,45
1429526287475,76,-0.018205,-0.0170181,-0.0148904,45
1429526287516,76,-0.0185723,-0.0191334,-0.0178304,39
1429526287528,76,-0.0201443,-0.0199658,-0.0201769,39
1429526287569,76,-0.0220731,-0.0197844,-0.0225947,41
1429526287610,76,-0.0222919,-0.0176362,-0.023009,44
1429526287622,76,-0.019992,-0.0141951,-0.0215572,44
1429526287663,76,-0.0148413,-0.00979541,-0.0173609,42
1429526287705,76,-0.00828952,-0.00527661,-0.0105284,40
1429526287716,76,-0.00154978,-0.00139252,-0.00204436,38
1429526287758,76,0.00502238,0.002184,0.00780904,34
1429526287769,76,0.0112722,0.00538034,0.0171637,33
1429526287811,76,0.0180457,0.00976547,0.0266188,29
1429526287823,76,0.0232064,0.0139655,0.0327534,28
1429526287864,76,0.0255639,0.0172581,0.033715,24
1429526287875,76,0.0227078,0.016982,0.0258979,24
1429526287918,76,0.0133834,0.010963,0.0080637,30
1429526287939,76,-7.91038e-05,-0.000349614,-0.0183819,37
1429526287980,76,-0.0114984,-0.0126406,-0.0450832,60
1429526288006,76,-0.0161632,-0.0204932,-0.0619069,66
1429526288048,76,-0.00913682,-0.0173554,-0.0588405,66
1429526288074,76,0.00971202,1.00696e-05,-0.030363,63
1429526288115,76,0.0342469,0.0276131,0.0179552,53
1429526288138,76,0.0570114,0.0576527,0.0725401,49
1429526288179,76,0.0693058,0.0783691,0.114045,42
1429526288206,76,0.0655206,0.0806454,0.127687,39
1429526288247,76,0.0474384,0.0632211,0.109061,40
1429526288289,76,0.0205151,0.0316028,0.0658926,43
1429526288335,76,-0.00646146,-0.00254853,0.0164087,44
1429526288346,76,-0.027124,-0.0291896,-0.0235432,43
1429526288388,76,-0.0396686,-0.0435954,-0.0460317,40
1429526288430,76,-0.0459625,-0.0474182,-0.0527383,36
1429526288473,76,-0.0500919,-0.0466183,-0.0524105,33
1429526288514,76,-0.0568076,-0.0485599,-0.056459,29
1429526288556,76,-0.0670903,-0.0562949,-0.0698514,28
1429526288597,76,-0.0778096,-0.0676069,-0.0892176,32
1429526288639,76,-0.0815924,-0.0751193,-0.1033,41
1429526288680,76,-0.071397,-0.0713913,-0.100208,56
1429526288722,76,-0.0448716,-0.0527344,-0.0745977,59
1429526288764,76,-0.00676276,-0.0219299,-0.0311527,54
1429526288806,76,0.0323824,0.0124814,0.0163772,48
1429526288850,76,0.0615858,0.0411568,0.0534876,40
1429526288862,76,0.0739471,0.0572299,0.0705677,40
1429526288903,76,0.0719811,0.061467,0.0702956,33
1429526288944,76,0.0614237,0.0570676,0.0595406,32
1429526288987,76,0.0501198,0.0498859,0.0471614,33
1429526288999,76,0.040658,0.0421764,0.0373604,33
1429526289041,76,0.0315231,0.0338917,0.0293212,32
1429526289083,76,0.0205846,0.0246229,0.0220081,28
1429526289124,76,0.00390466,0.0125722,0.0136758,26
1429526289166,76,-0.0175143,-0.00190074,0.00490506,22
1429526289207,76,-0.0367993,-0.0139866,0.00112115,20
1429526289248,76,-0.0487648,-0.0215553,0.00271422,17
1429526289290,76,-0.0497952,-0.0233735,0.00677978,18
1429526289331,76,-0.0409352,-0.0213049,0.00696888,33
1429526289373,76,-0.026497,-0.0178956,9.78786e-05,45
1429526289414,76,-0.0107778,-0.0147896,-0.0126585,55
1429526289455,76,0.00360217,-0.010566,-0.0226401,53
1429526289496,76,0.0160199,-0.00327719,-0.0217274,48
1429526289538,76,0.0268146,0.00779299,-0.00760124,42
1429526289579,76,0.0310776,0.0178228,0.0107753,40
1429526289621,76,0.0265107,0.0214821,0.0202352,40
1429526289662,76,0.0114718,0.0147332,0.012349,41
1429526289704,76,-0.0104386,-0.0011744,-0.0112631,43
1429526289745,76,-0.030061,-0.0176696,-0.0355838,42
1429526289787,76,-0.0419625,-0.0287658,-0.0468877,40
1429526289829,76,-0.0413425,-0.0282612,-0.0335891,40
1429526289872,76,-0.0296626,-0.0180676,-0.00087419,37
1429526289913,76,-0.0128585,-0.0056086,0.034895,35
1429526289955,76,0.00216392,-8.82773e-05,0.052868,32
1429526289996,76,0.00925856,-0.00893525,0.0361838,31
1429526290038,76,0.00777989,-0.0302908,-0.0141872,40
1429526290079,76,0.00280245,-0.0532795,-0.0794185,50
1429526290120,76,0.00263206,-0.0623927,-0.129428,60
1429526290162,76,0.0134455,-0.0460818,-0.13757,60
1429526290204,76,0.0347716,-0.00419567,-0.0942556,54
1429526290246,76,0.0584376,0.0502563,-0.0135725,50
1429526290287,76,0.0728818,0.0968243,0.0738241,44
1429526290329,76,0.0689427,0.117957,0.136061,43
1429526290371,76,0.0449667,0.106699,0.154265,45
1429526290413,76,0.00772578,0.0695926,0.129833,46
1429526290454,76,-0.030664,0.022383,0.080521,45
1429526290496,76,-0.059326,-0.0182958,0.0288898,43
1429526290537,76,-0.0716596,-0.0417129,-0.00794378,40
1429526290579,76,-0.0680849,-0.0467032,-0.0253673,37
1429526290621,76,-0.0539888,-0.0393836,-0.0289366,35
1429526290662,76,-0.0363148,-0.0282129,-0.0276723,33
1429526290704,76,-0.019687,-0.0193402,-0.0279393,32
1429526290746,76,-0.00661939,-0.0158288,-0.0329324,37
1429526290788,76,0.00409776,-0.0147449,-0.0375296,49
1429526290830,76,0.0135093,-0.0134049,-0.0388251,56
1429526290872,76,0.0237355,-0.00837386,-0.0315843,56
1429526290913,76,0.0347058,0.000753061,-0.0164099,66
1429526290955,76,0.045522,0.0125559,0.00544204,52
1429526290996,76,0.0537648,0.0234674,0.0288478,43
1429526291038,76,0.056023,0.0287772,0.0467037,36
1429526291079,76,0.0496768,0.024823,0.0525649,38
1429526291121,76,0.0329951,0.00994171,0.0410005,42
1429526291162,76,0.00716545,-0.0138813,0.0113715,42
1429526291204,76,-0.0225689,-0.0396753,-0.029301,40
1429526291245,76,-0.0486011,-0.0594167,-0.0706817,36
1429526291287,76,-0.0646773,-0.0665729,-0.101434,30
1429526291329,76,-0.0671689,-0.0585042,-0.112109,27
1429526291371,76,-0.0570977,-0.0376212,-0.0991079,21
1429526291413,76,-0.0376983,-0.0085603,-0.0628271,19
1429526291454,76,-0.014722,0.0210216,-0.0127993,33
1429526291495,76,0.0071615,0.0460611,0.0406163,50
1429526291537,76,0.0242523,0.0626428,0.0851483,68
1429526291579,76,0.0355686,0.0707758,0.114184,67
1429526291621,76,0.0388405,0.0688595,0.120729,56
1429526291662,76,0.0331226,0.0568506,0.104226,46
1429526291704,76,0.019166,0.0361972,0.0698136,36
1429526291746,76,0.00028347,0.0102386,0.026579,35
1429526291787,76,-0.0202007,-0.0180746,-0.0183769,40
1429526291829,76,-0.0367689,-0.0431104,-0.0554699,43
1429526291870,76,-0.0452937,-0.0601592,-0.0785109,40
1429526291911,76,-0.0428,-0.064925,-0.0829003,25
1429526292013,76,-0.0281442,-0.0547295,-0.0660411,40
1429526292183,76,-0.00273036,-0.0300339,-0.0288991,40
1429526292225,76,0.0284972,0.00427588,0.0209373,58
1429526292236,76,0.0581147,0.0396913,0.0709625,58
1429526292278,76,0.0779013,0.0659605,0.106146,55
1429526292289,76,0.0825432,0.0761408,0.116088,52
1429526292331,76,0.070368,0.0669517,0.0964001,43
1429526292372,76,0.043628,0.0403497,0.0503493,29
1429526292384,76,0.00875737,0.00345624,-0.0108488,29
1429526292425,76,-0.0251958,-0.0332505,-0.0702763,20
1429526292436,76,-0.0508295,-0.06048,-0.11297,20
1429526292478,76,-0.0632905,-0.0719277,-0.128722,22
1429526292490,76,-0.062254,-0.0671761,-0.117101,24
1429526292531,76,-0.0518401,-0.0505796,-0.0862259,26
1429526292543,76,-0.037275,-0.0294241,-0.0490654,26
1429526292585,76,-0.0244054,-0.0109234,-0.0184945,24
1429526292626,76,-0.0144704,0.00240597,0.00168214,17
1429526292667,76,-0.00666698,0.0108093,0.013141,11
1429526292710,76,0.000922694,0.0165378,0.0211956,3
1429526292721,76,0.00839607,0.0205781,0.028806,1
1429526292763,76,0.015234,0.0240132,0.0376177,0
1429526292804,76,0.019249,0.0252088,0.043917,9
1429526292846,76,0.0207102,0.0244736,0.0468595,32
1429526292887,76,0.0207425,0.0227277,0.0467341,64
1429526292929,76,0.0211919,0.0217868,0.0463207,67
1429526292970,76,0.0236057,0.0230651,0.0483785,57
1429526293012,76,0.0265723,0.0248063,0.0510013,46
1429526293054,76,0.0283355,0.0252754,0.051991,29
1429526293095,76,0.0268057,0.0223249,0.0477554,25
1429526293137,76,0.0210987,0.0157315,0.0372212,29
1429526293178,76,0.0125855,0.00751633,0.0230644,40
1429526293219,76,0.00346522,0.000114963,0.00849675,43
1429526293260,76,-0.00391369,-0.00461149,-0.00334776,40
1429526293302,76,-0.00926559,-0.00718892,-0.0126157,35
1429526293343,76,-0.0132537,-0.0097835,-0.0221412,25
1429526293384,76,-0.0165686,-0.0137109,-0.0330635,21
1429526293429,76,-0.0200686,-0.0197238,-0.0459007,16
1429526293441,76,-0.0228996,-0.0260596,-0.0574817,16
1429526293482,76,-0.0241566,-0.0306659,-0.0645663,26
1429526293524,76,-0.0232127,-0.0317529,-0.0647115,57
1429526293567,76,-0.0208125,-0.0294405,-0.0583794,76
1429526293579,76,-0.0177085,-0.0248208,-0.0476947,79
1429526293621,76,-0.0152754,-0.0198351,-0.0359663,78
1429526293662,76,-0.0137863,-0.0158937,-0.0255083,65
1429526293703,76,-0.0122703,-0.0126372,-0.0164193,53
1429526293745,76,-0.0101529,-0.00961233,-0.00886974,38
1429526293786,76,-0.00637545,-0.00529443,-0.00106,37
1429526293827,76,-0.000830424,0.00094046,0.00770004,45
1429526293869,76,0.00618996,0.00893293,0.0182494,51
1429526293910,76,0.0137077,0.0176543,0.0299839,50
1429526293951,76,0.0209744,0.0257469,0.0419505,45
1429526293993,76,0.0266451,0.0318281,0.0517397,38
1429526294035,76,0.0298863,0.0350399,0.0576301,32
1429526294076,76,0.0298977,0.0350719,0.057824,26
1429526294117,76,0.0270052,0.0323636,0.0526777,27
1429526294159,76,0.0217853,0.0273251,0.0427904,49
1429526294201,76,0.0156735,0.0207847,0.0299265,71
1429526294243,76,0.00993238,0.0135051,0.0162864,90
1429526294285,76,0.0058221,0.00675718,0.00408818,88
1429526294326,76,0.0033152,0.000915617,-0.0055276,75
1429526294368,76,0.0015435,-0.00377342,-0.0119191,64
1429526294409,76,-0.00111046,-0.00806826,-0.0157571,52
1429526294450,76,-0.00539473,-0.0124098,-0.0182019,51
1429526294492,76,-0.0113048,-0.0171319,-0.0201438,58
1429526294534,76,-0.0181868,-0.0225603,-0.0232827,61
1429526294575,76,-0.0246569,-0.0282168,-0.0283348,57
1429526294617,76,-0.0290263,-0.0325436,-0.0337661,52
1429526294658,76,-0.0305018,-0.034225,-0.0385114,43
1429526294699,76,-0.0286344,-0.0319374,-0.0402434,38
1429526294740,76,-0.0241219,-0.0257217,-0.0377025,34
1429526294781,76,-0.0168668,-0.0153698,-0.0283712,33
1429526294823,76,-0.00753798,-0.00231914,-0.0129223,46
1429526294864,76,0.00329138,0.0117746,0.00688408,74
1429526294905,76,0.0140026,0.023846,0.025988,83
1429526294947,76,0.0213839,0.0304994,0.0383391,79
1429526294988,76,0.0229167,0.0292473,0.0389925,71
1429526295029,76,0.0169873,0.0198565,0.0267658,57
1429526295071,76,0.00537294,0.00510065,0.00568952,50
1429526295112,76,-0.00780517,-0.0101599,-0.0170325,49
1429526295153,76,-0.0168666,-0.0205012,-0.0330353,51
1429526295195,76,-0.0179576,-0.0227574,-0.03734,53
1429526295236,76,-0.0108661,-0.0170704,-0.0295477,50
1429526295277,76,0.00101114,-0.00647877,-0.013349,43
1429526295289,76,0.0123855,0.00452361,0.00506774,43
1429526295331,76,0.0193707,0.0128447,0.0210486,37
1429526295342,76,0.020367,0.0170392,0.0314775,37
1429526295383,76,0.0162882,0.0172297,0.0349028,32
1429526295425,76,0.00990365,0.0145753,0.0317435,31
1429526295466,76,0.00377321,0.0105673,0.02413,42
1429526295478,76,-0.000363683,0.0063153,0.0139619,49
1429526295520,76,-0.00221626,0.00254146,0.00395294,64
1429526295532,76,-0.00274883,-0.000371386,-0.00399275,70
1429526295573,76,-0.00246051,-0.00160366,-0.00837144,73
1429526295615,76,-0.0016656,-0.00156503,-0.0100324,67
1429526295626,76,-0.00110687,-0.000567363,-0.00956801,67
1429526295668,76,-0.000244101,0.000478138,-0.00877421,56
1429526295679,76,0.00130061,0.00196337,-0.00640816,52
1429526295721,76,0.00280592,0.00278582,-0.00346834,46
1429526295738,76,0.0049441,0.00438024,0.00215635,45
1429526295779,76,0.00822366,0.00762483,0.0109074,46
1429526295806,76,0.0125213,0.0122569,0.0210363,47
1429526295847,76,0.0150922,0.0151005,0.0274969,48
1429526295874,76,0.0128781,0.0123559,0.0255181,47
1429526295915,76,0.00211359,-0.000718608,0.00915349,41
1429526295938,76,-0.0173776,-0.0236775,-0.0197189,40
1429526295979,76,-0.0412365,-0.050652,-0.0533413,33
1429526296021,76,-0.0599021,-0.0704078,-0.077821,29
1429526296038,76,-0.065601,-0.0732,-0.0812519,28
1429526296079,76,-0.0552663,-0.0561963,-0.0609896,26
1429526296106,76,-0.0331692,-0.0254271,-0.0260645,28
1429526296147,76,-0.00798149,0.00781849,0.0102807,47
1429526296174,76,0.0112894,0.0311373,0.0331201,54
1429526296215,76,0.0210943,0.0398907,0.037746,68
1429526296238,76,0.0220099,0.0345265,0.0267738,68
1429526296279,76,0.0191823,0.021988,0.0100741,60
1429526296306,76,0.0174836,0.0095033,-0.00337261,56
1429526296347,76,0.019625,0.00234482,-0.00753595,44
1429526296374,76,0.0254643,0.00206644,-0.00238657,40
1429526296415,76,0.0327913,0.00801584,0.00912367,36
1429526296457,76,0.0385622,0.0171416,0.0216586,36
1429526296474,76,0.0415664,0.0277831,0.0331702,36
1429526296515,76,0.0409469,0.0374143,0.0413615,32
1429526296539,76,0.0362193,0.0433097,0.0447687,30
1429526296574,76,0.0281418,0.0432891,0.0431447,25
1429526296606,76,0.0166346,0.0358038,0.0361288,22
1429526296641,76,0.00293494,0.0216625,0.0248722,18
1429526296674,76,-0.0110296,0.00399767,0.0119002,15
1429526296706,76,-0.0230642,-0.0130415,-0.000149171,12
1429526296739,76,-0.0312123,-0.0255724,-0.00900848,11
1429526296774,76,-0.035188,-0.032419,-0.0152636,17
1429526296807,76,-0.036406,-0.0349358,-0.0211964,30
1429526296853,76,-0.0360226,-0.035205,-0.0280792,51
1429526296874,76,-0.0360548,-0.0360282,-0.0372507,54
1429526296915,76,-0.0365198,-0.037677,-0.0466461,54
1429526296956,76,-0.0367255,-0.0392876,-0.0529803,47
1429526296998,76,-0.0346432,-0.038527,-0.0524176,36
1429526297039,76,-0.0290228,-0.0339179,-0.0439394,30
1429526297081,76,-0.0184006,-0.0243327,-0.0276747,30
1429526297122,76,-0.00340783,-0.0107587,-0.0067816,33
1429526297164,76,0.0142016,0.00475687,0.0145231,35
1429526297205,76,0.0314157,0.0200691,0.0324788,18
1429526297361,76,0.0439045,0.0318475,0.0423898,18
1429526297402,76,0.0488043,0.0381976,0.0423427,18
1429526297444,76,0.0453051,0.0384494,0.032901,29
1429526297486,76,0.0359215,0.0339369,0.0183097,51
1429526297527,76,0.0251107,0.027553,0.00455814,61
1429526297568,76,0.017821,0.0226736,-0.00207294,61
1429526297610,76,0.0156588,0.0209545,0.000418918,55
1429526297652,76,0.0181015,0.0228376,0.0114463,43
1429526297693,76,0.0215817,0.0264829,0.026474,39
1429526297735,76,0.0227757,0.0293059,0.0399984,40
1429526297776,76,0.0189519,0.0283277,0.0465569,43
1429526297818,76,0.010869,0.0232357,0.0452611,45
1429526297859,76,-2.56017e-05,0.0137904,0.0356604,43
1429526297900,76,-0.010532,0.00236993,0.0212274,39
1429526297946,76,-0.0180709,-0.00847629,0.00573498,34
1429526297958,76,-0.0217196,-0.0166005,-0.00762804,33
1429526297999,76,-0.0237837,-0.023316,-0.0203691,27
1429526298041,76,-0.0271468,-0.0304352,-0.034378,23
1429526298082,76,-0.0339897,-0.0402529,-0.0518484,25
1429526298124,76,-0.0429982,-0.0514274,-0.0701551,38
1429526298167,76,-0.0509721,-0.0602728,-0.0837208,62
1429526298212,76,-0.0517075,-0.0607121,-0.0840596,70
1429526298223,76,-0.0416232,-0.0489804,-0.066354,70
1429526298265,76,-0.0213973,-0.0255295,-0.0321369,61
1429526298306,76,0.00358228,0.00301112,0.00865196,51
1429526298348,76,0.0258776,0.0289003,0.0444456,42
1429526298389,76,0.038494,0.0430819,0.0627573,39
1429526298435,76,0.0402519,0.0443574,0.0625857,44
1429526298446,76,0.0328337,0.034121,0.046667,44
1429526298487,76,0.0214603,0.0188731,0.0246543,45
1429526298532,76,0.0106634,0.00454722,0.00460797,43
1429526298544,76,0.00319591,-0.00452621,-0.00816817,41
1429526298585,76,-0.000327468,-0.00721796,-0.0127141,36
1429526298627,76,-0.00138524,-0.00579165,-0.0126299,33
1429526298669,76,-0.0012413,-0.0030307,-0.0112002,31
1429526298710,76,-0.000255952,-0.00059168,-0.00972856,29
1429526298752,76,0.00235518,0.00162261,-0.0072736,29
1429526298794,76,0.00743835,0.00513312,-0.00123622,37
1429526298836,76,0.0143609,0.0109105,0.0090409,56
1429526298877,76,0.0206241,0.0178765,0.0212684,66
1429526298919,76,0.0231928,0.0234797,0.0310438,65
1429526298960,76,0.0195683,0.024555,0.0333576,58
1429526299001,76,0.0094614,0.0193945,0.0259664,45
1429526299042,76,-0.00454037,0.00884055,0.0109894,40
1429526299084,76,-0.0175675,-0.00367469,-0.00664986,40
1429526299125,76,-0.0259046,-0.0144535,-0.0216771,44
1429526299166,76,-0.0264392,-0.0193288,-0.0282471,45
1429526299208,76,-0.0200781,-0.0178159,-0.0258599,43
1429526299250,76,-0.00980267,-0.0114025,-0.0167989,38
1429526299293,76,0.00096944,-0.00294139,-0.00466072,33
1429526299305,76,0.00918661,0.004122,0.00650257,32
1429526299346,76,0.012999,0.00699156,0.0129269,29
1429526299388,76,0.0115801,0.00432849,0.0124084,26
1429526299429,76,0.00579734,-0.00292165,0.00500438,28
1429526299470,76,-0.00260867,-0.0119958,-0.0068443,44
1429526299513,76,-0.0113526,-0.0197032,-0.0191365,60
1429526299524,76,-0.0171687,-0.0227078,-0.0266806,66
1429526299565,76,-0.0186844,-0.0202144,-0.0268095,71
1429526299607,78,-0.0154703,-0.0131048,-0.018986,66
1429526299649,78,-0.00924665,-0.00401018,-0.00617083,58
1429526299691,78,-0.00244292,0.00411104,0.00699731,48
1429526299733,78,0.00253498,0.00894559,0.0157655,45
1429526299774,78,0.00479456,0.00982329,0.0178856,47
1429526299816,78,0.00473251,0.00777377,0.014528,49
1429526299857,78,0.00399726,0.00504124,0.00938269,46
1429526299898,78,0.00395291,0.00364537,0.00619458,41
1429526299940,78,0.00534223,0.00478507,0.00705166,36
1429526299982,78,0.00786977,0.00801986,0.0107898,33
1429526299994,78,0.0106225,0.0118386,0.0145207,31
1429526300036,78,0.0122122,0.0142314,0.0148946,28
1429526300077,78,0.0116402,0.0133645,0.00985657,27
1429526300118,78,0.00868306,0.00863138,-0.000161722,31
1429526300161,78,0.00485205,0.00185768,-0.0116575,49
1429526300173,78,0.000806999,-0.00530099,-0.021617,57
1429526300216,78,-0.00214704,-0.0100362,-0.026179,68
1429526300228,78,-0.00472828,-0.0118169,-0.025321,70
1429526300269,78,-0.00738723,-0.0107978,-0.0201168,68
1429526300310,78,-0.011785,-0.00991077,-0.0150843,58
1429526300322,78,-0.0177769,-0.011078,-0.0124796,54
1429526300364,78,-0.0255853,-0.0168867,-0.01533,46
1429526300376,78,-0.0319554,-0.0252804,-0.0202259,43
1429526300417,78,-0.0342429,-0.0332082,-0.0239394,40
1429526300459,78,-0.0294788,-0.035432,-0.021585,39
1429526300470,78,-0.0166911,-0.0276196,-0.00955085,39
1429526300512,78,0.00234715,-0.00888173,0.0117912,38
1429526300524,78,0.0257339,0.0195137,0.0411708,37
1429526300566,78,0.046954,0.0490262,0.069972,34
1429526300577,78,0.0604532,0.0705608,0.0895379,32
1429526300619,78,0.0613807,0.0760774,0.0912298,28
1429526300638,78,0.04939,0.0633265,0.0727051,25
1429526300679,78,0.0280073,0.0365369,0.0381667,22
1429526300706,78,0.00477745,0.0057931,-0.00195008,20
1429526300747,78,-0.0140615,-0.0195638,-0.0366519,18
1429526300774,78,-0.0254594,-0.0346246,-0.0594424,18
1429526300815,78,-0.0300496,-0.0395476,-0.0688619,24
1429526300838,78,-0.0308978,-0.0388854,-0.0687781,38
1429526300879,78,-0.0308735,-0.0367274,-0.0633386,51
1429526300906,78,-0.030497,-0.0348666,-0.055212,59
1429526300947,80,-0.0297405,-0.0327289,-0.0454914,58
1429526300974,80,-0.026403,-0.0274982,-0.0326812,52
1429526301015,80,-0.0198191,-0.0177227,-0.0167168,44
1429526301039,80,-0.0111895,-0.005333,-0.00010078,40
1429526301074,80,-0.00169359,0.00767087,0.0154945,31
1429526301115,80,0.00603498,0.0170328,0.0261942,30
1429526301156,80,0.0114567,0.021964,0.0319941,34
1429526301198,80,0.0135537,0.0210389,0.0316569,36
1429526301239,80,0.0121337,0.0151535,0.0259407,33
1429526301280,80,0.00895969,0.00747501,0.0182062,30
1429526301321,80,0.00673317,0.00196499,0.0124848,24
1429526301362,80,0.00752575,0.00128857,0.0116872,21
1429526301404,80,0.0116624,0.00611436,0.0165115,17
1429526301456,80,0.0190763,0.0159988,0.0264206,18
1429526301472,80,0.0268569,0.0265104,0.0365568,22
1429526301484,80,0.0329996,0.0344792,0.0436107,22
1429526301525,80,0.0347739,0.036273,0.0435063,42
1429526301571,80,0.0322863,0.0316367,0.0361942,61
1429526301583,80,0.0259705,0.0219514,0.0232589,61
1429526301624,80,0.0170589,0.0106096,0.00852823,61
1429526301665,81,0.0060752,-0.00036015,-0.00579158,54
1429526301706,81,-0.00697999,-0.0101606,-0.0190191,40
1429526301751,81,-0.0214319,-0.0197721,-0.0318476,32
1429526301762,81,-0.0352651,-0.0302255,-0.044734,31
1429526301807,81,-0.0454722,-0.0412601,-0.0568213,34
1429526301818,81,-0.0503484,-0.0507614,-0.0659553,34
1429526301860,81,-0.0484472,-0.0555805,-0.0695478,40
1429526301903,81,-0.0398885,-0.0523219,-0.0645339,40
1429526301948,81,-0.0259847,-0.0398869,-0.0500545,34
1429526301960,81,-0.00989339,-0.0200887,-0.0276255,32
1429526302001,81,0.00478679,0.00257418,-0.00155341,28
1429526302042,81,0.0143091,0.0218942,0.0217474,23
1429526302083,81,0.017571,0.0340337,0.0380711,21
1429526302125,81,0.0159173,0.0377747,0.0452752,22
1429526302166,81,0.012151,0.0344769,0.0437795,34
1429526302207,81,0.0106599,0.0288248,0.0384084,58
1429526302249,81,0.012767,0.0230284,0.0318188,67
1429526302290,81,0.0187476,0.0204501,0.0284963,64
1429526302331,82,0.0246209,0.0196104,0.027582,57
1429526302373,82,0.0268376,0.0189475,0.027616,43
1429526302414,82,0.0235344,0.016911,0.0266078,38
1429526302456,82,0.0158673,0.0126859,0.0229787,38
1429526302497,82,0.00657535,0.00555353,0.0153694,42
1429526302538,82,-0.00134047,-0.0034748,0.00467931,44
1429526302579,82,-0.00549237,-0.0129018,-0.00725709,42
1429526302621,82,-0.00536706,-0.0196333,-0.0167691,40
1429526302662,82,-0.00133053,-0.0204951,-0.0199569,34
1429526302704,82,0.00569203,-0.013133,-0.0141496,30
1429526302747,82,0.0123785,2.79981e-05,-0.00211352,24
1429526302759,82,0.0156851,0.0137559,0.0104497,23
1429526302801,82,0.0127099,0.021261,0.0161404,26
1429526302843,82,0.00246364,0.0178927,0.0104141,43
1429526302886,82,-0.0139715,0.00259601,-0.00772672,56
1429526302927,82,-0.0322776,-0.0200919,-0.0329238,59
1429526302969,84,-0.0471085,-0.0421492,-0.0565652,54
1429526303011,84,-0.0530189,-0.0550549,-0.0692131,42
1429526303052,84,-0.0467303,-0.0532917,-0.0648058,36
1429526303094,84,-0.0309782,-0.037839,-0.0450327,35
1429526303135,84,-0.0121719,-0.0155484,-0.0178776,38
1429526303177,84,0.00400664,0.00628305,0.0085972,41
1429526303219,84,0.0133708,0.0210352,0.0268045,40
1429526303262,84,0.0160825,0.0267866,0.0344997,35
1429526303274,84,0.0155239,0.0256162,0.033751,35
1429526303316,84,0.0154228,0.0214654,0.029013,30
1429526303357,84,0.0181828,0.017972,0.0238345,28
1429526303398,84,0.0231343,0.016378,0.0202477,25
1429526303440,84,0.0279056,0.0166734,0.0181053,26
1429526303481,84,0.0299168,0.0178118,0.0166871,40
1429526303493,84,0.0286391,0.0192796,0.0156251,48
1429526303534,84,0.0256964,0.021453,0.0154088,64
1429526303575,84,0.0223732,0.0235503,0.0154714,71
1429526303617,84,0.0191467,0.0240116,0.0150217,67
1429526303659,84,0.0142575,0.0200972,0.0125503,54
1429526303701,84,0.0050418,0.00941499,0.00647846,46
1429526303742,84,-0.00985213,-0.00759521,-0.00283185,41
1429526303783,84,-0.0272108,-0.0267313,-0.012024,41
1429526303825,84,-0.0431455,-0.0432058,-0.0193511,43
1429526303866,84,-0.0506756,-0.0509978,-0.0210617,42
1429526303907,84,-0.04877,-0.0497517,-0.0196113,40
1429526303949,84,-0.0379533,-0.0404681,-0.0170538,34
1429526303991,84,-0.0229925,-0.0271258,-0.016431,31
1429526304033,84,-0.00849732,-0.0131368,-0.0180348,26
1429526304074,84,0.00168876,-0.00146956,-0.0212463,22
1429526304115,84,0.00828889,0.00822377,-0.0219905,23
1429526304156,84,0.0123705,0.016334,-0.0181706,33
1429526304198,84,0.015,0.0224127,-0.0104876,57
1429526304210,84,0.0160072,0.0253219,-0.00201515,57
1429526304253,84,0.0151297,0.0244257,0.00458808,67
1429526304264,84,0.0132423,0.0200904,0.00810603,66
1429526304306,86,0.011414,0.0141855,0.0100072,60
1429526304348,86,0.011455,0.00913982,0.0127278,46
1429526304389,86,0.0129388,0.00595943,0.0171476,39
1429526304431,86,0.0127311,0.00260637,0.0201135,36
1429526304442,86,0.0064989,-0.00414762,0.0166574,36
1429526304484,86,-0.00588352,-0.0140803,0.00638565,40
1429526304495,86,-0.0193784,-0.0235279,-0.00638838,41
1429526304536,86,-0.0274939,-0.0275482,-0.015394,42
1429526304548,86,-0.0227341,-0.0202247,-0.0125027,41
1429526304590,86,-0.00594264,-0.00244862,0.00225417,39
1429526304601,86,0.0174798,0.0204951,0.0237444,37
1429526304643,86,0.0362569,0.0386251,0.0409096,33
1429526304684,86,0.041578,0.0437553,0.0444895,28
1429526304696,86,0.0299174,0.0325451,0.0302439,26
1429526304737,86,0.00592071,0.00923575,0.00292366,24
1429526304748,86,-0.0196225,-0.0160702,-0.0258735,23
1429526304790,86,-0.0364116,-0.033675,-0.0448537,23
1429526304806,86,-0.0392329,-0.0381437,-0.047947,25
1429526304847,86,-0.0301489,-0.0309138,-0.0370474,45
1429526304873,86,-0.0172149,-0.0193403,-0.0213324,54
1429526304915,86,-0.00813906,-0.0101537,-0.00934852,69
1429526304938,86,-0.00728069,-0.00824997,-0.00709436,69
1429526304979,88,-0.0123499,-0.0126487,-0.0129116,61
1429526305006,88,-0.0172795,-0.0187183,-0.0208763,56
1429526305047,88,-0.0161514,-0.0204301,-0.0229743,42
1429526305073,88,-0.00628816,-0.0142769,-0.0149539,40
1429526305115,88,0.0102186,0.000443073,0.00310844,35
1429526305139,88,0.0280029,0.0202528,0.0265884,36
1429526305173,88,0.0408166,0.0393394,0.0480793,38
1429526305206,88,0.0447565,0.0517367,0.0607688,38
1429526305240,88,0.0384737,0.0525301,0.0602973,37
1429526305274,88,0.0233401,0.0392101,0.0446635,33
1429526305315,88,0.00203178,0.0133794,0.0160395,26
1429526305362,88,-0.0203192,-0.018134,-0.0187298,21
1429526305374,88,-0.0385258,-0.0453802,-0.049539,21
1429526305415,88,-0.04705,-0.0589177,-0.0665621,19
1429526305456,88,-0.0431989,-0.0537228,-0.0643059,19
1429526305501,88,-0.0266816,-0.0304411,-0.0426891,33
1429526305512,88,-0.00103527,0.00458451,-0.00768582,40
1429526305554,88,0.0261831,0.0397337,0.0289862,56
1429526305596,88,0.0483337,0.064511,0.0568334,68
1429526305637,90,0.0577074,0.0704889,0.0666731,66
1429526305678,90,0.0524115,0.0567242,0.0571669,59
1429526305720,90,0.0354723,0.0293563,0.034499,48
1429526305762,90,0.0116687,-0.00263916,0.0069977,44
1429526305803,90,-0.0121145,-0.0299296,-0.0167383,43
1429526305845,90,-0.0289566,-0.0455154,-0.0301847,45
1429526305887,90,-0.0369202,-0.0492216,-0.0339986,45
1429526305932,90,-0.0352596,-0.04217,-0.0292766,42
1429526305943,90,-0.0280624,-0.0300217,-0.0213146,42
1429526305986,90,-0.0194667,-0.0175737,-0.0138667,38
1429526306028,90,-0.0124175,-0.00668979,-0.00745809,35
1429526306074,90,-0.00931203,-0.000286246,-0.00444357,30
1429526306085,90,-0.00856987,0.00284483,-0.00317767,29
1429526306127,90,-0.00871936,0.00304492,-0.00406235,28
1429526306169,90,-0.00507252,0.00443007,-0.00310302,36
1429526306211,90,0.0028981,0.00777916,-0.000209684,49
1429526306253,90,0.0136675,0.0132946,0.00491538,69
1429526306294,90,0.0232159,0.0193493,0.0107415,73
1429526306336,89,0.027813,0.0232389,0.0148934,67
1429526306381,89,0.0255323,0.0227979,0.0155825,55
1429526306393,89,0.0181069,0.0173024,0.0122406,55
1429526306434,89,0.00885527,0.00805471,0.00605832,47
1429526306477,89,0.001162,-0.00165986,1.9466e-05,47
1429526306520,89,-0.00331202,-0.00852703,-0.00316338,50
1429526306530,89,-0.00396916,-0.00912953,-0.000708818,50
1429526306572,89,-0.00201073,-0.00321127,0.00713102,49
1429526306615,89,0.000806378,0.00710159,0.0174787,43
1429526306656,89,0.00231039,0.0157415,0.0239022,39
1429526306698,89,0.00176132,0.0170602,0.0209935,33
1429526306740,89,-0.00109052,0.00841618,0.00710265,31
1429526306784,89,-0.00399555,-0.00660818,-0.0123855,27
1429526306795,89,-0.00640947,-0.0216738,-0.0298595,27
1429526306837,89,-0.00656053,-0.0297316,-0.0375668,27
1429526306880,89,-0.00436825,-0.0257118,-0.0307897,35
1429526306892,89,-0.0016167,-0.0122677,-0.013696,41
1429526306933,89,-0.000939125,0.00390969,0.00541337,61
1429526306974,89,-0.00246563,0.0152944,0.018222,66
1429526307016,89,-0.00516171,0.0175943,0.0205739,61
1429526307057,89,-0.0068893,0.0109149,0.0132573,54
1429526307099,89,-0.00712651,-0.00182088,-0.000131291,46
1429526307141,89,-0.00704914,-0.0164905,-0.0152099,40
1429526307182,89,-0.00855303,-0.0293335,-0.0283263,40
1429526307224,89,-0.0128923,-0.0375417,-0.0370183,42
1429526307266,89,-0.0183319,-0.0387143,-0.0387797,40
1429526307308,89,-0.0219412,-0.0319333,-0.0325589,37
1429526307351,89,-0.0194119,-0.0169361,-0.017832,30
1429526307364,89,-0.00938495,0.00318668,0.00262341,30
1429526307406,89,0.00682422,0.0239683,0.0243899,25
1429526307447,89,0.024466,0.0403085,0.0421313,23
1429526307489,89,0.0381904,0.0493744,0.0525763,19
1429526307530,89,0.0444032,0.0506099,0.0547303,21
1429526307572,89,0.0414306,0.0448561,0.0490962,37
1429526307613,89,0.0315134,0.0347692,0.0380282,51
1429526307655,89,0.0177548,0.0216147,0.0225422,62
1429526307697,89,0.0064281,0.00978259,0.00776677,59
1429526307739,89,-0.000980567,-0.000517281,-0.00576528,46
1429526307751,89,-0.00449818,-0.00799977,-0.0157061,41
1429526307792,89,-0.0070887,-0.0137973,-0.0225211,33
1429526307834,89,-0.0110188,-0.0181288,-0.0255707,29
1429526307876,89,-0.0175028,-0.0223032,-0.0262529,31
1429526307889,89,-0.0249129,-0.0264345,-0.0255706,32
1429526307930,89,-0.0301522,-0.0302008,-0.0247058,33
1429526307974,89,-0.0308513,-0.0327138,-0.0246042,28
1429526307985,89,-0.0251323,-0.031445,-0.0234053,25
1429526308026,89,-0.0136412,-0.0244991,-0.0191234,20
1429526308067,89,0.00106423,-0.0112261,-0.00993758,16
1429526308109,89,0.0154354,0.00613065,0.0035851,11
1429526308150,89,0.0265202,0.0237285,0.0193974,9
1429526308192,89,0.0311271,0.0351932,0.030795,10
1429526308205,89,0.0286232,0.0372777,0.0340994,14
1429526308246,89,0.0196961,0.0292895,0.0272225,29
1429526308258,89,0.00775715,0.0159042,0.0141922,38
1429526308300,89,-0.0040568,0.00194109,-0.000344017,54
1429526308313,89,-0.0127278,-0.00754334,-0.0109679,58
1429526308355,90,-0.016709,-0.0107426,-0.0148427,57
1429526308396,90,-0.0158711,-0.008239,-0.0117278,48
1429526308437,90,-0.0111717,-0.00280632,-0.00381391,34
1429526308479,90,-0.00579958,0.00129116,0.00432215,28
1429526308490,90,-0.00307189,0.000133337,0.00706601,27
1429526308531,90,-0.00423261,-0.006607,0.0025079,29
1429526308573,90,-0.0079761,-0.0160413,-0.00758088,36
1429526308614,90,-0.0115225,-0.0232269,-0.0179718,36
1429526308656,90,-0.0123134,-0.0239965,-0.0232573,30
1429526308697,90,-0.0102364,-0.018246,-0.0213708,24
1429526308739,90,-0.00706577,-0.00931469,-0.0144027,18
1429526308750,90,-0.00288487,0.000337471,-0.00381785,18
1429526308793,90,7.1075e-05,0.00572334,0.00420377,15
1429526308805,90,0.00399399,0.00864744,0.0102665,14
1429526308847,90,0.00917719,0.00963509,0.0132378,14
1429526308858,90,0.0164061,0.012562,0.0162065,15
1429526308900,90,0.0240848,0.0180778,0.020201,24
1429526308941,90,0.0283463,0.0231411,0.0226362,49
1429526308982,90,0.0244254,0.0220258,0.0182404,62
1429526309024,90,0.0119383,0.012686,0.00613492,62
1429526309065,89,-0.00592037,-0.00393238,-0.0123037,53
1429526309076,89,-0.0219536,-0.0207733,-0.0292464,48
1429526309118,89,-0.029432,-0.0305844,-0.0375538,38
1429526309129,89,-0.0238466,-0.0266976,-0.02993,33
1429526309170,89,-0.00940943,-0.0124208,-0.0109922,29
1429526309181,89,0.00679668,0.00542439,0.0115714,30
1429526309223,89,0.0163336,0.0176312,0.0270958,40
1429526309234,89,0.0157603,0.0197143,0.0307966,40
1429526309275,89,0.00724041,0.0130225,0.0243042,45
1429526309287,89,-0.00378208,0.00345622,0.0139628,45
1429526309328,89,-0.011643,-0.00333839,0.00527944,42
1429526309340,89,-0.0121,-0.00281625,0.00277973,40
1429526309381,89,-0.00607213,0.00415314,0.00551078,37
1429526309406,89,0.003906,0.0140874,0.0104627,33
1429526309447,89,0.0131529,0.0212036,0.0126576,30
1429526309473,89,0.0182972,0.0211691,0.00894453,26
1429526309515,89,0.0181665,0.0128888,-0.000782639,23
1429526309556,89,0.0136722,-0.000847682,-0.0135345,27
1429526309597,89,0.00456559,-0.0171515,-0.0275115,42
1429526309639,89,-0.00711279,-0.030508,-0.0381172,72
1429526309680,89,-0.0203273,-0.0383799,-0.0434504,80
1429526309721,89,-0.0333479,-0.0405027,-0.0434575,75
1429526309763,89,-0.0427204,-0.0382821,-0.0387551,65
1429526309806,89,-0.0448606,-0.0330871,-0.0300516,49
1429526309853,89,-0.0367763,-0.0247002,-0.0167466,44
1429526309865,89,-0.0191436,-0.0128347,0.00045804,43
1429526309910,89,0.00450689,0.00346762,0.0209711,47
1429526309922,89,0.0271883,0.0225187,0.0411575,48
1429526309963,89,0.0428499,0.0411848,0.0569762,48
1429526310008,89,0.0466769,0.0530711,0.0621314,43
1429526310019,89,0.040993,0.0559672,0.0563191,43
1429526310061,89,0.0289449,0.0474566,0.0394374,34
1429526310102,89,0.0183822,0.0330152,0.0197017,29
1429526310144,89,0.0132429,0.0175999,0.00347598,23
1429526310185,89,0.0144696,0.00786411,-0.00261868,20
1429526310230,89,0.0172951,0.00423905,-0.000402678,19
1429526310241,89,0.0149478,0.00222587,0.00263025,22
1429526310283,89,0.00286952,-0.00485649,-0.00269165,37
1429526310324,89,-0.0188157,-0.0217744,-0.0218909,65
1429526310366,89,-0.0448009,-0.0464821,-0.05206,75
1429526310408,89,-0.0654139,-0.0702965,-0.0818768,71
1429526310457,89,-0.0723267,-0.0813182,-0.0964629,55
1429526310471,89,-0.0619195,-0.0717781,-0.0862437,55
1429526310512,89,-0.0379488,-0.0434282,-0.0530782,37
1429526310554,89,-0.0084104,-0.00668417,-0.00854899,32
1429526310595,89,0.0167975,0.0253299,0.0321754,38
1429526310636,89,0.0321025,0.0427525,0.0576081,42
1429526310678,89,0.0371083,0.0440259,0.0646948,40
1429526310719,89,0.0375233,0.0377515,0.0615816,33
1429526310760,89,0.0391839,0.033663,0.057281,18
1429526310802,89,0.0449921,0.0384321,0.0581099,8
1429526310844,89,0.0523026,0.0502672,0.0626048,0
1429526310885,89,0.0544415,0.0590601,0.06177,0
1429526310926,89,0.0461486,0.0574007,0.0505377,0
1429526310968,89,0.02503,0.0389504,0.0248532,21
1429526311009,89,-0.0043997,0.00934176,-0.00828893,71
1429526311050,89,-0.033513,-0.0223435,-0.0400425,87
1429526311092,89,-0.0529408,-0.0446615,-0.0599971,59
1429526311133,89,-0.0576152,-0.0527011,-0.0647286,51
1429526311175,89,-0.0487668,-0.0484017,-0.0573812,39
1429526311216,89,-0.0330643,-0.03804,-0.0439935,33
1429526311257,89,-0.017505,-0.0287981,-0.0310587,33
1429526311300,89,-0.00788428,-0.0243147,-0.02174,38
1429526311340,89,-0.00362301,-0.0223998,-0.0138653,41
1429526311383,89,-0.00227128,-0.0183643,-0.00404812,40
1429526311424,89,-0.00173029,-0.0119199,0.00569601,37
1429526311469,89,0.000909264,-0.00301582,0.0140838,31
1429526311481,89,0.00489355,0.00444118,0.0166727,29
1429526311522,89,0.00796274,0.00662168,0.011135,26
1429526311563,89,0.00765763,0.00208366,-0.00148193,22
1429526311605,89,0.00428285,-0.00569766,-0.0150401,24
1429526311617,89,0.00132918,-0.00965242,-0.0207819,29
1429526311658,89,0.00256646,-0.00455401,-0.0134257,45
1429526311701,89,0.00908735,0.0107772,0.00601445,53
1429526311713,89,0.0191094,0.0313059,0.0302311,54
1429526311755,89,0.0266066,0.0478064,0.0480039,51
1429526311796,89,0.0268532,0.052698,0.0514922,41
1429526311838,89,0.0169898,0.0426467,0.0382709,34
1429526311879,89,-0.00169476,0.0198292,0.0123026,26
1429526311921,89,-0.0229704,-0.00895585,-0.0176182,27
1429526311962,89,-0.0391799,-0.0355893,-0.0422314,34
1429526312004,89,-0.0450623,-0.0539033,-0.0555356,36
1429526312016,89,-0.0376334,-0.0578756,-0.0532377,36
1429526312057,89,-0.0215889,-0.0479261,-0.0386441,34
1429526312099,89,-0.000570185,-0.0240234,-0.0132322,30
1429526312140,89,0.0176616,0.0054139,0.0138344,28
1429526312182,89,0.0297479,0.0322511,0.0358812,24
1429526312193,89,0.0350313,0.0481784,0.0471634,24
1429526312235,89,0.0380592,0.0527912,0.0499934,28
1429526312276,89,0.040448,0.0470404,0.0461816,48
1429526312317,89,0.0424519,0.0367314,0.0400154,61
1429526312359,89,0.0411914,0.02594,0.0333936,66
1429526312400,89,0.0342742,0.0186317,0.027766,58
1429526312442,89,0.0197116,0.0127342,0.0206908,49
1429526312484,89,-0.0017284,0.00460061,0.00926661,37
1429526312495,89,-0.0239193,-0.00726207,-0.00598073,35
1429526312537,89,-0.0414572,-0.0228381,-0.0234779,35
1429526312578,89,-0.0500274,-0.0378977,-0.0387649,41
1429526312619,89,-0.0478512,-0.0465883,-0.0472058,44
1429526312631,89,-0.0394885,-0.048157,-0.0505628,44
1429526312672,89,-0.0298953,-0.042758,-0.0504684,41
1429526312683,89,-0.023065,-0.0332563,-0.0489063,40
1429526312724,89,-0.018977,-0.0219185,-0.044791,37
1429526312765,89,-0.0158036,-0.0104088,-0.0354656,32
1429526312807,89,-0.0103021,0.000921849,-0.0185549,30
1429526312818,89,-0.00163269,0.0115355,0.00432135,30
1429526312860,89,0.00877096,0.0198329,0.0272781,35
1429526312901,89,0.0186353,0.025378,0.043969,50
1429526312913,89,0.0262937,0.0281628,0.0497953,55
1429526312954,89,0.0304727,0.0282186,0.0442748,60
1429526312965,89,0.0315328,0.0266132,0.0320462,60
1429526313007,89,0.0289073,0.0226248,0.017703,56
1429526313019,89,0.0211157,0.0133515,0.00339383,53
1429526313060,89,0.0109829,0.00168767,-0.0053732,46
1429526313075,89,0.000179893,-0.0109548,-0.00821791,42
1429526313116,89,-0.00740489,-0.0192347,-0.00417629,37
1429526313139,89,-0.00869891,-0.0191226,0.00553715,37
1429526313180,89,-0.0037125,-0.00991874,0.017229,40
1429526313205,89,0.00388536,0.00407036,0.0247308,41
1429526313247,89,0.00837089,0.0152165,0.0224119,41
1429526313274,89,0.00478924,0.0160739,0.00704875,40
1429526313305,89,-0.00705502,0.00434453,-0.0178351,38
1429526313344,89,-0.022628,-0.0157731,-0.0444215,35
1429526313373,89,-0.0341609,-0.0344479,-0.0619772,31
1429526313415,89,-0.0356521,-0.0422072,-0.0628199,30
1429526313439,89,-0.0258028,-0.0343368,-0.0462434,32
1429526313473,89,-0.00940602,-0.0142683,-0.0189533,40
1429526313506,89,0.00607443,0.00863319,0.00738893,49
1429526313540,89,0.0143272,0.0239551,0.0234762,56
1429526313574,89,0.0140703,0.0271194,0.027547,56
1429526313607,89,0.00829023,0.0190932,0.0235907,65
1429526313640,89,0.00467115,0.00921868,0.0224323,53
1429526313674,89,0.00758316,0.00514365,0.0297717,40
1429526313705,89,0.0165153,0.00986779,0.0439261,32
1429526313747,89,0.0280817,0.0216773,0.0586566,35
1429526313788,89,0.0344233,0.0319228,0.0619499,42
1429526313830,89,0.0293547,0.0320386,0.0454992,48
1429526313871,89,0.0115272,0.0177664,0.00921144,45
1429526313913,89,-0.0147706,-0.0077201,-0.0376733,39
1429526313954,89,-0.0414453,-0.0369252,-0.081237,35
1429526313995,89,-0.0593841,-0.0586631,-0.106466,30
1429526314037,89,-0.0655771,-0.0693077,-0.109668,27
1429526314078,89,-0.0615393,-0.0696529,-0.0951774,37
1429526314119,89,-0.0533482,-0.0648422,-0.0737411,64
1429526314161,89,-0.0439558,-0.0578267,-0.052814,76
1429526314202,89,-0.0348088,-0.0493294,-0.0363177,73
1429526314243,89,-0.0231662,-0.0363764,-0.0212968,64
1429526314285,89,-0.00770005,-0.0162098,-0.00328939,47
1429526314326,89,0.0131295,0.0118384,0.021331,40
1429526314367,89,0.0369205,0.0433668,0.0506252,42
1429526314409,89,0.0626609,0.0750277,0.0835638,47
1429526314450,89,0.0863738,0.101296,0.11466,48
1429526314491,89,0.104492,0.119006,0.138868,44
1429526314533,89,0.112383,0.125077,0.149866,38
1429526314574,89,0.106074,0.117005,0.142009,34
1429526314615,89,0.0854498,0.0952852,0.114627,30
1429526314657,89,0.0541586,0.062766,0.0718339,32
1429526314698,89,0.0201361,0.0256582,0.023135,48
1429526314743,89,-0.00915718,-0.00785884,-0.0195157,63
1429526314758,89,-0.0288993,-0.0329128,-0.0490374,67
1429526314770,89,-0.0386469,-0.0467377,-0.0625212,70
1429526314811,89,-0.0438065,-0.0531078,-0.0660566,68
1429526314853,89,-0.0523909,-0.0598071,-0.0706802,55
1429526314898,89,-0.0697251,-0.0727483,-0.0839317,40
1429526314909,89,-0.0949944,-0.0939466,-0.107513,40
1429526314950,89,-0.120634,-0.118448,-0.134695,34
1429526314994,89,-0.137064,-0.139294,-0.156525,39
1429526315005,89,-0.136414,-0.147113,-0.162834,41
1429526315046,89,-0.117734,-0.138365,-0.151412,45
1429526315088,89,-0.0847072,-0.112274,-0.123114,44
1429526315129,89,-0.0438368,-0.0707433,-0.080743,40
1429526315171,89,-8.59124e-05,-0.0183782,-0.027499,32
1429526315212,89,0.0438367,0.0383215,0.0322329,28
1429526315253,89,0.0868091,0.0941223,0.0953476,29
1429526315295,89,0.129819,0.145235,0.158409,40
1429526315336,89,0.168442,0.186225,0.21342,64
1429526315377,89,0.197552,0.214609,0.254074,71
1429526315419,89,0.208833,0.224746,0.270481,66
1429526315460,89,0.196965,0.214226,0.258209,56
1429526315501,89,0.162794,0.185165,0.220406,40
1429526315542,89,0.110304,0.138216,0.160816,35
1429526315584,89,0.0485259,0.0791693,0.089161,38
1429526315625,89,-0.013381,0.0149099,0.0152066,40
1429526315666,89,-0.0682312,-0.0481562,-0.0539687,41
1429526315707,89,-0.113046,-0.105173,-0.114974,39
1429526315749,89,-0.14606,-0.151447,-0.164622,35
1429526315791,89,-0.165327,-0.180956,-0.198126,29
1429526315832,89,-0.165215,-0.186061,-0.206944,26
1429526315873,89,-0.142344,-0.163867,-0.186783,33
1429526315915,89,-0.0974522,-0.117642,-0.139423,46
1429526315956,89,-0.0401893,-0.0592031,-0.0778615,66
1429526315997,89,0.016991,-0.00248041,-0.017199,69
1429526316039,89,0.0582399,0.0374737,0.0249254,60
1429526316080,89,0.0727804,0.0520218,0.0388958,49
1429526316121,89,0.0579402,0.0411157,0.0252763,37
1429526316163,89,0.0208593,0.0120053,-0.00657468,36
1429526316204,89,-0.0240223,-0.0225665,-0.0409419,41
1429526316216,89,-0.0609606,-0.050563,-0.0627664,41
1429526316257,89,-0.0800745,-0.0642637,-0.0653012,43
1429526316299,89,-0.0768372,-0.0607371,-0.0485091,40
1429526316340,89,-0.0555134,-0.0429418,-0.0204214,35
1429526316381,89,-0.0258006,-0.0176642,0.00777882,30
1429526316423,89,0.00235353,0.00706262,0.0267014,24
1429526316471,89,0.021226,0.0251123,0.0328731,33
1429526316484,89,0.0306654,0.0350689,0.031365,33
1429526316526,89,0.0351912,0.0395032,0.0312332,56
1429526316567,89,0.0418529,0.043935,0.0421383,66
1429526316609,89,0.05348,0.051492,0.0658819,63
1429526316650,89,0.0688428,0.0624794,0.0958958,55
1429526316692,89,0.0804356,0.0717564,0.118385,41
1429526316733,89,0.0821127,0.0740653,0.121462,37
1429526316774,89,0.0702203,0.0650578,0.0996149,39
1429526316816,89,0.0468605,0.0452645,0.0579901,41
1429526316857,89,0.0190714,0.0191543,0.00750044,37
1429526316898,89,-0.00605292,-0.0067052,-0.0382061,28
1429526316940,89,-0.022862,-0.0259806,-0.0684067,14
1429526316952,89,-0.029652,-0.0349803,-0.0788497,14
1429526316993,89,-0.028998,-0.0345581,-0.073004,4
1429526317035,89,-0.0242183,-0.0270272,-0.0569616,0
1429526317046,89,-0.0196326,-0.0181119,-0.0393932,1
1429526317087,89,-0.0181283,-0.0119351,-0.0252612,21
1429526317128,89,-0.0217582,-0.0124169,-0.0180111,41
1429526317140,89,-0.03111,-0.0203561,-0.0178944,50
1429526317181,89,-0.0453673,-0.0354933,-0.0257194,58
1429526317193,89,-0.0601501,-0.0525083,-0.037696,59
1429526317235,89,-0.0684944,-0.0639606,-0.0475251,55
1429526317246,89,-0.0647554,-0.0642377,-0.0492451,51
1429526317287,89,-0.046209,-0.0496656,-0.0374112,39
1429526317299,89,-0.0164036,-0.0233979,-0.0130309,39
1429526317340,89,0.0166981,0.00802491,0.0182348,31
1429526317352,89,0.0427666,0.0351579,0.0462539,31
1429526317394,89,0.0546002,0.0511066,0.0619113,32
1429526317405,89,0.0513422,0.0537474,0.0610293,33
1429526317446,89,0.0368684,0.0449112,0.0457362,33
1429526317473,89,0.0188694,0.0297842,0.0237891,30
1429526317515,89,0.00458892,0.0142291,0.00458835,25
1429526317538,89,-0.00185473,0.00224865,-0.00473341,19
1429526317580,89,-0.00226437,-0.00578138,-0.00479879,14
1429526317606,89,-0.000325964,-0.0104347,3.61916e-05,9
1429526317647,89,3.99228e-05,-0.0130949,0.00302669,6
1429526317673,89,-0.000890808,-0.0121401,0.00258906,14
1429526317714,89,-0.000331027,-0.00594932,0.000353113,33
1429526317738,89,0.00444745,0.00612925,-0.000160944,43
1429526317779,89,0.0131524,0.0207222,0.00166412,65
1429526317806,89,0.0228108,0.0326557,0.00446356,65
1429526317847,89,0.0288026,0.0360809,0.00439454,57
1429526317873,89,0.0253468,0.0263275,-0.00313193,46
1429526317915,89,0.0122737,0.00591213,-0.0168064,38
1429526317939,89,-0.00783173,-0.0205197,-0.0331248,33
1429526317975,89,-0.0271195,-0.042994,-0.0435802,34
1429526318016,89,-0.0386047,-0.0532157,-0.0416788,38
1429526318059,89,-0.0382403,-0.0472975,-0.0251674,41
1429526318100,89,-0.029046,-0.0299242,-0.000825113,40
1429526318141,89,-0.0170688,-0.00925773,0.0220665,35
1429526318183,89,-0.00900854,0.00572372,0.0344469,31
1429526318224,89,-0.00721582,0.0108649,0.0329278,26
1429526318266,89,-0.00865442,0.00896475,0.02217,23
1429526318308,89,-0.00647504,0.00724785,0.0118139,28
1429526318350,89,0.00362349,0.0114169,0.00922377,44
1429526318391,89,0.0218454,0.023435,0.0174215,74
1429526318432,89,0.0412483,0.0385743,0.0311137,79
1429526318474,89,0.0549177,0.0507106,0.0433885,68
1429526318515,89,0.0549735,0.0527409,0.0450015,56
1429526318557,89,0.0422678,0.0435249,0.0344719,40
1429526318598,89,0.0214779,0.0268028,0.016177,38
1429526318640,89,-0.000767188,0.00657548,-0.00476859,41
1429526318681,89,-0.0183867,-0.0118393,-0.0215889,43
1429526318723,89,-0.0307962,-0.0287137,-0.0348823,40
1429526318764,89,-0.0388553,-0.0441251,-0.046183,34
1429526318806,89,-0.0441973,-0.0570047,-0.0562706,25
1429526318847,89,-0.0475103,-0.0655939,-0.064953,21
1429526318889,89,-0.0485221,-0.0672815,-0.0700646,15
1429526318930,89,-0.0466334,-0.0607504,-0.0693965,13
1429526318972,89,-0.0403251,-0.0458542,-0.0603504,14
1429526319013,89,-0.0308957,-0.0271732,-0.0457014,38
1429526319054,89,-0.0214443,-0.0117829,-0.0314889,62
1429526319096,89,-0.0129773,-0.00312892,-0.0207546,83
1429526319137,89,-0.00565919,-0.00093511,-0.0135681,80
1429526319179,89,0.00349982,0.000805242,-0.00441409,63
1429526319220,89,0.0174891,0.00949244,0.0136731,50
1429526319261,89,0.0374583,0.0286155,0.0432488,39
1429526319302,89,0.0615446,0.0566482,0.0814568,40
1429526319344,89,0.0852422,0.0857486,0.118629,45
1429526319385,89,0.101048,0.105323,0.142911,46
1429526319426,89,0.101548,0.106841,0.144158,40
1429526319468,89,0.083669,0.0878113,0.119381,35
1429526319509,89,0.0500469,0.0530122,0.0742544,26
1429526319550,89,0.0088378,0.0124668,0.0212181,22
1429526319592,89,-0.029114,-0.0236883,-0.0267495,19
1429526319633,89,-0.0554815,-0.0480766,-0.0600814,24
1429526319675,89,-0.0673712,-0.0602093,-0.0779621,50
1429526319716,89,-0.0650105,-0.0607968,-0.0817117,71
1429526319758,89,-0.0532824,-0.053513,-0.0761089,79
1429526319800,89,-0.0391134,-0.0428903,-0.0668783,72
1429526319811,89,-0.0275396,-0.0315979,-0.0564289,66
1429526319822,89,-0.0214602,-0.022382,-0.0465148,66
1429526319863,89,-0.0198391,-0.0155127,-0.0361832,45
1429526319905,89,-0.0201511,-0.0120553,-0.0262763,36
1429526319946,89,-0.019522,-0.0126659,-0.0183273,35
1429526319987,89,-0.015171,-0.0150514,-0.0114564,40
1429526320029,89,-0.00874829,-0.0189222,-0.00756572,45
1429526320071,89,-0.000120222,-0.019372,-0.00265376,42
1429526320112,89,0.00915082,-0.0132382,0.00561458,36
1429526320154,89,0.017835,0.000357301,0.0185435,32
1429526320195,89,0.0242735,0.018354,0.0334158,28
1429526320236,89,0.027301,0.0355092,0.0461183,26
1429526320277,89,0.0244775,0.0438114,0.0489606,35
1429526320319,89,0.0178786,0.0420705,0.042095,50
1429526320360,89,0.0102305,0.0315415,0.027675,75
1429526320401,89,0.00619956,0.0185947,0.0130527,80
1429526320442,90,0.00955619,0.0108366,0.00622239,77
1429526320484,90,0.0247069,0.017102,0.0165462,63
1429526320496,90,0.04717,0.0350134,0.0404076,58
1429526320537,90,0.0688413,0.0560568,0.0674805,50
1429526320579,90,0.0795418,0.0680886,0.0837121,47
1429526320620,90,0.0727813,0.0622574,0.0794021,49
1429526320662,90,0.0467816,0.0368395,0.0523323,48
1429526320704,90,0.00822669,-0.00112397,0.0104652,45
1429526320716,90,-0.0325112,-0.0396094,-0.0338907,43
1429526320757,90,-0.0653343,-0.0674364,-0.069408,39
1429526320799,90,-0.0847219,-0.0794588,-0.0909973,33
1429526320841,90,-0.0902442,-0.0773793,-0.100107,29
1429526320853,90,-0.0858826,-0.0679692,-0.101961,28
1429526320894,90,-0.0762151,-0.057952,-0.100312,26
1429526320935,90,-0.0637645,-0.0505789,-0.0947061,37
1429526320947,90,-0.0495271,-0.0450854,-0.0819563,43
1429526320988,90,-0.0338602,-0.0386996,-0.0596398,58
1429526321000,90,-0.016669,-0.0280328,-0.0279522,64
1429526321041,90,0.000563108,-0.0123498,0.00784237,67
1429526321082,90,0.0156547,0.00651004,0.0402634,59
1429526321124,90,0.0272857,0.0249005,0.0628207,49
1429526321136,90,0.0352555,0.0391764,0.0727482,44
1429526321176,90,0.039426,0.0466204,0.0710776,38
1429526321218,90,0.0407046,0.0472751,0.0623395,36
1429526321230,90,0.0402442,0.0432016,0.0518706,37
1429526321271,90,0.0378881,0.0368061,0.0422136,40
1429526321283,90,0.0346084,0.0311916,0.0350511,40
1429526321324,90,0.0299625,0.0268841,0.0281603,39
1429526321339,90,0.0257828,0.0248366,0.021826,37
1429526321350,90,0.0224251,0.023319,0.0146868,36
1429526321391,90,0.0180825,0.019807,0.00568603,31
1429526321405,90,0.0115568,0.0124047,-0.00536284,28
1429526321447,90,0.00236583,0.00116856,-0.0172146,22
1429526321473,90,-0.00824064,-0.0122129,-0.0282968,20
1429526321514,90,-0.0176816,-0.0245222,-0.0361805,16
1429526321541,90,-0.0240879,-0.0329022,-0.0394931,16
1429526321583,90,-0.0261637,-0.0355013,-0.0375614,29
1429526321605,90,-0.0253708,-0.0327885,-0.0317786,38
1429526321646,90,-0.0227852,-0.0261959,-0.0233951,65
1429526321687,90,-0.0191355,-0.0177235,-0.013698,73
1429526321705,90,-0.0146378,-0.00920648,-0.0038068,73
1429526321745,90,-0.00939082,-0.00224468,0.00542334,66
1429526321773,90,-0.0053933,0.00133487,0.011622,55
1429526321814,90,-0.00431292,0.000953033,0.0132518,40
1429526321838,90,-0.00746043,-0.00294164,0.00945647,37
1429526321879,90,-0.0127059,-0.00723087,0.0028532,35
1429526321905,90,-0.0169914,-0.00926873,-0.00380058,36
1429526321946,90,-0.0163673,-0.00627084,-0.00675387,38
1429526321973,90,-0.00899362,0.00188128,-0.00443372,36
1429526322015,90,0.00356503,0.0127411,0.0018242,30
1429526322040,90,0.0169718,0.022606,0.00985749,28
1429526322073,90,0.0261541,0.0275221,0.0161115,26
1429526322107,90,0.0272625,0.0250092,0.0178081,25
1429526322141,90,0.0204964,0.0157938,0.014256,24
1429526322173,90,0.00910256,0.00335492,0.00716796,22
1429526322214,90,-0.00116157,-0.00744092,0.000102337,26
1429526322256,90,-0.00611809,-0.0128398,-0.00416204,39
1429526322297,90,-0.00523621,-0.0121555,-0.00508335,60
1429526322339,90,-0.000366759,-0.00705981,-0.00363682,65
1429526322380,90,0.00457684,-0.00150349,-0.00241566,58
1429526322421,90,0.00801449,0.0025732,-0.00131305,48
1429526322463,90,0.00880494,0.0037532,-0.000410737,32
1429526322504,90,0.00748413,0.00216829,0.000690783,27
1429526322546,90,0.00462238,-0.000806881,0.00202919,32
1429526322588,90,0.000121397,-0.00484494,0.00112463,36
1429526322629,90,-0.00497814,-0.00859061,-0.00279407,38
1429526322670,90,-0.00825982,-0.00966401,-0.00783054,34
1429526322711,90,-0.00903264,-0.00861369,-0.013538,30
1429526322753,90,-0.00660143,-0.00495892,-0.0166782,24
1429526322794,90,-0.00127229,0.00065824,-0.0151705,20
1429526322835,90,0.00518439,0.00728185,-0.00811082,16
1429526322877,90,0.0101811,0.0130976,0.0027211,25
1429526322919,90,0.00982915,0.0149778,0.0121665,53
1429526322960,90,0.00434057,0.0129182,0.0177643,69
1429526323002,90,-0.00388994,0.00848025,0.019006,71
1429526323043,90,-0.0104019,0.00434881,0.0175042,63
1429526323085,90,-0.0118286,0.00252617,0.0152927,45
1429526323126,90,-0.00611676,0.00573069,0.0162721,36
1429526323168,90,0.00447313,0.0124604,0.0201837,34
1429526323213,90,0.0139487,0.018033,0.0234115,39
1429526323225,90,0.0165657,0.0172758,0.0215225,40
1429526323266,90,0.00866454,0.00685621,0.0108779,42
1429526323308,90,-0.00820922,-0.0122803,-0.00844984,40
1429526323350,90,-0.0271714,-0.0333285,-0.0306103,32
1429526323395,90,-0.0417364,-0.0496531,-0.0504253,27
1429526323407,90,-0.0473484,-0.0577521,-0.0641529,24
1429526323448,90,-0.0431244,-0.0561919,-0.0690142,19
1429526323489,90,-0.0342063,-0.0503451,-0.0686294,23
1429526323532,90,-0.0258305,-0.0445419,-0.0649355,48
1429526323543,90,-0.0220314,-0.0406653,-0.0588508,48
1429526323585,90,-0.0189284,-0.0341402,-0.045674,70
1429526323626,90,-0.0107666,-0.018585,-0.0209453,71
1429526323668,91,0.00837119,0.00996916,0.016438,59
1429526323709,91,0.0379918,0.0485889,0.0609329,47
1429526323751,91,0.0717033,0.0882305,0.102132,35
1429526323792,91,0.0978567,0.11623,0.127749,34
1429526323834,91,0.106334,0.122761,0.1298,40
1429526323875,91,0.0928255,0.10499,0.107784,43
1429526323917,91,0.0605338,0.0680989,0.0681921,40
1429526323958,91,0.0199542,0.0238063,0.023063,35
1429526324000,91,-0.0175352,-0.0157274,-0.0162849,27
1429526324041,91,-0.0428569,-0.0421745,-0.0424797,22
1429526324082,91,-0.0530835,-0.0535997,-0.0542414,19
1429526324125,91,-0.0493708,-0.0531673,-0.0541791,33
1429526324167,91,-0.0383972,-0.0472237,-0.0481211,50
1429526324208,91,-0.0272964,-0.0412423,-0.0410478,65
1429526324250,92,-0.0200378,-0.0363434,-0.0345152,62
1429526324292,92,-0.0187468,-0.0327209,-0.0293656,48
1429526324335,92,-0.0208441,-0.0274256,-0.0233131,34
1429526324376,92,-0.0236212,-0.0205286,-0.0166436,29
1429526324417,92,-0.022868,-0.0117411,-0.0086342,31
1429526324459,92,-0.018444,-0.00423773,-0.00169232,36
1429526324501,92,-0.0111921,5.71955e-05,0.00277723,37
1429526324513,92,-0.00499424,-0.00102355,0.00238005,36
1429526324554,92,-0.00206739,-0.00549114,-0.00203313,30
1429526324595,92,-0.0029701,-0.0102809,-0.00858709,26
1429526324637,92,-0.00523507,-0.0110496,-0.0133885,19
1429526324679,92,-0.00577091,-0.00558177,-0.0135209,18
1429526324721,92,-0.00167881,0.00618908,-0.00691712,36
1429526324733,92,0.00934595,0.0222214,0.00691668,36
1429526324775,92,0.0256599,0.0388984,0.025773,61
1429526324786,92,0.0446287,0.0528338,0.0461355,66
1429526324828,93,0.0607713,0.0610674,0.0629491,66
1429526324870,93,0.0693996,0.0622019,0.0717285,53
1429526324911,93,0.0662423,0.0546038,0.0680334,41
1429526324952,93,0.0506499,0.0385982,0.0513288,30
1429526324994,93,0.0257236,0.0164722,0.0250079,30
1429526325006,93,-0.00150534,-0.00640952,-0.00314031,32
1429526325047,93,-0.0228518,-0.0245336,-0.0249605,37
1429526325089,93,-0.0331929,-0.0330731,-0.0348003,39
1429526325131,93,-0.0305641,-0.0295439,-0.030586,35
1429526325142,93,-0.0184033,-0.0165587,-0.016358,33
1429526325155,93,-0.00217143,0.00116571,0.00174015,31
1429526325196,93,0.0106538,0.0158796,0.0153852,26
1429526325239,93,0.0157624,0.02207,0.0195315,20
1429526325253,93,0.00926195,0.0147229,0.0101033,18
1429526325298,93,-0.00760489,-0.00546078,-0.0114582,17
1429526325309,93,-0.0312677,-0.0342513,-0.040746,22
1429526325351,93,-0.0557889,-0.0641424,-0.0705577,38
1429526325392,93,-0.0748012,-0.0865481,-0.0926647,66
1429526325404,93,-0.0828636,-0.0951307,-0.100895,71
1429526325445,94,-0.0764391,-0.0863207,-0.091119,70
1429526325486,94,-0.0559997,-0.0614931,-0.0643877,61
1429526325498,94,-0.0244721,-0.0249516,-0.024451,55
1429526325541,94,0.0103673,0.0142325,0.0192462,38
1429526325553,94,0.0402328,0.0474316,0.0570376,38
1429526325596,94,0.058374,0.0675768,0.080583,32
1429526325607,94,0.0625613,0.0724488,0.0868808,34
1429526325649,94,0.0553392,0.0650949,0.0784499,39
1429526325673,94,0.0421044,0.0513375,0.0609272,41
1429526325715,94,0.0295114,0.0382069,0.0418101,41
1429526325741,94,0.0210502,0.0293031,0.0261159,39
1429526325782,94,0.0173011,0.024843,0.0158054,35
1429526325805,94,0.0162631,0.0226156,0.0105326,31
1429526325846,94,0.0148073,0.0192896,0.00773342,26
1429526325873,94,0.0110353,0.0129999,0.00493125,22
1429526325914,94,0.00504718,0.00399603,8.67441e-05,25
1429526325941,94,-0.00160559,-0.0054596,-0.00666588,39
1429526325982,94,-0.00747066,-0.0137905,-0.0150833,55
1429526326005,94,-0.0108756,-0.0190035,-0.0221489,67
1429526326046,94,-0.0120789,-0.0214665,-0.0263317,68
1429526326073,96,-0.0115439,-0.0218283,-0.0257827,61
1429526326114,96,-0.0111811,-0.0227334,-0.0222192,50
1429526326141,96,-0.0120555,-0.0250058,-0.0176345,39
1429526326182,96,-0.0148535,-0.0287977,-0.0151248,32
1429526326206,96,-0.0192532,-0.0325701,-0.0158564,33
1429526326241,96,-0.0226895,-0.032887,-0.0185285,39
1429526326274,96,-0.0227281,-0.0266862,-0.0194862,43
1429526326306,96,-0.0176589,-0.0138901,-0.0165257,44
1429526326341,96,-0.00908744,0.00234609,-0.00978973,43
1429526326373,96,0.000287682,0.0168335,-0.00160014,39
1429526326405,96,0.00773173,0.0254032,0.00538004,34
1429526326447,96,0.0101708,0.0252087,0.00860393,30
1429526326488,96,0.00712018,0.0175772,0.00827591,26
1429526326529,96,0.000814333,0.00696631,0.00707191,27
1429526326571,96,-0.00545249,-0.00168437,0.0078667,47
1429526326612,96,-0.00841514,-0.00494388,0.0116734,64
1429526326654,96,-0.00704552,-0.00307026,0.0165738,72
1429526326698,97,-0.00171498,0.0014298,0.0196691,63
1429526326713,97,0.00611271,0.00622087,0.0194834,56
1429526326754,97,0.013733,0.00875288,0.0154135,40
1429526326795,97,0.0183099,0.00770178,0.00806344,19
1429526326840,97,0.0182191,0.00376487,-0.000612159,17
1429526326852,97,0.012692,-0.00236375,-0.00925342,17
1429526326893,97,0.00422834,-0.00706596,-0.0152991,28
1429526326935,97,-0.00343454,-0.00834657,-0.0173822,31
1429526326979,97,-0.00752501,-0.00482784,-0.015271,25
1429526327021,97,-0.00604106,0.00329533,-0.00921727,18
1429526327062,97,-0.000426981,0.0134872,-0.00174323,6
1429526327104,97,0.00662075,0.0218988,0.00474444,0
1429526327145,97,0.0120578,0.0260697,0.00926783,0
1429526327187,97,0.0136105,0.0236361,0.0110851,22
1429526327229,97,0.010934,0.015236,0.0114748,63
1429526327271,97,0.00425245,0.00177976,0.00962015,74
1429526327313,97,-0.00481431,-0.013834,0.00549449,62
1429526327358,97,-0.0137548,-0.0279073,-0.000380819,38
1429526327370,97,-0.0209573,-0.03793,-0.0078345,38
1429526327411,97,-0.02388,-0.0406393,-0.0134838,17
1429526327452,97,-0.0222127,-0.0360588,-0.0155447,38
1429526327539,97,-0.0168859,-0.0258495,-0.013027,38
1429526327581,97,-0.0101128,-0.0132574,-0.00724782,14
1429526327697,97,-0.00475885,-0.00208394,-0.00170968,12
1429526327710,97,-0.0018423,0.00547538,0.000596646,10
1429526327752,97,-0.000350691,0.0100498,-0.000565421,12
1429526327794,97,7.76731e-05,0.0122217,-0.0053472,44
1429526327836,97,0.00249922,0.0155941,-0.00889462,73
1429526327878,97,0.00663878,0.0198422,-0.00934245,87
1429526327920,97,0.0132108,0.0249454,-0.00436071,79
1429526327961,97,0.021091,0.0287222,0.0050343,56
1429526328003,97,0.0294975,0.0301706,0.0173804,41
1429526328044,97,0.0367091,0.0281679,0.0295668,32
1429526328086,97,0.0379374,0.0211688,0.0368437,36
1429526328128,97,0.0290883,0.00800627,0.0343898,45
1429526328170,97,0.00975283,-0.00965434,0.0211205,47
1429526328211,97,-0.0175454,-0.0290265,-0.00143875,40
1429526328253,97,-0.0432704,-0.043718,-0.0251824,32
1429526328294,97,-0.0576463,-0.0481417,-0.0411662,20
1429526328336,97,-0.0549013,-0.0397771,-0.043209,12
1429526328378,97,-0.0341006,-0.0179015,-0.0279152,19
1429526328420,97,-0.0048665,0.00970582,-0.00303879,40
1429526328461,97,0.0231815,0.0359415,0.0231689,71
1429526328503,98,0.0393884,0.0510786,0.0390012,72
1429526328514,98,0.0383348,0.0489846,0.0372015,69
1429526328556,98,0.0232431,0.0304157,0.0189563,57
1429526328597,98,-3.20021e-05,-0.000371018,-0.0106865,35
1429526328639,98,-0.0215299,-0.0331286,-0.0400985,23
1429526328680,98,-0.0333187,-0.0557299,-0.0570111,22
1429526328724,98,-0.0307175,-0.0595729,-0.0534255,30
1429526328736,98,-0.0130102,-0.0408221,-0.026904,34
1429526328777,98,0.0135635,-0.00634392,0.0135613,36
1429526328789,98,0.0388516,0.0301972,0.0525621,36
1429526328830,98,0.0517802,0.0523256,0.0726672,28
1429526328872,98,0.045111,0.0501794,0.0642285,22
1429526328914,98,0.0201853,0.025037,0.0301993,14
1429526328926,98,-0.0152227,-0.0119073,-0.0161322,14
1429526328968,98,-0.0477144,-0.0438031,-0.0556464,11
1429526328979,98,-0.0638713,-0.0553202,-0.0715755,17
1429526329021,98,-0.0576151,-0.041546,-0.0584246,39
1429526329033,98,-0.0317843,-0.00918544,-0.0234874,51
1429526329074,98,0.00280925,0.0271808,0.0175178,72
1429526329116,98,0.034319,0.0540051,0.0494744,72
1429526329157,99,0.0536157,0.0639769,0.0638181,59
1429526329169,99,0.0574384,0.0579722,0.0608037,51
1429526329210,99,0.0467381,0.0414071,0.0455306,35
1429526329222,99,0.0259476,0.01994,0.023992,27
1429526329265,99,0.000455461,-0.00221575,0.000758824,20
1429526329283,99,-0.0219166,-0.0216605,-0.0202628,23
1429526329305,99,-0.0359071,-0.0362434,-0.0366462,27
1429526329347,99,-0.0383834,-0.04438,-0.0465292,39
1429526329373,99,-0.0293209,-0.0444365,-0.0480626,40
1429526329414,99,-0.0123336,-0.0366771,-0.0409984,36
1429526329441,99,0.00684448,-0.0227909,-0.0266805,33
1429526329483,99,0.0221349,-0.00656166,-0.00874423,24
1429526329505,99,0.0292416,0.00755643,0.00812644,21
1429526329547,99,0.0262194,0.0158758,0.0193032,14
1429526329573,99,0.0128739,0.0144606,0.0197749,13
1429526329614,99,-0.00694684,0.00393903,0.00959635,27
1429526329641,99,-0.0272176,-0.0118692,-0.0077025,37
1429526329682,99,-0.0407937,-0.02546,-0.0240553,68
1429526329705,99,-0.0425665,-0.0296333,-0.0309371,73
1429526329746,99,-0.0313782,-0.0204378,-0.0235147,69
1429526329773,99,-0.0100345,0.000779069,-0.0023898,64
1429526329814,99,0.0150313,0.0274064,0.0256533,42
1429526329841,99,0.0363559,0.0503824,0.0510267,36
1429526329882,99,0.0488319,0.062826,0.0659375,29
1429526329905,99,0.0492523,0.0606252,0.0651631,31
1429526329946,99,0.0385391,0.0450021,0.0495339,38
1429526329973,99,0.0205022,0.0214522,0.0250863,42
1429526330014,99,-0.000206255,-0.00345822,-0.000496001,39
1429526330041,99,-0.019502,-0.0246781,-0.0207906,36
1429526330082,99,-0.0344149,-0.0392795,-0.0328541,26
1429526330107,99,-0.0435375,-0.0473335,-0.0380339,24
1429526330141,99,-0.0465427,-0.0496858,-0.0400157,19
1429526330173,99,-0.0429652,-0.0467453,-0.0413564,16
1429526330207,99,-0.033021,-0.0384157,-0.0425712,19
1429526330241,99,-0.0172282,-0.0242979,-0.0405551,35
1429526330275,99,0.00151547,-0.00623747,-0.0323503,56
1429526330307,99,0.0194787,0.0130691,-0.0159697,73
1429526330341,99,0.0330984,0.0293657,0.00599066,75
1429526330374,98,0.0399448,0.038705,0.0281185,67
1429526330407,98,0.0388712,0.0381891,0.042182,53
1429526330440,98,0.032237,0.0290716,0.0445117,38
1429526330474,98,0.0227612,0.0151372,0.0357591,25
1429526330508,98,0.013675,0.00205871,0.022242,23
1429526330541,98,0.00611486,-0.00567609,0.0101602,29
1429526330575,98,0.000779895,-0.00620516,0.00459552,38
1429526330607,98,-0.00374166,-0.00198616,0.00380675,41
1429526330640,98,-0.00836633,0.00317365,0.0038456,40
1429526330682,98,-0.0130555,0.00521517,-0.000260285,32
1429526330724,98,-0.0167246,0.00268045,-0.00972896,26
1429526330766,98,-0.0181705,-0.00325621,-0.0217166,20
1429526330807,98,-0.0165019,-0.00969271,-0.0305651,18
1429526330851,98,-0.0118402,-0.0136372,-0.0309622,36
1429526330893,98,-0.00534169,-0.0132509,-0.0210891,60
1429526330938,98,0.000165814,-0.0096486,-0.0049802,88
1429526330950,98,0.00267939,-0.00433579,0.0114069,89
1429526330991,98,0.00197609,0.000493175,0.0220774,81
1429526331033,98,-0.00105295,0.0036142,0.0244205,61
1429526331074,98,-0.0056249,0.00349992,0.0184455,48
1429526331116,98,-0.0106373,-9.4754e-05,0.00727571,40
1429526331157,98,-0.0144207,-0.00588949,-0.00418799,43
1429526331199,98,-0.0164135,-0.0122297,-0.0126457,51
1429526331241,98,-0.0141189,-0.0153535,-0.0145672,50
1429526331283,98,-0.00756184,-0.0139947,-0.0110765,43
1429526331324,98,0.00215828,-0.00798853,-0.00466007,37
1429526331366,98,0.0120931,0.000192362,0.000221354,28
1429526331408,98,0.0190247,0.00765671,0.000553691,25
1429526331449,98,0.0219086,0.0134137,-0.00229015,25
1429526331490,98,0.0214181,0.0172564,-0.00568314,37
1429526331532,98,0.0196276,0.0200311,-0.00571513,65
1429526331573,98,0.0170067,0.0209991,-0.00224094,77
1429526331615,98,0.0136445,0.0200345,0.00407709,72
1429526331663,98,0.00821579,0.0158382,0.00972448,62
1429526331678,98,-0.000164918,0.00769794,0.0113589,56
1429526331720,98,-0.0106997,-0.00328583,0.00815435,42
1429526331761,98,-0.0213384,-0.0157958,0.000945558,40
1429526331803,98,-0.0293399,-0.0268094,-0.00694465,44
1429526331845,98,-0.034104,-0.0354725,-0.0133488,45
1429526331887,98,-0.0344082,-0.0391887,-0.0159577,41
1429526331928,98,-0.0313912,-0.0375828,-0.0149861,36
1429526331970,98,-0.0265363,-0.0315726,-0.0122815,28
1429526332012,98,-0.0208632,-0.022668,-0.00941679,23
1429526332054,98,-0.0147866,-0.0138936,-0.00867539,19
1429526332095,98,-0.00823675,-0.0071633,-0.0100968,15
1429526332136,98,0.000523977,-0.0020526,-0.0122307,24
1429526332178,98,0.0135451,0.00517475,-0.0105338,42
1429526332219,98,0.0316689,0.0189804,-0.00177564,71
1429526332261,98,0.0535465,0.0411629,0.0156906,73
1429526332304,97,0.0738556,0.0675121,0.0384324,61
1429526332346,97,0.0854295,0.0881295,0.0586585,49
1429526332387,97,0.0828948,0.0937338,0.0698337,36
1429526332428,97,0.0646798,0.0793555,0.0674719,34
1429526332470,97,0.0330161,0.0463056,0.0506322,39
1429526332511,97,-0.00577724,0.00360909,0.023227,40
1429526332552,97,-0.0410884,-0.0355148,-0.0065484,35
1429526332593,97,-0.0665348,-0.061769,-0.0325906,27
1429526332635,97,-0.0776746,-0.0718821,-0.0506193,14
1429526332677,97,-0.0766421,-0.0698129,-0.0608604,9
1429526332718,97,-0.0673271,-0.0628736,-0.0654327,7
1429526332760,97,-0.0544054,-0.0560429,-0.0651537,5
1429526332802,97,-0.0411143,-0.0512932,-0.0607175,10
1429526332845,97,-0.0272119,-0.0435587,-0.048419,32
1429526332886,97,-0.0136346,-0.0308506,-0.0296584,69
1429526332928,97,-0.000441358,-0.0121055,-0.0063472,77
1429526332969,96,0.0122712,0.0106328,0.0179361,65
1429526333011,96,0.0238255,0.0328584,0.0391913,49
1429526333052,96,0.0334503,0.0493307,0.0535739,26
1429526333094,96,0.0395869,0.0556623,0.0583487,18
1429526333135,96,0.0404819,0.0501862,0.052374,22
1429526333176,96,0.0357611,0.0344525,0.0367571,30
1429526333221,96,0.02663,0.0142983,0.0163561,38
1429526333233,96,0.0153168,-0.00351742,-0.00284737,38
1429526333274,96,0.00569187,-0.0125755,-0.0146975,36
1429526333286,96,-0.000793502,-0.0107979,-0.0167713,32
1429526333327,96,-0.00286014,-5.76896e-06,-0.0100083,22
1429526333368,96,-0.00111248,0.0148995,0.00162987,12
1429526333380,96,0.00390308,0.0292369,0.0145478,8
1429526333423,96,0.0107901,0.0377205,0.0239353,4
1429526333434,96,0.0188724,0.0389923,0.0281569,4
1429526333476,96,0.02731,0.0343617,0.0275649,10
1429526333489,96,0.0338151,0.0259879,0.0233025,19
1429526333530,96,0.0359198,0.0151544,0.0156126,45
1429526333572,96,0.0304197,0.00238705,0.00464695,81
1429526333584,96,0.0168641,-0.0123441,-0.00910924,81
1429526333625,96,-0.00471467,-0.0297829,-0.0256764,79
1429526333667,95,-0.0293815,-0.047346,-0.0413907,65
1429526333709,95,-0.0516002,-0.0612527,-0.0523659,39
1429526333721,95,-0.064582,-0.0666744,-0.0543938,30
1429526333762,95,-0.0641576,-0.0595184,-0.0446463,20
1429526333803,95,-0.0517052,-0.0417645,-0.0264263,24
1429526333815,95,-0.031996,-0.0172243,-0.00445249,24
1429526333857,95,-0.0112666,0.00742845,0.015078,38
1429526333873,95,0.00496071,0.0266469,0.0280373,40
1429526333915,95,0.015313,0.0388016,0.0346357,41
1429526333941,95,0.0192764,0.0427084,0.0351501,38
1429526333982,95,0.0182087,0.0392269,0.0309994,29
1429526334005,95,0.0143905,0.0298693,0.0236678,18
1429526334046,95,0.00897522,0.0154728,0.0120603,8
1429526334073,95,0.00242134,-0.00291824,-0.00426502,3
1429526334114,95,-0.0047623,-0.0227554,-0.0236889,5
1429526334140,95,-0.010242,-0.0386369,-0.0413218,25
1429526334182,95,-0.0113509,-0.0446538,-0.0512614,53
1429526334205,95,-0.00582195,-0.0373585,-0.0486778,79
1429526334246,95,0.00689303,-0.0168428,-0.0325311,85
1429526334273,94,0.0229894,0.0103833,-0.00755371,77
1429526334314,94,0.0373197,0.0360081,0.0198437,62
1429526334340,94,0.0434997,0.0509837,0.0407916,42
1429526334372,94,0.0395649,0.0520643,0.0513504,25
1429526334413,94,0.0256435,0.0398543,0.0500238,16
1429526334440,94,0.00712093,0.0212434,0.0401275,18
1429526334482,94,-0.0100045,0.00369751,0.0266514,26
1429526334506,94,-0.0194634,-0.00589419,0.0154446,31
1429526334546,94,-0.0195664,-0.00659979,0.00839582,29
1429526334573,94,-0.0132781,-0.00222912,0.00418691,21
1429526334614,94,-0.00636123,0.000410776,-0.00110404,11
1429526334640,94,-0.00429853,-0.00396401,-0.0102885,2
1429526334682,94,-0.00885553,-0.0155387,-0.0222882,0
1429526334707,94,-0.0172717,-0.0299125,-0.0327706,0
1429526334741,94,-0.0247364,-0.0402107,-0.0368019,0
1429526334774,94,-0.0256256,-0.0401989,-0.0307286,16
1429526334805,94,-0.0186416,-0.0292016,-0.0168263,36
1429526334840,94,-0.00645314,-0.0111943,-0.000844035,84
1429526334872,94,0.00508625,0.00618135,0.0096564,85
1429526334905,94,0.0106285,0.015755,0.00941831,55
1429526334946,94,0.00846124,0.0156164,-0.000377394,45
1429526334991,94,0.00103926,0.00786221,-0.0144378,32
1429526335005,94,-0.00700748,-0.00232313,-0.0263684,29
1429526335046,94,-0.0103497,-0.00827872,-0.0294907,29
1429526335088,94,-0.00616651,-0.00592611,-0.0216398,33
1429526335129,94,0.00544645,0.00536933,-0.00381588,40
1429526335170,94,0.0193563,0.0206576,0.0168682,40
1429526335211,94,0.0293708,0.0324284,0.0324589,36
1429526335270,94,0.0315067,0.035371,0.0371533,31
1429526335295,94,0.02383,0.0259167,0.0285143,28
1429526335315,94,0.00917841,0.00731723,0.0107633,27
1429526335328,94,-0.0084168,-0.0147754,-0.00938347,27
1429526335370,94,-0.0255923,-0.0344948,-0.0254861,33
1429526335411,94,-0.0396852,-0.0478396,-0.0331893,53
1429526335452,94,-0.0498442,-0.0538332,-0.0325577,63
1429526335494,94,-0.0551643,-0.0532779,-0.0265528,61
1429526335535,94,-0.0535326,-0.0462935,-0.0176123,54
1429526335576,94,-0.0426107,-0.0323671,-0.00722937,41
1429526335617,94,-0.0222373,-0.0121593,0.00550403,37
1429526335659,94,0.00502345,0.0124279,0.0213871,37
1429526335700,94,0.0338072,0.0378631,0.039642,40
1429526335742,94,0.0572098,0.0577948,0.0562001,40
1429526335784,94,0.068535,0.0662801,0.0645674,38
1429526335826,94,0.0654715,0.0611144,0.059389,32
1429526335870,94,0.0496433,0.0434893,0.0398625,29
1429526335911,94,0.0280336,0.020125,0.0108987,25
1429526335954,94,0.00947736,-8.46187e-06,-0.0170435,29
1429526335997,94,0.000597421,-0.00973843,-0.0327878,47
1429526336009,94,0.00309757,-0.00659426,-0.0304175,54
1429526336051,94,0.0142388,0.00747196,-0.0106396,63
1429526336093,94,0.0237366,0.0216554,0.0127963,60
1429526336134,94,0.0245796,0.0279431,0.0274659,53
1429526336176,94,0.0122422,0.0199367,0.0224208,42
1429526336217,94,-0.00924305,0.000307658,-0.000462218,38
1429526336259,94,-0.0301849,-0.0217858,-0.0290969,40
1429526336300,94,-0.0419529,-0.0369313,-0.0500955,43
1429526336342,94,-0.0391086,-0.0377113,-0.0526444,43
1429526336384,94,-0.0258629,-0.0270991,-0.0390209,40
1429526336425,94,-0.0110268,-0.0123697,-0.018722,35
1429526336471,94,-0.00471084,-0.00354694,-0.00483457,31
1429526336483,94,-0.0106814,-0.00560561,-0.00382877,30
1429526336524,94,-0.0260871,-0.0179789,-0.0149662,28
1429526336565,94,-0.0425544,-0.0336024,-0.0287448,37
1429526336607,94,-0.0516531,-0.0445539,-0.0356992,48
1429526336649,94,-0.0484639,-0.0452904,-0.0300281,60
1429526336691,95,-0.0347959,-0.0357334,-0.0140543,58
1429526336732,95,-0.0160532,-0.0196443,0.00588454,50
1429526336773,95,0.00229758,-0.00206558,0.0233807,43
1429526336816,95,0.0161112,0.0111628,0.0326307,37
1429526336858,95,0.0234311,0.0171224,0.0313184,40
1429526336900,95,0.0266207,0.0183555,0.0239777,42
1429526336944,95,0.0259445,0.015389,0.012474,42
1429526336956,95,0.0217999,0.00957947,-0.00113785,42
1429526336997,95,0.0146501,0.00261645,-0.0144637,40
1429526337038,95,0.00561219,-0.00418374,-0.0263969,37
1429526337080,95,-0.00219269,-0.00727598,-0.0327531,32
1429526337121,95,-0.00520221,-0.00421011,-0.0305543,30
1429526337162,95,0.00169024,0.00811573,-0.0149193,38
1429526337204,95,0.0202149,0.0300525,0.0151715,49
1429526337245,95,0.0479727,0.0590875,0.0565322,62
1429526337287,95,0.0790946,0.0897065,0.101369,61
1429526337329,95,0.101386,0.110528,0.13391,52
1429526337370,95,0.105226,0.113182,0.14237,44
1429526337411,95,0.0850279,0.0924149,0.11976,37
1429526337453,95,0.0431734,0.0496606,0.0687899,37
1429526337494,95,-0.00997518,-0.00479875,0.00347254,41
1429526337537,95,-0.0595147,-0.0568596,-0.0579931,42
1429526337578,95,-0.0921497,-0.0933808,-0.0994245,40
1429526337621,95,-0.10477,-0.11095,-0.118329,38
1429526337662,95,-0.100923,-0.111852,-0.119162,34
1429526337704,95,-0.090605,-0.105213,-0.114455,31
1429526337745,95,-0.0810136,-0.0957256,-0.109766,32
1429526337787,95,-0.0740566,-0.0841486,-0.104312,40
1429526337828,95,-0.064344,-0.0654388,-0.0895507,55
1429526337870,95,-0.0457438,-0.0354271,-0.0579419,59
1429526337911,96,-0.0156646,0.00315073,-0.0116971,57
1429526337952,96,0.0212958,0.0420607,0.039038,48
1429526337993,96,0.0543154,0.0670926,0.0756159,40
1429526338035,96,0.0741034,0.0720585,0.0883216,36
1429526338046,96,0.0773494,0.059808,0.0788202,36
1429526338087,96,0.0693382,0.0428656,0.0615074,39
1429526338128,96,0.0591018,0.0345472,0.0528704,42
1429526338170,96,0.0525207,0.0395944,0.0590903,42
1429526338181,96,0.0515033,0.054028,0.0752652,41
1429526338222,96,0.0513945,0.0671688,0.0877423,40
1429526338264,96,0.0458778,0.0674224,0.0823516,36
1429526338275,96,0.0327598,0.0532815,0.0578125,36
1429526338317,96,0.0126955,0.0275335,0.0195664,33
1429526338327,96,-0.0086518,0.000704697,-0.0172936,33
1429526338369,96,-0.0252906,-0.0198939,-0.0421079,35
1429526338380,96,-0.0342294,-0.0307606,-0.0508484,39
1429526338422,96,-0.0348116,-0.0329357,-0.0464976,47
1429526338434,96,-0.0297589,-0.0301966,-0.0365828,52
1429526338475,96,-0.0224081,-0.0255787,-0.0271398,58
1429526338486,96,-0.017565,-0.0237839,-0.0241595,59
1429526338527,97,-0.0184535,-0.027076,-0.0295637,57
1429526338569,97,-0.0252049,-0.0357372,-0.0411016,56
1429526338580,97,-0.0351818,-0.0472322,-0.0538069,48
1429526338622,97,-0.0445483,-0.0588642,-0.0638875,34
1429526338640,97,-0.0500923,-0.0674728,-0.0691696,29
1429526338682,97,-0.0481996,-0.0688242,-0.0672346,28
1429526338706,97,-0.0372867,-0.0588304,-0.0552963,31
1429526338741,97,-0.0168686,-0.0349923,-0.031272,37
1429526338782,97,0.0100437,0.00143337,0.00471018,38
1429526338807,97,0.0362538,0.0427701,0.0461242,36
1429526338841,97,0.0539373,0.0777366,0.0817605,30
1429526338882,97,0.0557266,0.094677,0.0985728,21
1429526338907,97,0.0409005,0.0869737,0.0886556,18
1429526338941,97,0.0156294,0.0576712,0.0543893,14
1429526338974,97,-0.0090081,0.0179692,0.00882625,15
1429526339006,97,-0.0253665,-0.0210309,-0.0346045,31
1429526339042,97,-0.0276108,-0.0458005,-0.0596559,54
1429526339075,97,-0.0174955,-0.0508416,-0.0604378,75
1429526339106,97,-0.00149745,-0.0387785,-0.0412837,80
1429526339140,98,0.0122286,-0.0180611,-0.0131329,74
1429526339182,98,0.0203725,0.00308133,0.0142685,55
1429526339229,98,0.0219989,0.0171683,0.0331028,37
1429526339241,98,0.0185727,0.0201765,0.039745,37
1429526339282,98,0.0135714,0.0153201,0.0376242,34
1429526339324,98,0.00705224,0.00411103,0.0260233,39
1429526339365,98,0.00113045,-0.00620718,0.0112323,42
1429526339408,98,-0.00230011,-0.0100402,-0.00160955,40
1429526339451,98,-0.00069828,-0.00278036,-0.00548853,32
1429526339494,98,0.00901602,0.0167782,0.00521799,27
1429526339536,98,0.0242557,0.0421951,0.0275705,21
1429526339577,98,0.0393072,0.0642949,0.0528548,20
1429526339619,98,0.0463581,0.0734068,0.0690126,35
1429526339662,98,0.0406596,0.0655195,0.0670688,51
1429526339712,98,0.0222719,0.0425217,0.0446631,66
1429526339725,98,-0.0032928,0.0112389,0.00787579,65
1429526339767,98,-0.0266789,-0.0174346,-0.0290202,51
1429526339808,98,-0.0438477,-0.0408603,-0.0587818,38
1429526339854,98,-0.0520962,-0.0564049,-0.0748328,23
1429526339866,98,-0.0555894,-0.0692234,-0.0823114,22
1429526339907,98,-0.0569133,-0.08018,-0.0853011,27
1429526339952,98,-0.0591905,-0.0898254,-0.0891853,39
1429526339963,98,-0.0616009,-0.0950906,-0.0939503,39
1429526340005,98,-0.0622172,-0.0935786,-0.0973265,38
1429526340047,98,-0.05668,-0.0817815,-0.0925737,32
1429526340088,98,-0.0420272,-0.0582792,-0.0736634,22
1429526340129,98,-0.0176516,-0.02405,-0.0377238,16
1429526340172,98,0.0143414,0.0173156,0.0124143,8
1429526340185,98,0.0479489,0.0592965,0.0679737,7
1429526340226,98,0.076759,0.0946868,0.11769,16
1429526340268,98,0.0944177,0.116698,0.150059,47
1429526340309,98,0.0982265,0.122555,0.159,63
1429526340350,99,0.0883354,0.112127,0.143404,62
1429526340392,99,0.0687066,0.0896451,0.109847,53
1429526340434,99,0.0440753,0.060433,0.0682923,37
1429526340475,99,0.0190216,0.029895,0.0286149,31
1429526340517,99,-0.00287935,0.00144365,-0.00320407,36
1429526340558,99,-0.0189663,-0.0214733,-0.0235248,40
1429526340600,99,-0.028304,-0.0369695,-0.0334906,40
1429526340643,99,-0.0304623,-0.0436055,-0.0357105,36
1429526340685,99,-0.0270201,-0.0419295,-0.0345832,28
1429526340726,99,-0.0203177,-0.0342594,-0.0339277,24
1429526340767,99,-0.013876,-0.0249669,-0.0367781,19
1429526340808,99,-0.0105971,-0.0181992,-0.0432452,18
1429526340851,99,-0.0115332,-0.0164515,-0.0507152,38
1429526340892,99,-0.0168301,-0.0200824,-0.0562528,58
1429526340934,99,-0.0242728,-0.0263477,-0.0561796,77
1429526340975,99,-0.0314369,-0.0315599,-0.0494216,74
1429526341018,99,-0.035966,-0.0330048,-0.0377036,59
1429526341029,99,-0.0359536,-0.0291285,-0.0240199,59
1429526341071,99,-0.0296325,-0.0198385,-0.0102727,44
1429526341112,99,-0.0176619,-0.00766617,0.00107671,40
1429526341153,99,-0.00202758,0.0044162,0.00961539,46
1429526341195,99,0.0115586,0.011674,0.0134624,51
1429526341237,99,0.0203077,0.0142895,0.0155454,51
1429526341278,99,0.0204877,0.0103662,0.0143157,48
1429526341319,99,0.0135988,0.0036948,0.0126921,40
1429526341361,99,0.00446459,-0.00113229,0.0131313,35
1429526341402,99,-0.00167824,-0.000782959,0.0164755,29
1429526341448,99,-0.000709606,0.00636592,0.0228961,26
1429526341459,99,0.00762596,0.0184544,0.0301922,26
1429526341500,99,0.0203367,0.0320538,0.0369224,37
1429526341513,99,0.0310074,0.0409922,0.0388824,46
1429526341557,99,0.0346644,0.041545,0.0347109,77
1429526341570,99,0.02932,0.0323047,0.0244612,83
1429526341615,99,0.0173249,0.0147818,0.00939527,84
1429526341626,98,0.00359224,-0.00470476,-0.005416,80
1429526341669,98,-0.00881974,-0.0221585,-0.0184315,68
1429526341710,98,-0.0170889,-0.0335242,-0.0269268,47
1429526341751,98,-0.0221653,-0.0385616,-0.0314303,40
1429526341793,98,-0.0271552,-0.0402072,-0.0352083,41
1429526341805,98,-0.0298627,-0.0370191,-0.034834,43
1429526341846,98,-0.0285416,-0.0287973,-0.0290261,48
1429526341888,98,-0.021003,-0.0142467,-0.0158639,46
1429526341900,98,-0.004753,0.00901452,0.00754345,46
1429526341941,98,0.015942,0.0357036,0.0349584,38
1429526341982,98,0.0333108,0.0567301,0.0555281,31
1429526342024,98,0.039305,0.0615637,0.0575246,23
1429526342065,98,0.0296721,0.0451115,0.0354519,20
1429526342106,98,0.0106051,0.0148037,-0.000917513,25
1429526342148,98,-0.00926237,-0.0177262,-0.0374468,40
1429526342159,98,-0.0191854,-0.0381427,-0.0572109,50
1429526342201,98,-0.0153899,-0.0391199,-0.0523221,69
1429526342243,98,-0.0018675,-0.0231145,-0.0273904,76
1429526342254,98,0.0116959,-0.00145761,0.00254632,73
1429526342295,97,0.0175218,0.0146002,0.0236763,63
1429526342306,97,0.010403,0.0158004,0.0250331,56
1429526342348,97,-0.00462227,0.00399075,0.010653,43
1429526342359,97,-0.0202667,-0.0143799,-0.0104376,39
1429526342401,97,-0.027076,-0.0257277,-0.021067,34
1429526342413,97,-0.0225454,-0.0246928,-0.0160257,35
1429526342453,97,-0.00917739,-0.0108975,0.00311999,41
1429526342472,97,0.00389923,0.00659953,0.022771,46
1429526342513,97,0.0106422,0.0194442,0.0319641,47
1429526342542,97,0.00749047,0.019364,0.0219272,43
1429526342573,97,-0.00161541,0.00965811,-0.000129062,38
1429526342616,97,-0.00921222,-0.00430028,-0.023747,33
1429526342642,97,-0.00997622,-0.0141365,-0.0362683,28
1429526342684,97,-0.00326875,-0.0155538,-0.0325818,23
1429526342704,97,0.0056911,-0.0102152,-0.0172409,21
1429526342745,97,0.0121359,-0.00105984,0.00248006,27
1429526342773,97,0.0128786,0.00564016,0.0161379,44
1429526342814,97,0.00791501,0.00755973,0.0195575,65
1429526342840,97,0.000692023,0.00477473,0.0138443,78
1429526342882,97,-0.00398624,0.00113931,0.00636203,77
1429526342906,97,-0.00535409,-0.00219489,0.000925846,68
1429526342940,97,-0.00255421,-0.000903433,0.00384338,55
1429526342982,97,0.00297889,0.00540083,0.0151509,41
1429526343008,97,0.009059,0.0147678,0.030049,35
1429526343041,97,0.014072,0.0235906,0.0420687,36
1429526343072,97,0.0158756,0.0283023,0.0449965,41
1429526343107,97,0.015278,0.0290358,0.0392093,46
1429526343140,97,0.0112408,0.0223472,0.0224806,46
1429526343174,97,0.00472856,0.00990793,-0.000665274,45
1429526343205,97,-0.00182761,-0.00528491,-0.0242349,41
1429526343246,97,-0.00717057,-0.0198602,-0.0431022,35
1429526343272,97,-0.00915956,-0.0279787,-0.0508338,33
1429526343307,97,-0.00900772,-0.0290366,-0.0483806,30
1429526343340,97,-0.00776222,-0.023983,-0.0384823,27
1429526343382,97,-0.00731964,-0.0174138,-0.0278061,36
1429526343423,97,-0.00709977,-0.0123683,-0.0197737,61
1429526343464,97,-0.0085977,-0.0120857,-0.0182536,75
1429526343506,97,-0.00960769,-0.0135013,-0.0182122,74
1429526343547,96,-0.0105066,-0.0128214,-0.0150573,65
1429526343588,96,-0.0101593,-0.00664565,-0.00446879,47
1429526343629,96,-0.0108001,0.00292157,0.0101798,40
1429526343671,96,-0.0126353,0.0114371,0.0231739,38
1429526343712,96,-0.0143014,0.0136247,0.0279767,41
1429526343753,96,-0.0137355,0.00695703,0.021469,40
1429526343799,96,-0.00673364,-0.00317096,0.0100369,32
1429526343811,96,0.00761111,-0.00874469,0.00278591,28
1429526343852,96,0.0252112,-0.00478365,0.00518285,19
1429526343893,96,0.0411921,0.0108201,0.0196572,10
1429526343935,96,0.0498039,0.0323383,0.0400982,5
1429526343977,96,0.0480103,0.0507145,0.0570926,4
1429526344018,96,0.0352195,0.0559839,0.0595673,19
1429526344059,96,0.0152129,0.0445605,0.0439308,49
1429526344100,96,-0.00901394,0.0163687,0.00917145,59
1429526344142,96,-0.0311594,-0.0189218,-0.0336837,49
1429526344183,96,-0.0441523,-0.0482624,-0.068659,34
1429526344224,96,-0.0455948,-0.0626938,-0.0844165,11
1429526344267,96,-0.0337932,-0.0567604,-0.0734822,6
1429526344309,96,-0.0147209,-0.0361263,-0.0426192,18
1429526344351,96,0.00613973,-0.00894444,-0.00255178,28
1429526344392,96,0.0208818,0.0128103,0.0303358,31
1429526344433,96,0.0248262,0.0221932,0.0453296,27
1429526344475,96,0.0178425,0.0191261,0.0404772,16
1429526344517,96,0.00235924,0.00709081,0.0191919,10
1429526344558,96,-0.0148309,-0.00629025,-0.00767319,6
1429526344599,96,-0.0264589,-0.0135611,-0.027877,13
1429526344641,96,-0.0268679,-0.0099172,-0.0315646,45
1429526344683,96,-0.0144626,0.00475572,-0.0152856,69
1429526344724,96,0.0077606,0.0265017,0.0156395,77
1429526344765,96,0.0314759,0.0465281,0.0484826,65
1429526344807,96,0.0468325,0.056045,0.0680035,48
1429526344848,96,0.0468998,0.048939,0.0632887,26
1429526344889,96,0.0307322,0.0256015,0.0330596,21
1429526344934,96,0.00403217,-0.00791618,-0.0131182,30
1429526344945,96,-0.0228358,-0.040534,-0.0580579,35
1429526344990,96,-0.041433,-0.0631082,-0.0862413,39
1429526345002,96,-0.0467736,-0.0689479,-0.0867946,38
1429526345043,96,-0.039731,-0.0577814,-0.0613007,30
1429526345084,96,-0.0272314,-0.036217,-0.0223413,24
1429526345126,96,-0.0157697,-0.0133096,0.013206,15
1429526345167,96,-0.00810139,0.0046329,0.0339485,10
1429526345208,96,-0.00188524,0.0160257,0.038185,10
1429526345250,96,0.005941,0.021671,0.0311891,39
1429526345292,96,0.0176194,0.0247839,0.0222817,64
1429526345333,96,0.0312874,0.0276048,0.0178316,77
1429526345375,97,0.0422856,0.0308115,0.019713,68
1429526345416,97,0.0446979,0.0320183,0.0229461,45
1429526345458,97,0.0355053,0.0286468,0.0217094,32
1429526345499,97,0.0177039,0.0203116,0.0141094,28
1429526345540,97,-0.0038615,0.0069005,-0.000692088,37
1429526345582,97,-0.0206989,-0.00758364,-0.0162946,46
1429526345623,97,-0.0291623,-0.0201708,-0.0280063,44
1429526345665,97,-0.0256403,-0.0244169,-0.0272566,34
1429526345706,97,-0.0162298,-0.0222595,-0.0184549,27
1429526345748,97,-0.00318369,-0.0119284,-0.00194934,21
1429526345789,97,0.00587208,-3.5604e-05,0.0122638,22
1429526345831,97,0.00869976,0.00932781,0.0191545,46
1429526345843,97,0.00572701,0.0135517,0.0180082,46
1429526345887,97,-0.00317572,0.00938509,0.00828104,78
1429526345899,97,-0.0128782,8.62591e-05,-0.00260583,84
1429526345940,97,-0.0205689,-0.011537,-0.0106069,83
1429526345981,97,-0.0209338,-0.0180535,-0.00873042,64
1429526345993,97,-0.0138248,-0.0173204,0.000143976,64
1429526346036,97,0.00047676,-0.00699584,0.0141582,39
1429526346049,97,0.0174268,0.0098967,0.027774,33
1429526346090,97,0.0313937,0.0254753,0.0339449,29
1429526346102,97,0.0359644,0.0326202,0.0290208,30
1429526346143,97,0.0282183,0.0250242,0.010496,38
1429526346184,97,0.00770938,0.00356142,-0.0181972,44
1429526346195,97,-0.0212228,-0.0263148,-0.0516339,43
1429526346237,97,-0.0500456,-0.0543352,-0.0804581,39
1429526346248,97,-0.0714613,-0.0708821,-0.0964584,36
1429526346290,97,-0.0780432,-0.0694609,-0.0932824,29
1429526346304,97,-0.0689457,-0.0517542,-0.0720531,25
1429526346346,97,-0.0442849,-0.0220442,-0.0358961,17
1429526346372,97,-0.00983233,0.0102285,0.00555388,15
1429526346414,97,0.0287555,0.0381816,0.0441325,31
1429526346440,97,0.0643071,0.0569135,0.0724298,41
1429526346482,97,0.0937934,0.06687,0.0895489,75
1429526346505,97,0.109957,0.0683533,0.094252,80
1429526346547,97,0.110123,0.0639977,0.0893803,72
1429526346572,97,0.0936103,0.05471,0.0771485,65
1429526346614,97,0.0632406,0.0411147,0.059874,39
1429526346641,97,0.0227036,0.0223669,0.0373759,32
1429526346682,97,-0.0206161,-0.00126104,0.00959322,24
1429526346706,97,-0.0601216,-0.0264259,-0.0209111,27
1429526346740,97,-0.090819,-0.0506781,-0.0525002,35
1429526346782,97,-0.108871,-0.0704251,-0.0813071,41
1429526346806,97,-0.114554,-0.0855251,-0.105419,40
1429526346840,97,-0.111861,-0.0987152,-0.125273,36
1429526346882,97,-0.105338,-0.110942,-0.139744,27
1429526346906,97,-0.0953807,-0.118126,-0.144208,24
1429526346940,97,-0.077255,-0.110584,-0.130036,18
1429526346982,97,-0.0425634,-0.0773729,-0.0879035,16
1429526347006,97,0.0110903,-0.0156241,-0.0174059,21
1429526347040,97,0.0788416,0.066926,0.0720012,40
1429526347074,97,0.148659,0.153852,0.163518,60
1429526347107,97,0.204882,0.2238,0.236437,73
1429526347140,98,0.231036,0.256036,0.271062,71
1429526347174,98,0.219574,0.243633,0.26089,60
1429526347207,98,0.172526,0.189886,0.20902,44
1429526347240,98,0.100989,0.108659,0.128426,28
1429526347272,98,0.020551,0.0206673,0.0383045,20
1429526347307,98,-0.056229,-0.0593962,-0.0477641,23
1429526347340,98,-0.119874,-0.121392,-0.119494,32
1429526347372,98,-0.165511,-0.162609,-0.172362,38
1429526347404,98,-0.19147,-0.185025,-0.205418,38
1429526347441,98,-0.197823,-0.191197,-0.217964,33
1429526347472,98,-0.1865,-0.185103,-0.212177,27
1429526347507,98,-0.160489,-0.169929,-0.191192,20
1429526347542,98,-0.124091,-0.146106,-0.158048,15
1429526347572,98,-0.079979,-0.111796,-0.114267,13
1429526347614,98,-0.0316085,-0.0655345,-0.06109,38
1429526347655,98,0.01908,-0.0075582,0.000159402,62
1429526347698,98,0.0668975,0.0551609,0.0636334,79
1429526347740,99,0.109241,0.117221,0.125971,72
1429526347781,99,0.140418,0.164987,0.175579,48
1429526347822,99,0.156426,0.188839,0.202862,32
1429526347864,99,0.157088,0.184634,0.202803,25
1429526347905,99,0.145889,0.16054,0.181596,32
1429526347947,99,0.125742,0.127403,0.148319,41
1429526347988,99,0.0985205,0.0932461,0.109993,46
1429526348030,99,0.0686422,0.0679453,0.0766763,42
1429526348072,99,0.0364838,0.049417,0.0474104,36
1429526348114,99,0.00543167,0.0341296,0.0218364,31
1429526348155,99,-0.0201819,0.0198017,-0.000178539,30
1429526348196,99,-0.0365006,0.00446318,-0.0183176,42
1429526348238,99,-0.0423103,-0.013514,-0.033835,69
1429526348279,99,-0.0394564,-0.0322021,-0.0465038,78
1429526348321,100,-0.0348633,-0.0542682,-0.0615942,69
1429526348362,100,-0.0358233,-0.0779957,-0.0802979,55
1429526348403,100,-0.0473681,-0.102253,-0.102368,34
1429526348445,100,-0.0663391,-0.120631,-0.120341,29
1429526348486,100,-0.0884353,-0.130167,-0.129795,37
1429526348528,100,-0.102872,-0.124663,-0.123044,42
1429526348569,100,-0.106602,-0.110642,-0.105688,42
1429526348611,100,-0.0963299,-0.0882926,-0.0794458,39
1429526348623,100,-0.0798892,-0.0688268,-0.0576986,36
1429526348664,100,-0.0608208,-0.0515454,-0.0414091,31
1429526348706,100,-0.0473429,-0.0415966,-0.0351375,25
1429526348747,100,-0.0397249,-0.0350763,-0.0330091,26
1429526348789,100,-0.0348923,-0.0304413,-0.0316148,48
1429526348830,100,-0.0251276,-0.022362,-0.0251439,67
1429526348871,100,-0.00441956,-0.00859964,-0.0132307,75
1429526348913,101,0.0298335,0.0130038,0.00464425,67
1429526348956,101,0.073611,0.0422433,0.0284056,45
1429526348967,101,0.121174,0.0804859,0.0619274,39
1429526349008,101,0.161001,0.123465,0.103964,30
1429526349049,101,0.182519,0.162095,0.147475,31
1429526349090,101,0.180081,0.187422,0.183694,40
1429526349132,101,0.151251,0.18824,0.198079,43
1429526349173,101,0.103257,0.161859,0.184255,40
1429526349214,101,0.0447084,0.111333,0.140413,35
1429526349256,101,-0.0128146,0.0466415,0.0742189,27
1429526349297,101,-0.058739,-0.017128,0.00174565,23
1429526349338,101,-0.087995,-0.0674966,-0.0614844,27
1429526349381,101,-0.100851,-0.0989139,-0.105206,44
1429526349422,101,-0.102087,-0.113401,-0.127786,73
1429526349464,101,-0.0950104,-0.11307,-0.130921,78
1429526349505,101,-0.0802772,-0.100182,-0.117436,66
1429526349547,101,-0.0561978,-0.0752303,-0.0889343,53
1429526349589,101,-0.0230902,-0.0401296,-0.0501097,37
1429526349630,101,0.0147019,0.00139433,-0.00643318,36
1429526349671,101,0.0468946,0.0380575,0.0300364,44
1429526349713,101,0.0601549,0.0560684,0.0458547,47
1429526349755,101,0.0494112,0.0477768,0.0357375,43
1429526349767,101,0.0158122,0.0131229,0.00238148,43
1429526349809,101,-0.0289575,-0.035812,-0.0398245,36
1429526349851,101,-0.0681968,-0.0803504,-0.0724294,31
1429526349862,101,-0.0863115,-0.102031,-0.0785037,28
1429526349904,101,-0.0773916,-0.0928945,-0.0555258,25
1429526349945,101,-0.0452144,-0.057416,-0.0126631,33
1429526349987,101,-0.00283883,-0.0102495,0.0320661,59
1429526350028,101,0.0355564,0.0319881,0.0602247,72
1429526350070,102,0.0579455,0.0571175,0.0624453,70
1429526350082,102,0.0604801,0.0620899,0.0406867,70
1429526350123,102,0.0461435,0.0514237,0.00675929,52
1429526350164,102,0.0230588,0.0331238,-0.0248018,40
1429526350205,102,-0.00133619,0.0141112,-0.0413953,32
1429526350247,102,-0.0183693,-0.000129466,-0.0393949,36
1429526350288,102,-0.0246197,-0.00782308,-0.0211707,42
1429526350330,102,-0.021415,-0.010328,0.00521635,42
1429526350372,102,-0.00978543,-0.00689322,0.0291954,36
1429526350384,102,0.00761303,0.00249105,0.0441229,36
1429526350425,102,0.0289368,0.0180085,0.0454316,28
1429526350467,102,0.0498802,0.0360727,0.0342571,23
1429526350478,102,0.0666719,0.0526022,0.0174696,21
1429526350520,102,0.0730178,0.0596597,0.00119555,19
1429526350531,102,0.0658652,0.0541172,-0.00731056,19
1429526350573,102,0.0443134,0.0344093,-0.00765707,42
1429526350614,102,0.00771232,0.00258352,-0.00303247,63
1429526350625,102,-0.0388578,-0.0347552,0.00212464,70
1429526350668,102,-0.0864611,-0.0683459,0.00463458,72
1429526350679,102,-0.126164,-0.0925694,0.00270732,70
1429526350720,102,-0.14555,-0.100074,0.00108155,54
1429526350732,102,-0.138274,-0.0908073,0.000819785,54
