1429092909491,71,-0.0291079,0.0158619,0.0300232,28
1429092909533,71,-0.0448715,-0.0013014,-0.00698512,23
1429092909574,71,-0.0610593,-0.0213173,-0.0506821,23
1429092909615,71,-0.0501076,-0.00962963,-0.0547027,37
1429092909656,71,-0.0343916,0.00257648,-0.0466541,64
1429092909697,71,-0.0197347,0.0105825,-0.0327344,57
1429092909741,71,-0.0112994,-0.00139858,-0.0353889,44
1429092909753,71,0.00272566,-0.0115639,-0.0314972,45
1429092909794,71,0.0418256,0.00705142,-0.00315456,40
1429092909836,71,0.0500981,0.0120918,0.0240756,29
1429092909847,71,0.0392184,0.0155138,0.0486364,27
1429092909889,71,-0.00188618,-0.012652,0.0353912,27
1429092909901,71,-0.0311911,-0.0292861,0.0210059,26
1429092909942,71,-0.027723,-0.0335867,-0.00185714,46
1429092909953,71,-0.00471011,-0.0272041,-0.0242174,60
1429092909994,71,0.0249308,-0.0165428,-0.0420784,57
1429092910006,71,0.0615852,0.0152427,-0.020787,49
1429092910048,71,0.0711358,0.0234266,-0.00569814,39
1429092910068,71,0.0455355,0.0053351,-0.0138066,39
1429092910109,71,0.012338,-0.0120765,-0.0271572,34
1429092910135,71,-0.0377349,-0.0479439,-0.0726062,32
1429092910176,71,-0.0502194,-0.0539526,-0.0885597,25
1429092910203,71,-0.00855918,-0.0139492,-0.0592985,22
1429092910244,71,0.0225332,0.029187,-0.00260391,19
1429092910267,71,0.0281607,0.052827,0.0421124,33
1429092910309,71,0.0161364,0.0595366,0.0742112,62
1429092910335,71,0.000184088,0.050773,0.0797649,55
1429092910376,71,-0.00579968,0.0485281,0.0741106,40
1429092910403,71,0.00916042,0.0506427,0.0599693,38
1429092910445,71,0.0198008,0.0408727,0.0285543,33
1429092910467,71,0.0307268,0.0258956,0.000365175,27
1429092910509,71,0.0356897,0.00943616,-0.0160297,23
1429092910535,71,0.0308318,0.00277994,-0.0108394,21
1429092910576,71,0.00907814,-0.0100878,-0.00427779,19
1429092910603,71,-0.00263792,-0.00307656,0.0186018,19
1429092910644,71,-0.0389465,-0.0286819,0.00499761,53
1429092910668,70,-0.0757459,-0.0582267,-0.018893,61
1429092910703,70,-0.104582,-0.095722,-0.0564034,51
1429092910736,70,-0.102864,-0.108617,-0.0814504,41
1429092910769,70,-0.0924756,-0.115496,-0.100629,40
1429092910803,70,-0.0382392,-0.067866,-0.0538392,34
1429092910835,70,0.0115199,-0.0180769,0.00247782,28
1429092910869,70,0.0418493,0.0210717,0.0453267,24
1429092910903,70,0.0575143,0.0405279,0.0611567,23
1429092910935,70,0.049609,0.0346875,0.0415012,23
1429092910969,70,0.0370874,0.030951,0.0176862,22
1429092911003,70,0.0120843,0.0209816,-0.00938053,36
1429092911035,70,0.00765422,0.0465195,0.0115084,67
1429092911070,70,-0.0103638,0.049227,0.0135269,61
1429092911103,70,-0.0173633,0.039554,0.00832731,49
1429092911144,70,-0.000962949,0.0372401,0.0135328,43
1429092911170,70,0.00554992,0.00756239,-0.0085186,40
1429092911203,70,0.0286682,0.00269847,-0.0103224,34
1429092911235,70,0.0582665,0.0212045,0.0230436,28
1429092911269,70,0.0528475,0.0291073,0.040597,25
1429092911303,70,0.0310694,0.0235668,0.0392706,23
1429092911337,70,-0.0083992,-0.00407899,0.00558529,21
1429092911370,70,-0.0397738,-0.0316864,-0.0377417,18
1429092911404,70,-0.0285436,-0.0259299,-0.0402679,36
1429092911437,70,0.0200036,0.0246202,0.0161594,61
1429092911469,70,0.0393532,0.0468889,0.0478009,56
1429092911503,70,0.032947,0.0397211,0.0470471,42
1429092911535,70,0.0102953,0.0118279,0.018665,40
1429092911577,70,-0.0385855,-0.0558261,-0.0604136,34
1429092911618,70,-0.0603862,-0.0959131,-0.113045,27
1429092911660,70,-0.0785089,-0.11976,-0.135959,24
1429092911701,70,-0.0728172,-0.107759,-0.108181,22
1429092911746,70,-0.0599091,-0.0711546,-0.0500965,20
1429092911761,70,-0.0387265,-0.0150285,0.023495,19
1429092911806,70,-0.0143498,0.0289582,0.0800702,49
1429092911818,70,0.0379214,0.0823852,0.136035,63
1429092911860,70,0.102957,0.138438,0.185782,53
1429092911901,70,0.129037,0.132017,0.169331,41
1429092911943,70,0.107776,0.074778,0.0987467,40
1429092911984,70,0.0302366,-0.0120152,-0.0113926,32
1429092912025,70,-0.0532839,-0.0783655,-0.106513,28
1429092912068,70,-0.0940877,-0.0884583,-0.143984,25
1429092912110,70,-0.0928134,-0.06484,-0.133092,24
1429092912151,70,-0.0569826,-0.0262635,-0.090776,21
1429092912192,70,-0.0130443,0.0050418,-0.0429176,42
1429092912235,70,0.00122713,-0.00327442,-0.0336922,66
1429092912277,70,-0.00359386,-0.0192793,-0.0304153,54
1429092912318,70,-0.00155482,-0.0265072,-0.0211349,47
1429092912360,70,-0.00528153,-0.0340621,-0.0184525,46
1429092912402,70,0.0154398,-0.00344469,0.0133707,34
1429092912444,70,0.055992,0.0494108,0.0670926,18
1429092912485,70,0.0989123,0.116142,0.12875,16
1429092912526,70,0.142552,0.181325,0.189095,21
1429092912568,70,0.146405,0.196911,0.199464,22
1429092912609,70,0.0826081,0.127778,0.120384,52
1429092912650,70,-0.0345999,-0.0114806,-0.0317326,63
1429092912692,70,-0.174504,-0.188981,-0.215177,49
1429092912733,70,-0.260426,-0.298722,-0.322652,43
1429092912774,70,-0.253012,-0.299681,-0.307275,40
1429092912816,70,-0.129036,-0.167367,-0.14877,33
1429092912857,70,0.0416703,0.0133553,0.0602584,30
1429092912898,70,0.159268,0.140623,0.206563,29
1429092912940,70,0.169133,0.13931,0.207708,27
1429092912983,70,0.0768162,0.0387559,0.096836,34
1429092913024,70,-0.00929443,-0.0343855,0.00553785,73
1429092913066,70,-0.0445694,-0.047856,-0.02417,63
1429092913107,70,-0.00690438,0.0361533,0.0402102,50
1429092913152,70,0.0435734,0.114504,0.10049,47
1429092913164,70,0.0687852,0.14557,0.114197,44
1429092913207,70,0.0652408,0.121112,0.0779381,36
1429092913220,70,0.0300187,0.0464989,-0.00329464,35
1429092913261,70,0.0112098,-0.00771641,-0.0549654,30
1429092913304,70,0.016339,-0.0215921,-0.0606103,29
1429092913316,70,0.00705006,-0.0362612,-0.0697495,28
1429092913358,70,0.0182766,-0.00573929,-0.0341387,25
1429092913400,70,0.0377145,0.0476859,0.0250702,66
1429092913441,69,0.0245319,0.0658252,0.0478159,65
1429092913482,69,-0.0137512,0.028971,0.0156076,52
1429092913525,69,-0.0816124,-0.0620542,-0.07144,47
1429092913567,69,-0.134145,-0.145679,-0.151487,42
1429092913608,69,-0.140755,-0.163902,-0.171072,38
1429092913651,69,-0.114662,-0.12581,-0.135712,32
1429092913662,69,-0.0685912,-0.0526559,-0.0630658,31
1429092913707,69,0.00681066,0.0358386,0.0311799,28
1429092913720,69,0.0473669,0.0858157,0.0950207,26
1429092913761,69,0.0569493,0.0907848,0.125264,40
1429092913802,69,0.0537015,0.0762761,0.140717,66
1429092913844,68,0.0542951,0.0380534,0.126454,53
1429092913885,68,0.0513299,-0.0296107,0.0687441,42
1429092913926,68,0.012443,-0.125773,-0.0309924,40
1429092913968,68,-0.0437831,-0.200962,-0.122308,33
1429092913979,68,-0.0791482,-0.206323,-0.156274,31
1429092914020,68,-0.0828263,-0.148839,-0.133988,27
1429092914032,68,-0.0714097,-0.0733427,-0.0970411,26
1429092914074,68,0.00230021,0.0562767,0.00256788,25
1429092914086,68,0.0515758,0.132432,0.0699265,25
1429092914127,68,0.0755912,0.162541,0.0957694,51
1429092914169,67,0.0857571,0.179601,0.113711,66
1429092914180,67,0.0884668,0.18835,0.123353,62
1429092914221,67,0.0976852,0.206477,0.144787,50
1429092914233,67,0.122728,0.231634,0.179248,46
1429092914276,67,0.113844,0.200667,0.162311,44
1429092914287,67,0.0934834,0.137531,0.117506,42
1429092914328,67,0.0221881,0.00965313,3.71462e-05,36
1429092914340,67,-0.0546747,-0.120522,-0.117419,33
1429092914382,67,-0.14641,-0.243433,-0.233823,30
1429092914403,67,-0.148277,-0.25185,-0.238861,30
1429092914444,67,-0.0931153,-0.177975,-0.169872,28
1429092914467,67,-3.63847e-06,-0.0459663,-0.0419454,42
1429092914508,67,0.0578772,0.0424149,0.0409066,68
1429092914535,67,0.0468662,0.0558754,0.0484372,62
1429092914576,67,-0.0407131,-0.0236495,-0.0329099,50
1429092914603,67,-0.143108,-0.126007,-0.134056,48
1429092914644,67,-0.196036,-0.176041,-0.173923,43
1429092914686,67,-0.208903,-0.195736,-0.173287,36
1429092914703,67,-0.0994058,-0.105435,-0.059497,33
1429092914745,67,0.0341401,-0.00563138,0.0625854,31
1429092914767,67,0.155854,0.0941643,0.177156,31
1429092914808,67,0.224571,0.154454,0.231873,28
1429092914835,67,0.222996,0.169689,0.228749,35
1429092914876,67,0.156571,0.135697,0.168233,66
1429092914903,68,0.0508367,0.0602222,0.0649552,61
1429092914935,68,-0.0475822,-0.0120857,-0.0253173,53
1429092914967,68,-0.129304,-0.0682253,-0.0920689,45
1429092915003,68,-0.155808,-0.0809474,-0.117076,43
1429092915035,68,-0.0832712,-0.0140685,-0.0556544,38
1429092915068,68,0.0002926,0.0523273,0.0143532,33
1429092915103,68,0.0987148,0.135196,0.101458,30
1429092915135,68,0.121822,0.129637,0.100599,28
1429092915169,68,0.123043,0.0851683,0.0544459,26
1429092915203,68,0.079633,0.0214071,-0.0226802,24
1429092915235,68,0.0352703,-0.022774,-0.0790492,41
1429092915269,68,-0.0163172,-0.0433861,-0.105397,59
1429092915303,68,-0.0555574,-0.0419395,-0.0916502,51
1429092915335,68,-0.0702442,-0.0197588,-0.0367144,42
1429092915369,68,-0.0852834,-0.00203067,0.0201162,41
1429092915403,68,-0.0582876,0.0405856,0.0877577,40
1429092915435,68,-0.0384844,0.0333639,0.0923036,35
1429092915467,68,-0.00295567,0.00279213,0.0512536,31
1429092915503,68,-0.0216585,-0.0867757,-0.0718291,29
1429092915535,68,-0.0397664,-0.142345,-0.156225,28
1429092915569,68,-0.0523752,-0.13726,-0.155343,26
1429092915603,68,-0.0240279,-0.0531466,-0.062082,32
1429092915637,68,0.00829789,0.0392831,0.0522581,56
1429092915670,68,0.00413543,0.060799,0.0891618,59
1429092915703,68,0.0266998,0.0615308,0.0897415,52
1429092915735,68,0.0581698,0.048618,0.0661201,43
1429092915776,68,0.0791632,0.0248835,0.0380031,41
1429092915818,68,0.0499573,-0.0179822,-0.0110953,35
1429092915859,68,-0.0311291,-0.0699532,-0.055323,35
1429092915900,68,-0.107362,-0.0926813,-0.0723355,31
1429092915940,68,-0.0966551,-0.044531,-0.0212653,31
1429092915982,68,-0.00696571,0.064746,0.0954521,27
1429092916023,68,0.109718,0.159664,0.182874,35
1429092916063,68,0.168602,0.167598,0.176425,62
1429092916104,68,0.109995,0.0585791,0.0533763,55
1429092916145,68,0.00442971,-0.0765714,-0.0907928,46
1429092916186,68,-0.0745419,-0.163282,-0.192668,45
1429092916227,68,-0.107049,-0.178389,-0.210916,37
1429092916268,68,-0.0878913,-0.111987,-0.140444,32
1429092916310,68,-0.0509541,-0.0450161,-0.0636978,29
1429092916351,68,0.00138648,0.0114093,0.00345239,29
1429092916393,68,0.00311078,0.0146878,0.0103697,26
1429092916434,68,-0.0120628,0.0034963,-0.0139884,29
1429092916475,68,-0.0312937,0.0123075,-0.0209439,63
1429092916516,68,-0.0315462,0.0402448,-0.00122831,59
1429092916557,68,0.00963847,0.105137,0.0671685,48
1429092916599,68,0.0177144,0.105587,0.0767053,48
1429092916640,68,0.0284686,0.0999761,0.0774354,42
1429092916681,68,0.0164326,0.0621697,0.0584119,37
1429092916722,68,0.102645,0.126784,0.133842,33
1429092916763,68,0.165418,0.170411,0.191153,32
1429092916805,68,0.22507,0.214337,0.231657,29
1429092916846,68,0.216045,0.173177,0.182379,27
1429092916887,68,0.0870447,0.0109824,0.021089,60
1429092916929,68,-0.0876713,-0.172226,-0.163344,58
1429092916971,68,-0.264436,-0.338357,-0.309945,50
1429092916983,68,-0.353579,-0.405621,-0.364364,47
1429092917024,68,-0.340115,-0.362742,-0.301284,47
1429092917067,68,-0.230301,-0.219956,-0.158407,40
1429092917108,68,-0.119578,-0.0814979,-0.0273786,33
1429092917150,68,-0.0583642,-0.0219004,0.0175053,27
1429092917191,68,0.00665319,0.0237168,0.040079,24
1429092917232,68,0.135216,0.105748,0.0963882,20
1429092917273,68,0.232489,0.172166,0.146052,20
1429092917315,68,0.269103,0.200363,0.161382,42
1429092917357,68,0.247165,0.202993,0.161511,57
1429092917399,68,0.17333,0.195856,0.164641,50
1429092917440,68,0.127589,0.189176,0.166938,45
1429092917481,68,0.0600566,0.120705,0.101878,41
1429092917522,68,-0.0485825,-0.0238161,-0.0443107,33
1429092917564,68,-0.129224,-0.138252,-0.155733,30
1429092917606,68,-0.211307,-0.235258,-0.24999,28
1429092917647,68,-0.198019,-0.211663,-0.221196,25
1429092917689,68,-0.119935,-0.118553,-0.130672,25
1429092917730,68,-0.028346,-0.00269881,-0.0261064,23
1429092917771,68,0.0241948,0.083905,0.0650646,44
1429092917812,66,0.0809182,0.169627,0.157482,62
1429092917853,66,0.0920803,0.173468,0.178371,55
1429092917895,66,0.0434224,0.117564,0.14027,46
1429092917936,66,0.0129448,0.0600281,0.0886737,45
1429092917977,66,-0.0175659,-0.000253543,0.0266622,39
1429092918018,66,0.0431715,0.0211727,0.0259229,34
1429092918059,66,0.112505,0.0442301,0.0288189,29
1429092918101,66,0.155333,0.0633241,0.046324,26
1429092918142,66,0.116334,-0.00205145,-0.00993093,23
1429092918184,66,-0.0059073,-0.117609,-0.102583,21
1429092918195,66,-0.104587,-0.219272,-0.193196,28
1429092918237,66,-0.200033,-0.317058,-0.276552,60
1429092918247,65,-0.212817,-0.326331,-0.284445,57
1429092918288,65,-0.159105,-0.214992,-0.172597,49
1429092918330,65,-0.100643,-0.0572069,-0.00649669,45
1429092918371,65,-0.0129485,0.120233,0.162598,44
1429092918412,65,0.0254759,0.208736,0.234653,37
1429092918454,65,-0.0136001,0.143147,0.138197,33
1429092918495,65,-0.0577298,0.015635,-0.0221958,31
1429092918537,65,-0.0247676,-0.0136215,-0.0791785,31
1429092918579,65,0.0160274,0.0106964,-0.0612342,29
1429092918620,65,0.118138,0.133152,0.0601711,28
1429092918661,65,0.153842,0.195835,0.140994,25
1429092918703,65,0.139576,0.195764,0.168628,24
1429092918714,65,0.101945,0.134113,0.127929,26
1429092918756,65,0.0269791,0.0278017,0.0384227,36
1429092918797,65,0.0244158,-0.0156024,-0.00874802,56
1429092918808,65,0.119178,0.0240401,0.0182309,61
1429092918850,65,0.142969,0.047027,0.0352355,63
1429092918861,65,0.156802,0.0728207,0.0608284,62
1429092918903,64,0.126539,0.0594839,0.0676615,59
1429092918915,64,-0.045654,-0.0801911,-0.0171645,58
1429092918957,64,-0.262805,-0.248414,-0.150356,57
1429092918968,64,-0.45009,-0.390311,-0.270124,56
1429092919010,64,-0.559125,-0.476669,-0.35354,50
1429092919021,64,-0.444218,-0.376168,-0.293498,50
1429092919063,64,-0.170938,-0.130567,-0.0904816,46
1429092919075,64,0.252575,0.221906,0.220353,45
1429092919117,64,0.550148,0.434493,0.411397,44
1429092919136,64,0.574948,0.452693,0.422607,43
1429092919177,64,0.188412,0.135609,0.088168,40
1429092919203,64,-0.278599,-0.301585,-0.414086,39
1429092919244,64,-0.538625,-0.586262,-0.727443,36
1429092919268,64,-0.519069,-0.584048,-0.689271,35
1429092919303,64,-0.111637,-0.125212,-0.103259,33
1429092919335,64,0.401878,0.549555,0.706996,32
1429092919369,64,0.691836,0.981963,1.21574,32
1429092919403,64,0.615866,0.98123,1.17605,31
1429092919435,64,0.168206,0.464592,0.519296,31
1429092919469,64,-0.356433,-0.196273,-0.304435,30
1429092919503,64,-0.566881,-0.516129,-0.724266,30
1429092919535,64,-0.46207,-0.505194,-0.710649,31
1429092919569,64,-0.205929,-0.293856,-0.4124,31
1429092919603,64,0.122867,-0.00545068,-0.0164033,32
1429092919635,64,0.442469,0.279199,0.373066,31
1429092919669,64,0.497221,0.335312,0.452152,30
1429092919703,64,0.462612,0.290712,0.362711,29
1429092919737,64,0.341233,0.181004,0.176284,28
1429092919769,64,0.0484615,-0.0514147,-0.123896,27
1429092919803,64,-0.207396,-0.238627,-0.322051,35
1429092919836,64,-0.369215,-0.322707,-0.364222,48
1429092919869,64,-0.351744,-0.250578,-0.208876,61
1429092919903,64,-0.230936,-0.130747,-0.0421586,65
1429092919937,62,-0.0903917,-0.0445293,0.0367507,62
1429092919967,62,-0.0692728,-0.0759402,-0.0560942,58
1429092920008,62,-0.0481656,-0.10307,-0.132488,53
1429092920050,62,-0.0644044,-0.111715,-0.147549,50
1429092920091,62,-0.112371,-0.123136,-0.113998,47
1429092920133,62,-0.203071,-0.16643,-0.101402,46
1429092920174,62,-0.201548,-0.161607,-0.0662646,47
1429092920215,62,-0.196967,-0.158553,-0.0792563,46
1429092920256,62,0.0163363,-0.00908214,0.0336736,44
1429092920298,62,0.255043,0.192313,0.197597,39
1429092920339,62,0.409091,0.376063,0.385291,36
1429092920380,62,0.382332,0.403565,0.402525,32
1429092920422,62,0.138397,0.218631,0.169372,31
1429092920463,62,-0.171881,-0.0658499,-0.165391,29
1429092920505,62,-0.368324,-0.295051,-0.462335,28
1429092920546,62,-0.309679,-0.297345,-0.48353,27
1429092920588,62,-0.125138,-0.149112,-0.28549,27
1429092920629,62,0.0655338,0.0448178,-0.0144678,27
1429092920670,62,0.178135,0.173928,0.190802,27
1429092920712,62,0.180803,0.216549,0.283961,27
1429092920753,62,0.16691,0.212986,0.295967,26
1429092920795,62,0.0897273,0.163517,0.238558,25
1429092920836,62,0.109182,0.126547,0.17115,25
1429092920877,62,0.0665168,0.0500189,0.0677827,30
1429092920918,62,0.0589803,-0.00862306,-0.0380884,41
1429092920959,62,0.129877,0.0176127,-0.0415433,57
1429092921001,62,0.224027,0.1161,0.0660259,69
1429092921042,61,0.23792,0.125135,0.0956606,67
1429092921084,61,0.0878112,0.0137612,0.00965552,62
1429092921125,61,-0.140391,-0.154302,-0.137315,60
1429092921166,61,-0.303095,-0.252682,-0.206174,54
1429092921208,61,-0.406864,-0.309047,-0.237662,50
1429092921249,61,-0.302364,-0.216705,-0.108647,48
1429092921291,61,-0.106809,-0.0495387,0.111954,48
1429092921332,61,0.0099487,0.0172088,0.184953,45
1429092921373,61,0.00258328,-0.0239401,0.11479,42
1429092921415,61,-0.0694945,-0.119196,-0.0573625,40
1429092921457,61,-0.0811657,-0.153973,-0.177594,38
1429092921499,61,-0.0667428,-0.146004,-0.238919,35
1429092921541,61,0.00900203,-0.079499,-0.220781,34
1429092921582,61,0.0793877,0.00758817,-0.109773,32
1429092921623,61,0.138068,0.119586,0.0456074,31
1429092921665,61,0.105506,0.146734,0.0935494,29
1429092921706,61,0.0308322,0.129709,0.0911586,27
1429092921747,61,0.000943279,0.13286,0.103532,26
1429092921789,61,0.063108,0.200814,0.186401,25
1429092921831,61,0.132863,0.253234,0.231112,25
1429092921872,61,0.256669,0.315388,0.299509,24
1429092921913,61,0.270081,0.265294,0.218372,24
1429092921955,61,0.27185,0.211494,0.14629,23
1429092921996,61,0.0895092,0.044503,-0.0151392,25
1429092922037,61,-0.155655,-0.16994,-0.211575,33
1429092922079,61,-0.444102,-0.40779,-0.416395,54
1429092922121,61,-0.526139,-0.463447,-0.438619,64
1429092922162,60,-0.377935,-0.3323,-0.280403,64
1429092922205,60,-0.190165,-0.160239,-0.10626,58
1429092922246,60,0.044588,0.0427015,0.0881084,55
1429092922287,60,0.156412,0.14848,0.211193,51
1429092922328,60,0.203376,0.183375,0.263498,48
1429092922370,60,0.175487,0.147401,0.224782,45
1429092922411,60,0.0475089,-0.0156821,0.0093166,46
1429092922453,60,-0.0847577,-0.207516,-0.242422,44
1429092922495,60,-0.159149,-0.316061,-0.360422,41
1429092922537,60,-0.0893639,-0.258256,-0.25729,37
1429092922578,60,0.0252948,-0.104442,-0.0191799,33
1429092922620,60,0.169521,0.102597,0.239192,30
1429092922661,60,0.314065,0.284866,0.406775,29
1429092922703,60,0.462694,0.471275,0.554533,30
1429092922744,60,0.425252,0.474178,0.477012,32
1429092922785,60,0.185952,0.318529,0.251846,33
1429092922827,60,-0.157962,0.0532313,-0.0578315,33
1429092922869,60,-0.346936,-0.0820987,-0.194882,32
1429092922910,60,-0.385061,-0.157475,-0.258027,30
1429092922952,60,-0.230043,-0.128539,-0.216133,27
1429092922995,60,-0.100904,-0.149131,-0.236178,26
1429092923037,60,-0.0012964,-0.151069,-0.257895,35
1429092923078,60,0.0515014,-0.119508,-0.210151,48
1429092923119,60,0.0473069,-0.0811527,-0.152823,66
1429092923161,60,0.0509828,-0.00992385,-0.0543362,67
1429092923173,60,0.0541987,0.0672048,0.0789002,66
1429092923214,60,0.11245,0.12377,0.169375,62
1429092923256,60,0.0725047,0.0895071,0.171555,57
1429092923268,60,-0.0440192,-0.0447595,0.0399814,55
1429092923309,60,-0.161271,-0.171371,-0.102355,51
1429092923351,60,-0.155322,-0.188535,-0.122357,46
1429092923363,60,-0.151466,-0.179218,-0.119387,46
1429092923404,60,-0.0332432,-0.0518994,0.0248916,46
1429092923450,60,0.0197394,0.0438938,0.124811,44
1429092923461,60,-0.0976417,-0.00905862,0.0527062,44
1429092923502,60,-0.165955,-0.0673956,-0.0349544,40
1429092923544,60,-0.266989,-0.182389,-0.199549,37
1429092923585,60,-0.155437,-0.13505,-0.164626,35
1429092923628,60,0.0905155,0.0337563,0.0235994,34
1429092923669,60,0.358133,0.260513,0.278304,33
1429092923710,60,0.455229,0.374711,0.388616,32
1429092923752,60,0.402431,0.330291,0.288769,30
1429092923793,60,0.271164,0.214882,0.140917,29
1429092923835,60,0.010937,-0.0027681,-0.105584,27
1429092923877,60,-0.187934,-0.143261,-0.214414,26
1429092923919,60,-0.33872,-0.230116,-0.290883,25
1429092923960,60,-0.238991,-0.137681,-0.182637,25
1429092924002,60,-0.0147471,0.0453371,0.0282764,24
1429092924013,60,0.201878,0.181601,0.166901,24
1429092924055,60,0.254635,0.215031,0.211206,26
1429092924066,60,0.0852285,0.0854741,0.0705063,26
1429092924108,60,-0.165133,-0.0959403,-0.120885,41
1429092924149,60,-0.261924,-0.142891,-0.125097,56
1429092924190,60,-0.19526,-0.0721817,0.00992971,69
1429092924231,60,-0.047659,0.0277383,0.154835,66
1429092924243,60,0.0018867,0.0310172,0.15041,65
1429092924285,60,-0.103601,-0.122812,-0.0827485,61
1429092924326,60,-0.0838777,-0.192204,-0.217269,58
1429092924368,60,-0.00177932,-0.207204,-0.268079,52
1429092924409,60,0.208631,-0.0661875,-0.0876278,48
1429092924450,60,0.300581,0.0250559,0.0574845,46
1429092924491,60,0.187468,0.00678367,0.0875561,45
1429092924532,60,-0.0278679,-0.0635878,0.0403532,43
1429092924574,60,-0.209899,-0.144954,-0.076644,41
1429092924615,60,-0.233219,-0.147696,-0.147128,40
1429092924656,60,-0.130083,-0.0557266,-0.105482,39
1429092924697,60,0.0419406,0.0978618,0.0358682,38
1429092924739,60,0.224385,0.247315,0.197833,35
1429092924780,60,0.233301,0.279723,0.233724,34
1429092924825,60,0.0892573,0.188496,0.114703,31
1429092924837,60,-0.0803489,0.0680392,-0.0543083,30
1429092924878,60,-0.167967,-0.00565483,-0.141384,29
1429092924920,60,-0.125865,-0.000373398,-0.104951,27
1429092924961,60,0.049974,0.112217,0.119654,26
1429092925003,60,0.0265784,0.0546927,0.115188,25
1429092925044,60,0.0359823,0.0157408,0.102266,25
1429092925086,60,-0.0349482,-0.0857209,-0.0131089,25
1429092925128,60,-0.0300344,-0.10351,-0.0642629,25
1429092925170,60,0.109862,0.0247362,0.0673246,35
1429092925211,60,0.202995,0.126609,0.18006,49
1429092925252,60,0.217086,0.163665,0.216964,66
1429092925294,60,0.11964,0.0925613,0.108033,66
1429092925335,59,0.0668178,0.0343286,-0.0105761,62
1429092925376,59,-0.0386401,-0.0576934,-0.149695,58
1429092925417,59,-0.209765,-0.196973,-0.312868,56
1429092925459,59,-0.241598,-0.205771,-0.282514,51
1429092925500,59,-0.2695,-0.200116,-0.188006,49
1429092925542,59,-0.139571,-0.0955612,0.017326,49
1429092925583,59,0.056765,0.0403951,0.239552,49
1429092925624,59,0.131802,0.0706775,0.306042,45
1429092925665,59,0.119178,0.00490035,0.195564,42
1429092925706,59,-0.103548,-0.158582,-0.0736223,39
1429092925748,59,-0.236466,-0.236233,-0.269369,37
1429092925789,59,-0.227753,-0.149896,-0.23842,34
1429092925831,59,-0.124162,-0.00714366,-0.100072,33
1429092925872,59,0.106614,0.170312,0.0973322,33
1429092925913,59,0.226419,0.20941,0.115757,32
1429092925955,59,0.338054,0.206969,0.0619041,31
1429092925997,59,0.368794,0.187809,0.00349202,30
1429092926038,59,0.145887,0.0346704,-0.184287,29
1429092926080,59,-0.0788934,-0.0931335,-0.288287,28
1429092926121,59,-0.367135,-0.245448,-0.387216,27
1429092926162,59,-0.382525,-0.192633,-0.213336,27
1429092926204,59,-0.258321,-0.0791889,0.0250503,28
1429092926245,59,0.00373299,0.102873,0.32034,38
1429092926286,59,0.111602,0.102858,0.326597,51
1429092926328,59,0.101007,0.0346169,0.221995,67
1429092926369,59,0.0563887,-0.0149512,0.0750883,67
1429092926411,58,0.016342,0.00284574,0.00663719,62
1429092926452,58,0.0266034,0.0418693,-0.0411763,59
1429092926493,58,0.202685,0.15913,0.0531985,54
1429092926534,58,0.256244,0.145403,0.0706807,51
1429092926580,58,0.33847,0.163041,0.174349,49
1429092926595,58,0.21498,0.0775034,0.173077,49
1429092926636,58,0.0159269,-0.000808438,0.133664,49
1429092926678,58,-0.177315,-0.132104,-0.0185399,47
1429092926720,58,-0.263667,-0.184881,-0.114849,45
1429092926761,58,-0.196753,-0.135474,-0.123517,41
1429092926808,58,-0.112523,-0.00872899,-0.00938122,38
1429092926821,58,-0.0692089,0.0651278,0.0534129,38
1429092926863,58,0.09519,0.222823,0.21604,35
1429092926904,58,0.0858563,0.163412,0.143516,33
1429092926946,58,0.0755093,0.0526229,0.01819,31
1429092926987,58,0.103938,0.00631221,-0.0548384,30
1429092927029,58,0.000289325,-0.0301277,-0.112306,30
1429092927070,58,-0.06172,-0.0530468,-0.154973,30
1429092927083,58,-0.219747,-0.131219,-0.224106,30
1429092927124,58,-0.330626,-0.245971,-0.326931,29
1429092927165,58,-0.225712,-0.206325,-0.269943,28
1429092927206,58,-0.0722258,-0.126058,-0.167873,27
1429092927248,58,0.182567,0.0716716,0.0652675,31
1429092927288,58,0.207848,0.106318,0.114241,40
1429092927330,58,0.118494,0.0946544,0.103373,60
1429092927372,58,0.0888816,0.131524,0.122745,66
1429092927413,58,0.0735012,0.147781,0.130267,63
1429092927455,58,-0.00615653,0.0603837,0.0388637,59
1429092927496,58,-0.0505151,-0.0313324,-0.0440447,54
1429092927538,58,-0.23095,-0.230065,-0.207308,51
1429092927579,58,-0.245185,-0.273116,-0.195238,47
1429092927621,58,-0.138525,-0.155015,0.0188212,47
1429092927663,58,0.120271,0.0775663,0.321169,46
1429092927705,58,0.278037,0.190117,0.422852,44
1429092927746,58,0.275385,0.133616,0.286037,40
1429092927788,58,0.0988562,-0.0745911,-0.0170899,38
1429092927801,58,-0.198134,-0.342214,-0.368619,37
1429092927842,58,-0.382092,-0.440677,-0.533566,37
1429092927883,58,-0.313538,-0.267109,-0.402464,37
1429092927924,58,0.000451709,0.130216,-0.0384131,37
1429092927966,58,0.512493,0.640678,0.471198,35
1429092928007,58,0.87793,0.967083,0.825249,33
1429092928048,58,0.819781,0.875378,0.782702,31
1429092928090,58,0.50482,0.544468,0.50762,30
1429092928131,58,-0.000599489,0.0674633,0.0816142,28
1429092928174,58,-0.452673,-0.414142,-0.394485,27
1429092928186,58,-0.854986,-0.828199,-0.836739,27
1429092928228,58,-0.921492,-0.936319,-0.964098,26
1429092928240,58,-0.66896,-0.718223,-0.744868,26
1429092928282,58,-0.238296,-0.279768,-0.272807,37
1429092928323,58,0.224985,0.244941,0.315199,50
1429092928364,58,0.344591,0.466197,0.574454,65
1429092928376,58,0.285643,0.456698,0.565825,65
1429092928417,58,0.09518,0.227619,0.282237,64
1429092928458,58,-0.136147,-0.129232,-0.138333,62
1429092928499,58,-0.308294,-0.463707,-0.550527,60
1429092928511,58,-0.294933,-0.581658,-0.693204,59
1429092928552,56,-0.225293,-0.544104,-0.635574,54
1429092928593,56,-0.0100097,-0.204822,-0.232056,49
1429092928634,56,0.190823,0.114397,0.156333,48
1429092928675,56,0.247469,0.300252,0.410923,47
1429092928717,56,0.26732,0.344255,0.489797,45
1429092928758,56,0.205887,0.241382,0.39247,43
1429092928800,56,0.191175,0.191729,0.329518,40
1429092928841,56,0.128219,0.196643,0.292605,38
1429092928883,56,0.148163,0.313513,0.338295,33
1429092928924,56,0.167152,0.434078,0.394098,31
1429092928966,56,0.178611,0.479233,0.403519,30
1429092929007,56,0.0784804,0.277361,0.175661,30
1429092929048,56,0.0724409,0.0811882,-0.017771,30
1429092929089,56,0.0996962,-0.0972773,-0.199946,29
1429092929131,56,0.109648,-0.172265,-0.240719,27
1429092929173,56,0.133652,-0.129147,-0.177098,26
1429092929215,56,0.0679278,-0.0886349,-0.129608,25
1429092929257,56,-0.136584,-0.137883,-0.19031,24
1429092929298,56,-0.252207,-0.125657,-0.21769,24
1429092929339,56,-0.393998,-0.213736,-0.342609,26
1429092929381,56,-0.444043,-0.29912,-0.436656,42
1429092929422,56,-0.412981,-0.353653,-0.437678,56
1429092929464,56,-0.358111,-0.328639,-0.305446,65
1429092929506,56,-0.290998,-0.309018,-0.214562,62
1429092929548,56,-0.143487,-0.211267,-0.0886751,58
1429092929589,56,0.0704002,-0.0580041,0.0441363,56
1429092929630,56,0.38245,0.210283,0.309784,50
1429092929672,56,0.634838,0.476973,0.602461,47
1429092929713,56,0.592507,0.499147,0.669413,45
1429092929754,56,0.258459,0.267384,0.430703,44
1429092929796,56,-0.187503,-0.108125,-0.00434197,41
1429092929837,56,-0.425896,-0.316355,-0.263511,40
1429092929879,56,-0.503457,-0.398179,-0.392023,37
1429092929920,56,-0.278289,-0.223646,-0.211252,35
1429092929961,56,-0.0998568,-0.0393551,-0.0256287,34
1429092930002,56,-0.0290835,0.0372007,0.00392459,32
1429092930043,56,0.0486987,0.112055,0.00939266,31
1429092930085,56,0.18612,0.188825,0.00887111,30
1429092930126,56,0.265071,0.163991,-0.0351367,29
1429092930167,56,0.308855,0.110144,-0.0616232,27
1429092930212,56,0.367313,0.166456,0.0871648,26
1429092930223,56,0.330672,0.218886,0.210053,26
1429092930265,56,0.226266,0.23105,0.261483,25
1429092930306,56,0.0743261,0.210026,0.24612,24
1429092930348,56,-0.19468,0.0514684,0.0741237,24
1429092930389,56,-0.411619,-0.167522,-0.161272,23
1429092930431,56,-0.546489,-0.372518,-0.396454,22
1429092930472,56,-0.356922,-0.333292,-0.401754,25
1429092930514,56,0.10255,0.0118453,-0.0602468,42
1429092930555,56,0.45716,0.339838,0.301449,56
1429092930597,56,0.608445,0.508813,0.483899,63
1429092930639,56,0.507598,0.465723,0.479645,59
1429092930680,56,0.257197,0.256127,0.285512,56
1429092930722,56,-0.056126,0.00211167,0.0600154,54
1429092930763,56,-0.327044,-0.252112,-0.15097,50
1429092930805,56,-0.48287,-0.424258,-0.277583,48
1429092930846,56,-0.505599,-0.495806,-0.321724,47
1429092930888,56,-0.398373,-0.476168,-0.340874,46
1429092930929,56,-0.305068,-0.459902,-0.372189,44
1429092930971,56,-0.172004,-0.352784,-0.298112,40
1429092931012,56,-0.0471839,-0.208984,-0.169059,38
1429092931053,56,0.0314435,-0.0993982,-0.0702698,36
1429092931094,56,0.150475,0.0173669,0.00905858,34
1429092931136,56,0.178699,0.102082,0.0795862,33
1429092931177,56,0.19581,0.169017,0.115037,32
1429092931219,56,0.157735,0.219004,0.169509,30
1429092931260,56,0.0337888,0.207353,0.172701,30
1429092931302,56,-0.0545726,0.161132,0.125434,29
1429092931343,56,-0.122822,0.0956742,0.0341272,27
1429092931384,56,-0.127569,-0.0197599,-0.117751,26
1429092931426,56,-0.00685029,-0.0357886,-0.165902,25
1429092931467,56,0.215424,0.0741196,-0.0453256,24
1429092931511,56,0.464594,0.352032,0.274932,24
1429092931522,56,0.533142,0.541463,0.510704,23
1429092931564,56,0.495526,0.67859,0.689013,23
1429092931608,56,0.430731,0.700179,0.697526,27
1429092931620,56,0.176022,0.407077,0.354888,32
1429092931664,56,-0.125346,0.0179267,-0.0687029,44
1429092931675,56,-0.504714,-0.452789,-0.519499,51
1429092931717,56,-0.777588,-0.803623,-0.836376,62
1429092931758,56,-0.698572,-0.759169,-0.696719,59
1429092931799,56,-0.530823,-0.629122,-0.499228,55
1429092931841,56,-0.258373,-0.417218,-0.275101,52
1429092931883,56,-0.128839,-0.344467,-0.231117,48
1429092931894,56,-0.0726874,-0.303815,-0.229554,48
1429092931935,56,0.0284222,-0.177666,-0.103932,46
1429092931977,56,0.159325,-0.00542883,0.0948863,47
1429092932018,56,0.174332,0.0695188,0.213043,48
1429092932060,56,0.0857441,0.0153354,0.142146,47
1429092932102,56,-4.25412e-05,-0.0217144,0.0762166,42
1429092932114,56,-0.0804123,-0.0102665,0.0723922,42
1429092932155,56,-0.0202236,0.13725,0.209688,39
1429092932197,56,0.129779,0.339763,0.38499,37
1429092932238,56,0.354181,0.476288,0.454386,36
1429092932280,56,0.487792,0.441536,0.292724,35
1429092932321,56,0.615699,0.384615,0.119357,34
1429092932363,56,0.470417,0.224097,-0.0820227,33
1429092932405,56,0.311144,0.202466,-0.056114,30
1429092932417,56,0.00422411,0.117986,-0.020496,29
1429092932459,56,-0.247488,-0.00850749,-0.0416414,28
1429092932501,56,-0.356527,-0.0984687,-0.0546936,27
1429092932542,56,-0.395896,-0.182,-0.0920154,26
1429092932584,56,-0.30279,-0.178198,-0.0998272,26
1429092932626,56,-0.148594,-0.0592467,0.00307446,25
1429092932667,56,-0.14206,-0.0448291,0.00476068,26
1429092932708,56,-0.191479,-0.0690947,-0.0535647,33
1429092932750,56,-0.217576,-0.0735642,-0.0762417,47
1429092932791,56,-0.198982,-0.0617561,-0.0891302,66
1429092932803,56,-0.0369812,0.0372497,0.0154056,68
1429092932844,56,0.0133518,-0.0145362,-0.0211976,66
1429092932885,56,0.0526232,-0.11292,-0.0959474,64
1429092932927,56,0.155913,-0.124598,-0.0772089,63
1429092932968,56,0.314537,-0.0287147,0.0436563,59
1429092933009,56,0.409435,0.0566236,0.133802,56
1429092933050,56,0.296588,-0.00326232,0.0899182,54
1429092933091,56,0.069354,-0.130491,-0.0148754,54
1429092933132,56,-0.0351341,-0.110238,0.0149535,53
1429092933173,56,-0.06425,-0.0387842,0.105186,38
1429092933400,56,0.110599,0.165781,0.291428,37
1429092933412,56,0.141417,0.208717,0.287012,37
1429092933454,56,0.0204566,0.0926778,0.0678092,35
1429092933495,56,-0.234223,-0.13521,-0.27226,33
1429092933542,56,-0.433181,-0.318103,-0.555973,29
1429092933555,56,-0.535388,-0.379579,-0.664548,29
1429092933596,56,-0.365762,-0.214738,-0.483501,27
1429092933640,56,-0.1067,0.0345208,-0.141642,27
1429092933682,56,0.167417,0.313933,0.255566,27
1429092933724,56,0.262922,0.447335,0.512525,28
1429092933766,56,0.247211,0.437957,0.549637,28
1429092933807,56,0.093436,0.208466,0.296897,28
1429092933849,56,-0.022648,0.00472578,0.0631634,33
1429092933891,56,-0.0374451,-0.174779,-0.173885,53
1429092933932,56,0.0903113,-0.187932,-0.24701,67
1429092933973,56,0.169919,-0.162964,-0.248848,71
1429092934015,56,0.23341,-0.0369155,-0.118225,68
1429092934056,56,0.149641,0.0278117,0.015025,66
1429092934097,56,0.0158071,0.0297512,0.0829694,64
1429092934139,55,-0.0483358,0.041024,0.14198,59
1429092934181,55,-0.00971935,0.0671202,0.186915,58
1429092934222,55,0.161253,0.151513,0.266043,57
1429092934263,55,0.290734,0.229908,0.343549,56
1429092934304,55,0.281153,0.232379,0.348072,51
1429092934346,55,0.00779792,0.0180064,0.133615,47
1429092934388,55,-0.43207,-0.278493,-0.16684,42
1429092934431,55,-0.762713,-0.530583,-0.445728,40
1429092934474,55,-0.818366,-0.587003,-0.548913,37
1429092934515,55,-0.528336,-0.463658,-0.511418,35
1429092934557,55,-0.0765357,-0.146072,-0.222723,33
1429092934598,55,0.27693,0.0809886,-0.0301261,31
1429092934639,55,0.56057,0.337728,0.218885,29
1429092934681,55,0.596564,0.452819,0.3485,28
1429092934722,55,0.539743,0.486001,0.392037,27
1429092934763,55,0.357512,0.377229,0.282966,26
1429092934804,55,0.132902,0.201217,0.0719479,26
1429092934849,55,-0.0409141,0.101629,-0.0237047,25
1429092934860,55,-0.208352,-0.00739691,-0.0947793,25
1429092934902,55,-0.301065,-0.103036,-0.135525,24
1429092934943,55,-0.317198,-0.165164,-0.120539,23
1429092934984,55,-0.241469,-0.176421,-0.102883,25
1429092935025,55,-0.0875197,-0.108395,-0.0304331,38
1429092935066,55,0.0990939,0.00511163,0.0266649,52
1429092935108,55,0.250493,0.0993568,0.0332971,68
1429092935149,55,0.143679,0.00128238,-0.119107,67
1429092935190,55,-0.0564554,-0.135575,-0.244563,61
1429092935231,55,-0.165007,-0.185824,-0.211212,58
1429092935273,55,-0.143325,-0.127219,-0.017304,53
1429092935314,55,0.0376994,0.00238931,0.236146,51
1429092935355,55,0.175848,0.0674247,0.386645,50
1429092935398,55,0.227499,0.0826805,0.420041,51
1429092935439,55,0.245492,0.0614223,0.307561,48
1429092935481,55,0.139231,0.0104366,0.13399,45
1429092935522,55,0.0553284,0.0378227,0.0297446,42
1429092935564,55,-0.142834,-0.0485736,-0.157939,39
1429092935605,55,-0.258542,-0.158996,-0.316547,37
1429092935646,55,-0.42849,-0.38239,-0.526203,34
1429092935688,55,-0.458672,-0.463896,-0.551654,33
1429092935729,55,-0.310398,-0.348031,-0.419772,32
1429092935770,55,-0.131728,-0.0883825,-0.158233,31
1429092935813,55,0.0164573,0.167347,0.0479139,30
1429092935854,55,0.0042165,0.26512,0.118729,29
1429092935895,55,-0.0429067,0.230393,0.0609852,28
1429092935937,55,-0.000346396,0.202902,0.0494212,27
1429092935978,55,0.190456,0.281365,0.169136,26
1429092936019,55,0.432425,0.401245,0.347699,25
1429092936061,55,0.477018,0.369466,0.372232,24
1429092936102,55,0.373389,0.2141,0.257557,24
1429092936145,55,0.246871,0.0737744,0.142168,28
1429092936186,55,0.16943,0.0455851,0.136318,40
1429092936228,55,0.162105,0.129483,0.24271,63
1429092936239,55,0.0138716,0.0967826,0.220435,63
1429092936280,55,-0.265961,-0.140885,-0.0667057,69
1429092936322,54,-0.48139,-0.388549,-0.361101,66
1429092936363,54,-0.62179,-0.640486,-0.647613,62
1429092936406,54,-0.515747,-0.613576,-0.605587,59
1429092936418,54,-0.272677,-0.361593,-0.290246,58
1429092936460,54,0.00792279,-0.0361712,0.115713,53
1429092936501,54,0.361896,0.315644,0.514012,52
1429092936543,54,0.543175,0.466961,0.648515,52
1429092936584,54,0.47929,0.310165,0.402297,51
1429092936626,54,0.257773,0.0341815,-0.00831522,49
1429092936668,54,0.165842,-0.0131387,-0.172481,44
1429092936679,54,0.161158,0.0762046,-0.126444,43
1429092936721,54,0.0679595,0.133764,-0.0237664,40
1429092936763,54,-0.110859,0.0803935,0.0119803,37
1429092936804,54,-0.37196,-0.168088,-0.188251,36
1429092936846,54,-0.552221,-0.445434,-0.487219,34
1429092936857,54,-0.699652,-0.694288,-0.762895,34
1429092936899,54,-0.513093,-0.592598,-0.663267,33
1429092936940,54,-0.158284,-0.170681,-0.17454,32
1429092936982,54,0.298443,0.377058,0.429878,30
1429092937023,54,0.58492,0.780604,0.886292,29
1429092937065,54,0.674436,0.955411,1.09397,28
1429092937076,54,0.644113,0.844281,0.952788,28
1429092937117,54,0.531982,0.520427,0.548647,27
1429092937128,54,0.442136,0.23038,0.134168,27
1429092937169,54,0.276238,-0.0282266,-0.217544,27
1429092937211,54,0.00422479,-0.214929,-0.437647,25
1429092937252,54,-0.266768,-0.312414,-0.492655,26
1429092937293,54,-0.570633,-0.437728,-0.557549,40
1429092937335,54,-0.675365,-0.458308,-0.480922,56
1429092937376,54,-0.693807,-0.492422,-0.432485,68
1429092937417,54,-0.630069,-0.505001,-0.397636,66
1429092937458,54,-0.505704,-0.474324,-0.338482,63
1429092937500,54,-0.382895,-0.398209,-0.274882,58
1429092937541,54,-0.191466,-0.235157,-0.147783,54
1429092937582,54,0.0109556,-0.000886229,0.0699846,49
1429092937623,54,0.286894,0.275212,0.364173,48
1429092937665,54,0.45016,0.407036,0.521024,48
1429092937706,54,0.604186,0.453665,0.579034,46
1429092937747,54,0.580347,0.350243,0.459855,42
1429092937788,54,0.49795,0.229722,0.339258,40
1429092937829,54,0.389014,0.190926,0.284413,37
1429092937871,54,0.169753,0.0719458,0.11233,36
1429092937912,54,0.0441876,0.00314569,-0.0539051,34
1429092937953,54,-0.0022559,-0.0115731,-0.159525,33
1429092937995,54,-0.0243825,0.00648445,-0.193768,32
1429092938037,54,0.0925794,0.142166,-0.0572951,31
1429092938078,54,0.0252378,0.1381,0.0054497,29
1429092938120,54,-0.0729309,0.0799021,0.0178462,29
1429092938161,54,-0.1396,0.0233086,0.00744898,28
1429092938202,54,-0.297856,-0.144891,-0.171015,27
1429092938243,54,-0.442317,-0.313549,-0.36911,25
1429092938285,54,-0.577298,-0.428661,-0.509769,24
1429092938326,54,-0.504011,-0.340936,-0.429136,30
1429092938368,54,-0.262843,-0.121111,-0.174603,48
1429092938409,54,0.0635505,0.134696,0.129333,61
1429092938451,54,0.440548,0.411742,0.455301,65
1429092938492,54,0.543237,0.416939,0.491934,61
1429092938533,54,0.561719,0.337566,0.427765,56
1429092938574,54,0.313799,0.091423,0.18261,52
1429092938616,54,-0.00527691,-0.214498,-0.149974,47
1429092938657,54,-0.245027,-0.417363,-0.37772,46
1429092938699,54,-0.493627,-0.5922,-0.551083,46
1429092938740,54,-0.530952,-0.581668,-0.504482,45
1429092938782,54,-0.526132,-0.489344,-0.334561,41
1429092938824,54,-0.339914,-0.243617,-0.0467572,39
1429092938865,54,-0.0482375,0.0607952,0.23356,35
1429092938906,54,0.0842291,0.148501,0.228139,33
1429092938948,54,0.254416,0.250623,0.230649,32
1429092938990,54,0.254158,0.232193,0.142859,31
1429092939031,54,0.197554,0.193756,0.0334881,30
1429092939072,54,0.0581057,0.124742,-0.0475891,29
1429092939113,54,0.0714729,0.176975,-0.00231387,28
1429092939155,54,0.20362,0.318985,0.169266,27
1429092939196,54,0.390051,0.491693,0.400608,25
1429092939237,54,0.546719,0.592009,0.529016,24
1429092939279,54,0.552039,0.552429,0.544467,24
1429092939322,54,0.393164,0.353779,0.345151,23
1429092939363,54,0.184546,0.141095,0.147356,24
1429092939405,54,-0.172829,-0.1665,-0.163153,40
1429092939446,54,-0.399814,-0.328811,-0.314815,54
1429092939487,54,-0.621644,-0.534602,-0.510428,67
1429092939529,54,-0.617007,-0.599912,-0.591679,65
1429092939570,54,-0.436672,-0.575983,-0.601476,60
1429092939612,54,-0.166217,-0.389188,-0.427437,58
1429092939654,54,0.0991802,-0.213722,-0.234742,53
1429092939695,54,0.123763,-0.117,-0.051901,50
1429092939736,54,0.00267309,-0.105766,0.038264,48
1429092939778,54,-0.0731945,-0.0470819,0.181604,47
1429092939819,54,-0.100761,0.0401076,0.270411,45
1429092939860,54,-0.041842,0.152258,0.32431,42
1429092939902,54,0.00472327,0.259187,0.347564,40
1429092939943,54,0.0640214,0.284541,0.305495,38
1429092939984,54,0.00369081,0.183959,0.188172,35
1429092940025,54,-0.0568645,0.0107914,-0.00687136,33
1429092940067,54,0.061946,0.0425224,0.0163591,31
1429092940109,54,0.20775,0.122558,0.0455733,31
1429092940151,54,0.438644,0.344261,0.231787,30
1429092940163,54,0.326034,0.310614,0.182496,30
1429092940204,54,0.0957735,0.111298,-0.0388278,29
1429092940246,54,-0.0834485,-0.0565108,-0.191814,28
1429092940258,54,-0.139352,-0.129106,-0.252522,27
1429092940299,54,-0.00805783,-0.0547234,-0.177816,26
1429092940340,54,0.0782178,0.0160995,-0.0866434,24
1429092940382,54,0.0973686,0.0108902,-0.0700688,23
1429092940423,54,0.0671186,-0.0453667,-0.0945139,23
1429092940464,54,-0.0137419,-0.167843,-0.174768,22
1429092940505,54,-0.0895286,-0.265081,-0.257306,25
1429092940548,54,-0.130499,-0.301792,-0.294597,37
1429092940559,54,-0.14577,-0.208062,-0.184007,43
1429092940600,54,-0.126012,-0.043372,0.00914937,58
1429092940642,54,-0.105359,0.102913,0.194067,67
1429092940653,54,-0.103334,0.167261,0.2709,66
1429092940695,54,0.00220979,0.170058,0.260352,63
1429092940706,54,-0.0583451,0.0214609,0.0840179,62
1429092940748,54,-0.158872,-0.157455,-0.118378,61
1429092940789,54,-0.150899,-0.168963,-0.11378,57
1429092940830,54,-0.044337,-0.0825209,0.0224171,53
1429092940841,54,0.106464,0.0242197,0.153319,51
1429092940883,54,0.251038,0.147037,0.283605,50
1429092940924,54,0.249892,0.161092,0.274542,49
1429092940965,54,0.183531,0.148918,0.200103,47
1429092941007,54,0.0686912,0.0848349,0.0665118,44
1429092941048,54,-0.0742727,0.0134099,-0.0659498,41
1429092941059,54,-0.217278,-0.0642629,-0.143628,40
1429092941101,54,-0.242194,-0.0740292,-0.110706,39
1429092941112,54,-0.179824,-0.0432674,0.00980844,38
1429092941153,54,0.0382189,0.092434,0.190626,35
1429092941195,54,0.242155,0.178817,0.238647,34
1429092941236,54,0.263198,0.16192,0.122305,33
1429092941249,54,0.213473,0.128234,-0.0547905,33
1429092941290,54,0.186707,0.16626,-0.106394,32
1429092941332,54,0.178036,0.172936,-0.111984,32
1429092941373,54,0.0942101,0.0339293,-0.184799,30
1429092941415,54,-0.152166,-0.298085,-0.454658,29
1429092941426,54,-0.471979,-0.631106,-0.709609,28
1429092941467,54,-0.596089,-0.699376,-0.729758,28
1429092941509,54,-0.418529,-0.447544,-0.457904,27
1429092941550,54,-0.137376,-0.0838325,-0.0913481,27
1429092941592,54,0.244137,0.318108,0.351267,26
1429092941634,54,0.50348,0.551817,0.635494,26
1429092941675,54,0.418104,0.4454,0.573688,40
1429092941716,54,0.11383,0.137963,0.275494,54
1429092941758,54,-0.116355,-0.110377,0.00474522,67
1429092941800,55,-0.228687,-0.173555,-0.0749396,65
1429092941811,55,0.0218098,0.112384,0.213298,63
1429092941853,55,0.178132,0.313785,0.42623,59
1429092941894,55,0.21891,0.317179,0.427254,57
1429092941936,55,0.141397,0.152378,0.250774,52
1429092941977,55,-0.0163224,-0.116953,-0.0143533,50
1429092942019,55,-0.168545,-0.320226,-0.213097,50
1429092942060,55,-0.238782,-0.422002,-0.330672,49
1429092942101,55,-0.18949,-0.289131,-0.228351,47
1429092942142,55,-0.0659345,-0.0770095,-0.0823721,42
1429092942183,55,0.0800017,0.155187,0.0961117,39
1429092942224,55,0.214871,0.302726,0.207607,35
1429092942266,55,0.294303,0.313654,0.197754,33
1429092942307,55,0.0588684,0.0255387,-0.107425,32
1429092942349,55,-0.231856,-0.293038,-0.43026,31
1429092942392,55,-0.399223,-0.403317,-0.521186,31
1429092942433,55,-0.374684,-0.293731,-0.388693,30
1429092942474,55,-0.098024,-0.0408765,-0.126409,29
1429092942516,55,0.146845,0.0742566,-0.0393179,28
1429092942557,55,0.305544,0.0501206,-0.0997392,27
1429092942599,55,0.371039,0.0520505,-0.0898515,26
1429092942640,55,0.298061,0.0534293,-0.033534,25
1429092942681,55,0.0771154,0.104399,0.142552,25
1429092942723,55,-0.231977,0.0985642,0.248885,29
1429092942765,55,-0.3128,0.198537,0.394424,40
1429092942808,55,-0.261093,0.239013,0.396497,59
1429092942850,55,0.102033,0.411479,0.499389,65
1429092942892,55,0.317308,0.41508,0.449902,61
1429092942932,55,0.224646,0.210938,0.218617,59
1429092942974,55,-0.0413392,-0.0666685,-0.0650191,54
1429092943015,55,-0.318955,-0.351839,-0.370898,51
1429092943057,55,-0.335408,-0.456128,-0.498441,49
1429092943098,55,-0.259338,-0.465033,-0.507488,50
1429092943140,55,0.0906828,-0.199058,-0.20018,49
1429092943181,55,0.317925,0.0242261,0.094567,46
1429092943222,55,0.250275,0.0399605,0.185154,43
1429092943264,55,0.0891697,-0.0364841,0.136522,40
1429092943308,55,-0.248204,-0.288422,-0.129058,39
1429092943320,55,-0.37628,-0.34415,-0.252304,39
1429092943361,55,-0.201991,-0.14042,-0.105661,37
1429092943402,55,0.0190878,0.160064,0.104193,36
1429092943446,55,0.237835,0.432866,0.307256,35
1429092943457,55,0.196006,0.399062,0.201923,35
1429092943499,55,0.166859,0.258021,0.00214445,34
1429092943540,55,0.151524,0.0753521,-0.168791,32
1429092943581,55,0.141521,-0.0540682,-0.209186,30
1429092943623,55,0.277827,0.0476584,0.0136268,29
1429092943664,55,0.300478,0.201443,0.271186,29
1429092943706,55,0.184002,0.208705,0.295324,28
1429092943747,55,-0.00943146,0.0976094,0.142713,27
1429092943788,55,-0.286663,-0.15684,-0.125674,27
1429092943830,55,-0.497149,-0.376745,-0.365932,32
1429092943872,55,-0.527603,-0.41036,-0.373094,43
1429092943913,55,-0.331916,-0.218477,-0.169289,62
1429092943954,55,-0.109091,-0.00505358,0.0108382,64
1429092943996,55,0.0901304,0.174486,0.155196,60
1429092944037,55,-0.0019272,0.10528,0.0667046,57
1429092944079,55,0.00827905,0.110087,0.0770861,54
1429092944120,55,-0.0659581,0.0176557,0.0217336,51
1429092944161,55,0.0610355,0.00104895,0.0446227,47
1429092944202,55,0.182593,-0.0589694,0.0439473,47
1429092944243,55,0.281884,-0.121193,0.0195713,46
1429092944285,55,0.249151,-0.199927,-0.0176882,44
1429092944326,55,-0.000262905,-0.354834,-0.172388,41
1429092944368,55,-0.161253,-0.361883,-0.226118,39
1429092944409,55,-0.109641,-0.135728,-0.0632636,36
1429092944451,55,0.0359314,0.129815,0.11726,34
1429092944492,55,0.252527,0.370073,0.296498,31
1429092944534,55,0.301443,0.484745,0.390071,30
1429092944575,55,0.25774,0.4744,0.373273,29
1429092944617,55,0.0679681,0.351743,0.260093,28
1429092944657,55,0.0521814,0.325102,0.236918,27
1429092944700,55,-0.0621877,0.164737,0.0522696,26
1429092944711,55,0.0337402,0.133489,-0.00388873,26
1429092944752,55,0.180231,0.144554,0.01249,25
1429092944793,55,0.144549,0.044186,-0.059091,25
1429092944838,55,-0.00508924,-0.10069,-0.186324,25
1429092944850,55,-0.389871,-0.414463,-0.493488,25
1429092944891,55,-0.684626,-0.643271,-0.72491,25
1429092944932,55,-0.679781,-0.64616,-0.721272,24
1429092944973,55,-0.363182,-0.389016,-0.446654,29
1429092945015,55,-0.0211161,-0.116705,-0.116436,46
1429092945055,55,0.170688,0.0859166,0.16136,58
1429092945097,55,0.161942,0.13021,0.288969,62
1429092945108,55,0.00837997,0.0754881,0.281698,62
1429092945149,55,-0.00226829,0.121235,0.32242,58
1429092945190,55,-0.0241183,0.0640031,0.245017,56
1429092945232,55,0.222315,0.153708,0.294962,52
1429092945243,55,0.425957,0.212007,0.323128,50
1429092945284,55,0.474153,0.20376,0.295299,47
1429092945326,55,0.402087,0.179106,0.231072,46
1429092945338,55,0.183766,0.0972425,0.0985404,46
1429092945380,55,-0.0673364,-0.0242692,-0.0543625,44
1429092945421,55,-0.266467,-0.13972,-0.199442,42
1429092945463,55,-0.323924,-0.198223,-0.261839,40
1429092945504,55,-0.344771,-0.247861,-0.281546,37
1429092945516,55,-0.184536,-0.13407,-0.159277,37
1429092945558,55,-0.0300083,0.00158865,-0.00754788,36
1429092945599,55,0.205505,0.237113,0.212077,35
1429092945641,55,0.367813,0.40932,0.38072,33
1429092945684,55,0.510364,0.512997,0.447621,33
1429092945696,55,0.289637,0.285003,0.18938,32
1429092945738,55,0.0231196,-0.0331303,-0.176416,32
1429092945779,55,-0.365478,-0.443008,-0.603753,30
1429092945821,55,-0.480849,-0.555213,-0.711498,28
1429092945862,55,-0.415723,-0.442631,-0.549584,27
1429092945903,55,-0.183686,-0.144471,-0.16466,27
1429092945945,55,0.0479051,0.138649,0.186327,26
1429092945986,55,0.190029,0.304422,0.387249,25
1429092946028,55,0.139927,0.232592,0.322673,24
1429092946069,55,0.034349,0.0865651,0.177255,25
1429092946110,55,-0.196527,-0.135351,-0.0425877,37
1429092946152,55,-0.314793,-0.281683,-0.230141,47
1429092946194,55,-0.288361,-0.275345,-0.282343,55
1429092946235,55,-0.11998,-0.144604,-0.224217,53
1429092946277,55,0.0186535,-0.079977,-0.204056,50
1429092946318,55,0.0229807,-0.0836223,-0.19991,47
1429092946359,55,-0.0581922,-0.102566,-0.151602,44
1429092946401,55,-0.192098,-0.164962,-0.120284,42
1429092946442,55,-0.189438,-0.099925,0.0555281,43
1429092946483,55,-0.0638035,0.0217813,0.237849,43
1429092946525,55,0.182637,0.228516,0.504257,41
1429092946566,55,0.468692,0.396177,0.651606,38
1429092946608,55,0.635925,0.488099,0.674208,35
1429092946649,55,0.653385,0.467962,0.521116,33
1429092946690,55,0.625774,0.436102,0.359547,31
1429092946732,55,0.380406,0.260515,0.0729461,30
1429092946773,55,0.0615207,0.000572842,-0.245434,30
1429092946814,55,-0.363393,-0.336403,-0.573318,31
1429092946857,55,-0.503245,-0.397524,-0.562069,31
1429092946899,55,-0.437172,-0.332365,-0.40884,30
1429092946940,55,-0.227932,-0.201388,-0.198758,29
1429092946981,55,-0.0049238,-0.0591656,-0.0123946,27
1429092947023,55,0.0609574,0.0220134,0.0894492,26
1429092947065,55,-0.0147192,0.0891611,0.126011,26
1429092947106,55,-0.152099,0.162931,0.142197,29
1429092947148,55,-0.162342,0.267364,0.197157,44
1429092947189,55,0.00204056,0.352925,0.27633,56
1429092947230,55,0.124781,0.270369,0.215212,60
1429092947271,55,0.327124,0.202358,0.183033,57
1429092947312,55,0.366096,0.0367028,0.0638913,54
1429092947354,55,0.201609,-0.224304,-0.180266,52
1429092947396,55,-0.106709,-0.50103,-0.438428,49
1429092947437,55,-0.433215,-0.696533,-0.60381,45
1429092947478,55,-0.554107,-0.683227,-0.55426,45
1429092947519,55,-0.435903,-0.414629,-0.257335,45
1429092947561,55,-0.145921,-0.0711066,0.0976045,44
1429092947602,55,0.0443883,0.123604,0.24435,40
1429092947643,55,0.129947,0.189916,0.231425,39
1429092947684,55,0.144851,0.174179,0.123446,36
1429092947726,55,0.0515734,0.11591,0.0146152,35
1429092947768,55,0.0118711,0.12385,-1.9615e-05,35
1429092947809,55,0.0740539,0.251425,0.1547,34
1429092947851,55,0.152038,0.333297,0.266277,33
1429092947892,55,0.315275,0.440146,0.428077,31
1429092947934,55,0.29868,0.349162,0.356367,29
1429092947975,55,0.231546,0.219432,0.230644,28
1429092948016,55,0.0171015,-0.0503266,-0.0594299,27
1429092948057,55,-0.242638,-0.337584,-0.405164,27
1429092948099,55,-0.418808,-0.526619,-0.664629,27
1429092948140,55,-0.429353,-0.522657,-0.717415,26
1429092948181,55,-0.250378,-0.310885,-0.508149,25
1429092948223,55,-0.0116997,0.0192939,-0.12953,27
1429092948265,55,0.192571,0.31638,0.259304,35
1429092948306,55,0.285381,0.488106,0.523781,52
1429092948348,55,0.306963,0.514926,0.613113,58
1429092948389,55,0.27826,0.413533,0.544836,57
1429092948431,55,0.194984,0.176232,0.323218,55
1429092948472,55,0.0331494,-0.0989518,0.02619,53
1429092948513,55,-0.0732901,-0.259462,-0.136829,51
1429092948554,55,-0.189735,-0.38036,-0.266698,48
1429092948596,55,-0.233596,-0.402845,-0.283174,47
1429092948637,55,-0.272455,-0.389047,-0.27411,47
1429092948679,55,-0.248607,-0.31157,-0.201249,45
1429092948690,55,-0.237515,-0.253076,-0.166114,43
1429092948701,55,-0.220078,-0.213316,-0.159384,42
1429092948743,55,-0.17614,-0.162639,-0.158639,40
1429092948784,55,-0.101755,-0.115467,-0.163399,38
1429092948825,55,0.0584937,0.00913034,-0.0917808,37
1429092948867,55,0.204601,0.139517,0.0233588,35
1429092948908,55,0.356752,0.309657,0.216403,33
1429092948950,55,0.367,0.35816,0.280235,30
1429092948992,55,0.349776,0.408771,0.352914,29
1429092949033,55,0.270596,0.389137,0.354737,28
1429092949075,55,0.113972,0.248362,0.220146,27
1429092949116,55,-0.0438795,0.100999,0.0730738,27
1429092949157,55,-0.22257,-0.124913,-0.191467,26
1429092949199,55,-0.268122,-0.215697,-0.305774,25
1429092949240,55,-0.218969,-0.193848,-0.281508,23
1429092949282,55,0.000481722,0.0490627,-0.0341296,22
1429092949324,55,0.228607,0.352665,0.316787,22
1429092949366,55,0.315203,0.471357,0.454523,21
1429092949408,55,0.267234,0.402275,0.385718,29
1429092949449,55,0.0828172,0.156062,0.108358,40
1429092949491,55,-0.150021,-0.190397,-0.27695,55
1429092949503,55,-0.257886,-0.443442,-0.503401,56
1429092949545,55,-0.26263,-0.489355,-0.475934,55
1429092949556,55,-0.149587,-0.331778,-0.206017,54
1429092949598,55,-0.023014,-0.0867738,0.133696,52
1429092949639,55,0.137111,0.182028,0.415733,50
1429092949681,55,0.260196,0.31962,0.504714,47
1429092949722,55,0.237472,0.225631,0.336387,45
1429092949764,55,0.0818211,-0.0295673,0.0200088,45
1429092949805,55,-0.148324,-0.350922,-0.306219,46
1429092949846,55,-0.384708,-0.648636,-0.569844,43
1429092949887,55,-0.468157,-0.696931,-0.616156,40
1429092949930,55,-0.365384,-0.501853,-0.444898,37
1429092949941,55,-0.0971759,-0.0684668,-0.0628367,35
1429092949982,55,0.0705295,0.253598,0.206114,33
1429092950024,55,0.0897359,0.384038,0.294407,31
1429092950065,55,0.0227338,0.356647,0.200385,30
1429092950106,55,0.00893215,0.319106,0.145836,29
1429092950147,55,0.0482943,0.263581,0.0778786,28
1429092950188,55,0.204821,0.256428,0.116143,26
1429092950230,55,0.32709,0.263279,0.161445,26
1429092950271,55,0.382302,0.270922,0.214857,25
1429092950312,55,0.373651,0.312034,0.284177,24
1429092950355,55,0.198108,0.192829,0.162628,22
1429092950397,55,-0.018975,0.000826375,-0.0470047,21
1429092950438,55,-0.197741,-0.207329,-0.248189,24
1429092950480,55,-0.197297,-0.271206,-0.286585,33
1429092950521,55,-0.144019,-0.284487,-0.227904,48
1429092950562,55,-0.0804968,-0.208705,-0.125043,52
1429092950604,55,-0.00713157,-0.0420609,0.0119696,60
1429092950645,55,0.066778,0.145809,0.141911,57
1429092950686,55,0.174907,0.340788,0.283727,54
1429092950728,55,0.116678,0.270589,0.239924,50
1429092950769,55,-0.0114166,0.0630824,0.137566,47
1429092950811,55,-0.219046,-0.275111,-0.0744818,48
1429092950852,55,-0.427098,-0.639224,-0.360453,46
1429092950893,55,-0.474491,-0.786411,-0.539109,39
1429092950935,55,-0.316069,-0.635807,-0.505165,32
1429092950976,55,-0.0871234,-0.293353,-0.298378,24
1429092951017,55,0.141415,0.0845877,-0.00839169,22
1429092951059,55,0.147122,0.262904,0.160701,19
1429092951100,55,0.0839825,0.31524,0.240357,18
1429092951141,55,-0.0361197,0.264515,0.249547,18
1429092951182,55,-0.0124436,0.234611,0.208573,16
1429092951224,55,0.119859,0.250611,0.190376,14
1429092951265,55,0.290623,0.289242,0.184947,13
1429092951306,55,0.439329,0.411198,0.283371,10
1429092951348,55,0.313522,0.329628,0.205423,8
1429092951389,55,0.0984318,0.181939,0.0784819,6
1429092951430,55,-0.0684938,0.0752663,0.00192978,6
1429092951473,55,-0.18602,-0.0655514,-0.112687,15
1429092951514,55,-0.192963,-0.149415,-0.170524,36
1429092951555,55,-0.277135,-0.324294,-0.315727,69
1429092951597,55,-0.285769,-0.385249,-0.372148,76
1429092951638,56,-0.2235,-0.298587,-0.29602,71
1429092951680,56,-0.0474214,-0.0691949,-0.0709521,68
1429092951721,56,0.141165,0.134941,0.133966,67
1429092951762,56,0.236671,0.239247,0.261666,60
1429092951804,56,0.248154,0.0883026,0.144521,55
1429092951845,56,0.163811,-0.153164,-0.0402238,52
1429092951886,56,0.0863604,-0.338036,-0.179397,50
1429092951927,56,0.0646131,-0.329531,-0.165557,42
1429092951969,56,0.0560883,-0.159434,-0.0121397,38
1429092952010,56,0.187453,0.223727,0.328953,32
1429092952052,56,0.232337,0.471528,0.545252,29
1429092952094,56,0.150069,0.449064,0.477974,25
1429092952136,56,-0.0392591,0.19338,0.175765,23
1429092952178,56,-0.258876,-0.100736,-0.178565,21
1429092952219,56,-0.458336,-0.39598,-0.498271,20
1429092952261,56,-0.508285,-0.444481,-0.544419,18
1429092952302,56,-0.466098,-0.390155,-0.464851,17
1429092952343,56,-0.336686,-0.215521,-0.253462,14
1429092952385,56,-0.100993,-0.0149605,-0.0561016,12
1429092952427,56,0.0931732,0.114522,0.0479698,12
1429092952468,56,0.206779,0.179803,0.0893493,12
1429092952509,56,0.402645,0.392892,0.275962,11
1429092952520,56,0.434869,0.475346,0.382456,11
1429092952562,56,0.539891,0.649769,0.574078,24
1429092952603,56,0.578878,0.765085,0.696216,45
1429092952644,56,0.400336,0.588224,0.523239,75
1429092952685,56,0.191464,0.31271,0.278189,78
1429092952727,56,-0.216042,-0.210644,-0.184683,71
1429092952768,56,-0.435682,-0.533219,-0.453522,68
1429092952811,56,-0.517294,-0.736497,-0.625237,63
1429092952852,56,-0.427949,-0.717523,-0.569551,58
1429092952894,56,-0.26768,-0.595862,-0.451359,54
1429092952935,56,-0.114074,-0.421088,-0.284444,54
1429092952976,56,-0.128785,-0.383624,-0.26948,52
1429092953018,56,-0.180828,-0.300071,-0.215073,49
1429092953060,56,-0.273563,-0.273943,-0.208562,42
1429092953103,56,-0.283042,-0.19151,-0.151769,39
1429092953116,56,-0.12409,-0.0634814,-0.0383426,38
1429092953157,56,0.0567435,0.0960123,0.109101,36
1429092953198,56,0.255698,0.258117,0.246236,33
1429092953210,56,0.267921,0.262303,0.216163,32
1429092953251,56,0.300718,0.317375,0.232105,31
1429092953264,56,0.251358,0.335814,0.22425,31
1429092953305,56,0.311963,0.474846,0.376702,30
1429092953346,56,0.396187,0.615204,0.545047,27
1429092953388,56,0.49195,0.807936,0.751914,25
1429092953430,56,0.400459,0.738915,0.703095,22
1429092953441,56,0.143487,0.417434,0.383536,22
1429092953483,56,-0.105683,0.0478108,-0.0271212,20
1429092953524,56,-0.299661,-0.331425,-0.410618,18
1429092953565,56,-0.408378,-0.599837,-0.691926,16
1429092953577,56,-0.355604,-0.643668,-0.706958,16
1429092953619,56,-0.177346,-0.462526,-0.494889,14
1429092953630,56,0.047431,-0.164796,-0.158802,14
1429092953671,56,0.195746,0.0976385,0.126477,17
1429092953713,56,0.121611,0.15729,0.198872,43
1429092953724,56,-0.104719,-0.0216853,0.0227395,43
1429092953765,56,-0.234412,-0.191169,-0.160696,79
1429092953776,56,-0.27535,-0.291005,-0.260305,79
1429092953819,56,-0.15769,-0.231704,-0.203969,85
1429092953831,56,-0.0231749,-0.124347,-0.0971014,82
1429092953872,56,0.0296582,-0.0495719,0.00993057,77
1429092953883,56,-0.0338492,-0.0653815,0.0465265,75
1429092953924,56,-0.144181,-0.129443,0.0384193,72
1429092953936,56,-0.206711,-0.139917,0.0549164,70
1429092953977,56,-0.199359,-0.126787,0.0290842,61
1429092954003,56,-0.0761029,-0.0180921,0.0378461,59
1429092954044,56,0.0936193,0.138512,0.113266,58
1429092954072,56,0.144185,0.181719,0.108668,58
1429092954102,56,0.215611,0.247731,0.160443,56
1429092954143,56,0.16639,0.180655,0.110746,53
1429092954184,56,0.0279367,0.0442443,-0.000774854,47
1429092954202,56,-0.108369,-0.119267,-0.174331,44
1429092954243,56,-0.0658716,-0.071162,-0.150427,40
1429092954270,56,0.111785,0.104872,0.0115188,36
1429092954311,56,0.45494,0.458217,0.370281,32
1429092954353,56,0.548673,0.548534,0.487962,31
1429092954394,56,0.467877,0.458284,0.420942,32
1429092954435,56,0.150402,0.160339,0.104244,31
1429092954476,56,-0.162166,-0.0908968,-0.140192,28
1429092954519,56,-0.412294,-0.322747,-0.36719,25
1429092954560,56,-0.463406,-0.371693,-0.407075,22
1429092954602,56,-0.331982,-0.276368,-0.303983,19
1429092954643,56,-0.099813,-0.132068,-0.132542,16
1429092954685,56,0.156187,-0.0160181,-0.00773733,14
1429092954726,56,0.327261,0.0847772,0.106268,12
1429092954767,56,0.284449,0.059797,0.0954019,11
1429092954808,56,0.0308092,-0.102621,-0.0701992,19
1429092954849,56,-0.348324,-0.358104,-0.298427,50
1429092954891,56,-0.498412,-0.423463,-0.363886,72
1429092954932,56,-0.375208,-0.229097,-0.180088,79
1429092954974,56,-0.127574,0.0730153,0.0822296,73
1429092955015,56,0.139935,0.35652,0.328136,66
1429092955057,56,0.242842,0.423067,0.404986,61
1429092955098,56,0.210214,0.321529,0.340944,53
1429092955140,56,0.122552,0.164029,0.284773,52
1429092955186,56,0.0599947,-0.0132853,0.183491,54
1429092955197,56,0.0178157,-0.129983,0.0805426,53
1429092955240,56,-0.0532037,-0.242951,-0.0798056,50
1429092955252,56,-0.034384,-0.201864,-0.157437,48
1429092955293,56,-0.00369561,-0.0807023,-0.149325,44
1429092955334,56,-0.0284716,-0.0349597,-0.178216,40
1429092955375,56,-0.0513508,0.00534227,-0.152191,38
1429092955417,56,-0.12934,-0.0796113,-0.201171,35
1429092955458,56,-0.220076,-0.209396,-0.295011,34
1429092955500,56,-0.247429,-0.304124,-0.357741,34
1429092955542,56,-0.214823,-0.296183,-0.34335,32
1429092955584,56,-0.0497708,-0.123388,-0.17838,28
1429092955626,56,0.223886,0.166406,0.130629,25
1429092955669,56,0.447239,0.418599,0.410966,22
1429092955710,56,0.568332,0.594053,0.604341,20
1429092955752,56,0.497668,0.604713,0.610647,18
1429092955794,56,0.268934,0.459091,0.440508,16
1429092955835,56,0.0336603,0.294015,0.266368,15
1429092955876,56,-0.19788,0.0670395,0.048629,16
1429092955917,56,-0.340891,-0.189504,-0.191609,28
1429092955959,56,-0.254731,-0.273438,-0.269542,49
1429092956001,56,-0.203147,-0.34575,-0.350443,83
1429092956042,56,-0.124224,-0.333598,-0.398413,89
1429092956085,56,-0.107261,-0.251881,-0.365872,81
1429092956126,56,0.0063014,-0.0688557,-0.182072,77
1429092956168,56,0.103827,0.0523496,0.0178514,71
1429092956209,56,0.205195,0.0808768,0.153531,65
1429092956251,56,0.167668,-0.0536075,0.133187,59
1429092956292,56,-0.108831,-0.37699,-0.11679,60
1429092956335,56,-0.372803,-0.619631,-0.373169,61
1429092956376,56,-0.48837,-0.596406,-0.411611,58
1429092956418,56,-0.235332,-0.207794,-0.118579,50
1429092956459,56,0.191653,0.346903,0.370907,45
1429092956501,56,0.544637,0.763183,0.760516,40
1429092956544,56,0.66011,0.886576,0.90002,38
1429092956557,56,0.462943,0.696055,0.715972,37
1429092956599,56,0.0470564,0.233821,0.237609,34
1429092956641,56,-0.397324,-0.285704,-0.340121,33
1429092956653,56,-0.715831,-0.681682,-0.827452,33
1429092956695,56,-0.785323,-0.789554,-0.993893,31
1429092956741,56,-0.670479,-0.610286,-0.830111,28
1429092956752,56,-0.296129,-0.158423,-0.345661,27
1429092956793,56,0.15145,0.33175,0.218441,24
1429092956835,56,0.583422,0.704143,0.670764,21
1429092956876,56,0.917625,0.89531,0.904239,20
1429092956917,56,1.06887,0.892258,0.929879,17
1429092956958,56,0.890798,0.635246,0.68818,15
1429092957000,56,0.439723,0.184447,0.228918,12
1429092957042,56,-0.191833,-0.406687,-0.395413,18
1429092957083,56,-0.773384,-0.921089,-0.944389,51
1429092957095,56,-1.01372,-1.08716,-1.12157,51
1429092957136,56,-0.869521,-0.862008,-0.881163,86
1429092957179,56,-0.42435,-0.307308,-0.276071,90
1429092957190,56,0.0988891,0.278638,0.367121,89
1429092957231,56,0.408841,0.569932,0.713365,85
1429092957274,56,0.499543,0.602938,0.765755,81
1429092957285,56,0.409664,0.406498,0.569171,79
1429092957327,56,0.211055,0.127576,0.253209,73
1429092957339,56,-0.0667338,-0.204525,-0.161378,70
1429092957381,56,-0.233925,-0.357416,-0.378183,66
1429092957422,56,-0.502533,-0.563296,-0.639668,64
1429092957464,56,-0.549587,-0.568053,-0.693125,62
1429092957506,56,-0.291518,-0.30677,-0.437701,54
1429092957547,56,0.0692709,0.0561978,-0.02748,48
1429092957589,56,0.457922,0.437029,0.412205,42
1429092957630,56,0.621773,0.653447,0.663543,40
1429092957671,56,0.455831,0.5366,0.540263,36
1429092957713,56,0.0628146,0.217684,0.173986,34
1429092957724,56,-0.262831,-0.0919656,-0.149778,33
1429092957765,56,-0.468628,-0.321585,-0.365951,31
1429092957806,56,-0.446727,-0.383694,-0.389492,28
1429092957848,56,-0.342638,-0.366206,-0.317557,26
1429092957859,56,-0.0288918,-0.105152,-0.0560217,25
1429092957900,56,0.403023,0.310253,0.332693,23
1429092957912,56,0.735869,0.641021,0.629185,22
1429092957954,56,0.754538,0.666909,0.613702,19
1429092957965,56,0.448519,0.380204,0.324021,19
1429092958006,56,-0.0430526,-0.086255,-0.119022,18
1429092958018,56,-0.569125,-0.542011,-0.538682,18
1429092958059,56,-0.76972,-0.683545,-0.664817,17
1429092958070,56,-0.759149,-0.621347,-0.58603,16
1429092958112,56,-0.419197,-0.260614,-0.250321,15
1429092958136,56,0.0895331,0.170258,0.17213,18
1429092958170,56,0.444095,0.448164,0.448997,33
1429092958211,56,0.627685,0.557292,0.548507,57
1429092958234,56,0.62858,0.460865,0.462021,70
1429092958275,56,0.321769,0.0601184,0.0718548,88
1429092958302,56,-0.0607148,-0.343585,-0.331427,87
1429092958344,56,-0.177389,-0.415657,-0.357294,79
1429092958369,56,-0.0978144,-0.23924,-0.126602,76
1429092958413,56,0.103397,0.0775117,0.256136,71
1429092958434,56,0.110142,0.164981,0.362478,67
1429092958476,56,-0.0412818,0.0781461,0.270417,60
1429092958502,56,-0.385313,-0.222123,-0.109179,59
1429092958543,56,-0.51649,-0.332884,-0.336407,60
1429092958584,56,-0.462872,-0.279762,-0.388383,58
1429092958628,56,-0.247983,-0.0231549,-0.182997,52
1429092958640,56,0.0291659,0.23217,0.0802911,50
1429092958681,56,0.164949,0.330333,0.222946,46
1429092958722,56,0.03339,0.0812667,-0.0167744,40
1429092958765,56,-0.0142607,-0.137083,-0.254464,36
1429092958806,56,-0.0802651,-0.321544,-0.458566,34
1429092958847,56,0.00386883,-0.285842,-0.45827,32
1429092958889,56,0.15098,-0.055289,-0.228587,29
1429092958930,56,0.268058,0.208606,0.0852803,27
1429092958971,56,0.340597,0.44251,0.390394,23
1429092959013,56,0.423204,0.623623,0.662983,21
1429092959054,56,0.366333,0.59718,0.718326,18
1429092959095,56,0.237689,0.434773,0.603892,16
1429092959136,56,0.153196,0.233916,0.393768,15
1429092959178,56,0.0996362,0.0726846,0.211127,14
1429092959220,56,-0.0728251,-0.18988,-0.124873,22
1429092959261,56,-0.273181,-0.43275,-0.427184,40
1429092959303,56,-0.557769,-0.648587,-0.671333,61
1429092959344,56,-0.665385,-0.625447,-0.640591,77
1429092959385,56,-0.448791,-0.324317,-0.299118,74
1429092959427,56,-0.132862,0.0379786,0.104524,66
1429092959468,56,0.287808,0.357691,0.432623,61
1429092959509,56,0.540823,0.463183,0.528172,53
1429092959551,56,0.516068,0.293931,0.316519,51
1429092959592,56,0.276412,0.021396,0.0489018,54
1429092959633,56,-0.109728,-0.333343,-0.320711,52
1429092959675,56,-0.536782,-0.672296,-0.67282,45
1429092959716,56,-0.762307,-0.799305,-0.838894,40
1429092959758,56,-0.591257,-0.589019,-0.67699,36
1429092959800,56,-0.101183,-0.0831454,-0.180984,33
1429092959842,56,0.440583,0.456867,0.361387,29
1429092959883,56,0.68141,0.738807,0.696089,28
1429092959924,56,0.507249,0.627598,0.627533,25
1429092959965,56,0.212112,0.392361,0.418364,24
1429092960012,56,-0.140545,0.0613966,0.0872735,22
1429092960024,56,-0.150646,-0.026576,-0.0259376,21
1429092960065,56,-0.0841102,-0.034352,-0.044226,19
1429092960106,56,0.0256372,0.0104539,-0.0198287,17
1429092960148,56,0.0120991,-0.00790506,-0.0405255,15
1429092960189,56,-0.111787,-0.098469,-0.131751,19
1429092960235,56,-0.151522,-0.139172,-0.185724,36
1429092960247,56,-0.0580102,-0.0581544,-0.117137,46
1429092960289,56,-0.0140385,-0.0235608,-0.0713318,76
1429092960332,56,0.0639781,0.0592749,0.0343976,81
1429092960373,56,-0.0175145,0.0158671,0.0409503,76
1429092960415,56,-0.0674554,-0.010797,0.0618069,73
1429092960456,57,-0.0770414,-0.0243271,0.0523026,65
1429092960498,57,-0.0660032,-0.00912776,0.0630063,60
1429092960539,57,-0.00957741,-0.0364289,0.0242913,57
1429092960580,57,0.157521,-0.0206127,0.0303817,57
1429092960622,57,0.164062,-0.151318,-0.0973512,54
1429092960665,57,0.194796,-0.233266,-0.195786,47
1429092960706,57,0.0924341,-0.290456,-0.249029,43
1429092960747,57,-0.0124217,-0.245308,-0.214895,38
1429092960789,57,-0.0262433,-0.00943519,0.0219173,35
1429092960830,57,-0.00726705,0.212827,0.239451,31
1429092960871,57,-0.0410565,0.331273,0.362904,28
1429092960913,57,-0.155579,0.245917,0.260275,24
1429092960954,57,-0.168841,0.127759,0.097837,23
1429092960996,57,-0.179915,-0.0350555,-0.115241,20
1429092961038,57,-0.120623,-0.0938729,-0.225933,20
1429092961080,57,0.0979088,0.0294326,-0.126762,19
1429092961091,57,0.230741,0.167625,0.0311854,19
1429092961133,57,0.268124,0.241714,0.138801,17
1429092961175,57,0.073021,0.129059,0.0965618,15
1429092961217,57,-0.0391572,0.0337545,0.0509411,17
1429092961258,57,-0.0205414,-0.00656193,0.0528016,29
1429092961299,57,0.109722,0.0406039,0.117678,62
1429092961340,57,0.145976,0.0355728,0.0812419,79
1429092961384,57,0.0862117,0.00573891,0.0178161,79
1429092961396,57,-0.222371,-0.174818,-0.176887,77
1429092961438,57,-0.479152,-0.407096,-0.424565,75
1429092961479,57,-0.652397,-0.605936,-0.600995,70
1429092961524,57,-0.436371,-0.495281,-0.472492,64
1429092961535,57,-0.000679181,-0.229554,-0.181342,61
1429092961576,57,0.377259,0.0436494,0.0886401,56
1429092961588,57,0.571556,0.242903,0.299297,56
1429092961629,57,0.499638,0.296977,0.377444,55
1429092961671,57,0.160499,0.17682,0.294308,52
1429092961712,57,-0.15134,0.0590258,0.18486,46
1429092961724,57,-0.200883,0.0938236,0.1939,46
1429092961765,57,0.0307643,0.338994,0.397654,42
1429092961806,57,0.324401,0.528346,0.505186,42
1429092961847,57,0.501257,0.584014,0.511566,41
1429092961889,57,0.354453,0.370221,0.274801,40
1429092961930,57,-0.0713493,-0.0969121,-0.19402,35
1429092961942,57,-0.488953,-0.50907,-0.602079,35
1429092961983,57,-0.724109,-0.697632,-0.766569,29
1429092961995,57,-0.611194,-0.542077,-0.598454,27
1429092962036,57,-0.332366,-0.257453,-0.32181,23
1429092962078,57,-0.106637,-0.0479959,-0.125251,18
1429092962090,57,0.052455,0.0552865,-0.058591,18
1429092962131,57,0.18872,0.0809586,-0.0375616,15
1429092962143,57,0.237686,0.0643335,-0.0410937,15
1429092962184,57,0.268196,0.0829009,0.026195,13
1429092962225,57,0.205253,0.0950075,0.0978881,12
1429092962236,57,0.102874,0.117289,0.166583,12
1429092962277,57,0.00907349,0.116877,0.198268,10
1429092962288,57,-0.00557316,0.11371,0.196609,10
1429092962330,57,0.00350048,0.0845686,0.161936,11
1429092962341,57,0.0925205,0.122279,0.206279,11
1429092962382,57,0.245515,0.223915,0.312626,33
1429092962401,57,0.333403,0.304091,0.403553,45
1429092962442,57,0.330035,0.355373,0.442807,67
1429092962484,57,0.285406,0.31044,0.386798,75
1429092962503,57,0.158064,0.125955,0.190184,73
1429092962544,57,-0.0236553,-0.170496,-0.13011,69
1429092962585,57,-0.204967,-0.460435,-0.469129,66
1429092962603,57,-0.330753,-0.594828,-0.595704,65
1429092962644,57,-0.338771,-0.527718,-0.532868,59
1429092962670,57,-0.207363,-0.258331,-0.230082,53
1429092962712,57,-0.169504,-0.0964707,-0.0663528,51
1429092962734,57,-0.187949,-0.0220454,-0.018545,51
1429092962775,57,-0.290206,-0.0919829,-0.148305,49
1429092962818,57,-0.384673,-0.18535,-0.283481,43
1429092962859,57,-0.45558,-0.252281,-0.375866,40
1429092962901,57,-0.404133,-0.194447,-0.301216,35
1429092962942,57,-0.221919,-0.0528904,-0.103064,33
1429092962983,57,-0.0046992,0.0915399,0.092237,30
1429092963024,57,0.21933,0.217134,0.246746,28
1429092963066,57,0.425722,0.334004,0.347733,25
1429092963107,57,0.616056,0.473728,0.452983,24
1429092963153,57,0.709302,0.552662,0.499169,20
1429092963164,57,0.600104,0.48954,0.411471,19
1429092963208,57,0.325118,0.319125,0.241338,17
1429092963249,57,-0.0257299,0.0783404,0.00169179,15
1429092963291,57,-0.247641,-0.0745896,-0.115424,15
1429092963335,57,-0.328255,-0.159379,-0.158417,14
1429092963380,57,-0.198594,-0.144958,-0.0891689,13
1429092963392,57,0.0110585,-0.08461,0.014745,13
1429092963434,57,0.065536,-0.119551,-0.0161058,11
1429092963477,57,0.11448,-0.105099,-0.037631,10
1429092963518,57,0.115244,-0.0650181,-0.0293279,20
1429092963559,57,0.106323,-0.0312074,-0.032726,40
1429092963601,57,0.12685,0.00328683,0.00958349,69
1429092963647,57,-0.0408388,-0.0983231,-0.0821254,72
1429092963658,57,-0.0464264,-0.0384142,-0.0102938,72
1429092963699,57,-0.20978,-0.108284,-0.0761997,66
1429092963741,57,-0.255208,-0.107021,-0.10406,64
1429092963782,57,-0.318944,-0.152524,-0.153906,60
1429092963824,57,-0.218518,-0.120797,-0.132704,56
1429092963866,57,0.0100367,0.00246707,0.0047683,55
1429092963907,57,0.15109,0.0890468,0.122511,55
1429092963949,57,0.0936379,0.0278053,0.0859648,49
1429092963991,57,0.0389579,-0.0162929,0.0457962,44
1429092964033,57,-0.0906026,-0.0990008,-0.0382076,39
1429092964074,57,-0.12787,-0.14191,-0.131051,35
1429092964116,57,-0.278929,-0.246624,-0.282922,32
1429092964157,57,-0.439294,-0.393974,-0.510588,30
1429092964199,57,-0.402733,-0.377464,-0.516538,28
1429092964241,57,-0.29762,-0.283958,-0.387631,27
1429092964283,57,0.0918769,0.0691601,0.0373171,25
1429092964324,57,0.511615,0.523924,0.589595,23
1429092964366,57,0.807366,0.85117,0.951482,21
1429092964407,57,0.828376,0.909307,0.974703,19
1429092964450,57,0.62079,0.670188,0.652102,17
1429092964491,57,0.33883,0.274591,0.139782,16
1429092964533,57,-0.0359909,-0.15844,-0.346432,13
1429092964575,57,-0.261019,-0.393993,-0.563294,13
1429092964617,57,-0.421459,-0.453467,-0.54585,30
1429092964659,57,-0.345172,-0.249028,-0.233608,50
1429092964701,57,-0.172429,-0.00624879,0.0737821,71
1429092964744,57,0.0378883,0.188623,0.295477,70
1429092964756,57,0.243797,0.28907,0.360974,67
1429092964797,57,0.335632,0.295581,0.355302,62
1429092964838,57,0.114376,0.0674328,0.129262,57
1429092964879,57,-0.12425,-0.130159,-0.0290659,52
1429092964921,57,-0.439574,-0.377419,-0.254036,49
1429092964962,57,-0.548258,-0.478209,-0.353234,50
1429092965003,57,-0.404089,-0.382327,-0.281481,48
1429092965044,57,-0.237438,-0.283901,-0.236948,45
1429092965086,57,-0.129782,-0.250777,-0.270345,40
1429092965127,57,-0.0462094,-0.193126,-0.270114,37
1429092965169,57,-0.0847442,-0.18032,-0.293774,33
1429092965210,57,-0.10857,-0.136818,-0.271524,30
1429092965252,57,-0.100885,-0.0770839,-0.193499,27
1429092965293,57,0.00897483,0.032854,-0.0561941,26
1429092965335,57,0.24002,0.220578,0.183849,23
1429092965376,57,0.364952,0.309883,0.299673,23
1429092965417,57,0.226595,0.226089,0.246478,21
1429092965459,57,0.0786435,0.128242,0.160819,20
1429092965500,57,-0.113245,0.0402321,0.077871,17
1429092965541,57,-0.192484,0.0417322,0.0745228,16
1429092965583,57,-0.0504207,0.154162,0.160379,25
1429092965625,57,0.219085,0.317353,0.30185,54
1429092965666,57,0.392649,0.375983,0.324037,72
1429092965707,57,0.323221,0.257104,0.211771,75
1429092965750,57,0.055653,0.0018426,-0.0292087,69
1429092965761,57,-0.0687288,-0.0709844,-0.061641,67
1429092965802,57,0.0344364,-0.000246465,0.0559547,59
1429092965844,57,0.285676,0.148446,0.22485,53
1429092965885,57,0.524062,0.23735,0.299448,51
1429092965926,57,0.573845,0.192996,0.218886,53
1429092965938,57,0.31885,-0.044628,-0.0695801,53
1429092965979,57,-0.126202,-0.328336,-0.338681,52
1429092966021,57,-0.550377,-0.488084,-0.446628,44
1429092966032,57,-0.734563,-0.479747,-0.374462,44
1429092966073,57,-0.690143,-0.355338,-0.196328,38
1429092966115,57,-0.436947,-0.12129,0.0374812,34
1429092966157,57,-0.140008,0.0676052,0.145368,30
1429092966168,57,0.132455,0.245063,0.196535,29
1429092966210,57,0.262227,0.283485,0.11841,28
1429092966221,57,0.210079,0.164728,-0.0746392,27
1429092966263,57,0.0492769,-0.0474678,-0.278983,26
1429092966274,57,-0.169737,-0.261129,-0.431129,26
1429092966315,57,-0.222684,-0.273464,-0.365502,26
1429092966357,57,-0.147376,-0.149742,-0.186059,25
1429092966398,57,-0.0124928,0.0344233,0.0430952,24
1429092966439,57,0.109572,0.124547,0.132731,20
1429092966487,57,0.222437,0.182407,0.201997,19
1429092966498,57,0.155365,0.108033,0.150162,19
1429092966540,57,0.0552285,0.0308077,0.0731933,41
1429092966582,57,-0.0725774,0.00400576,0.054845,63
1429092966594,57,-0.172052,-0.00365014,0.0726453,72
1429092966635,57,-0.184801,-0.011809,0.0680431,80
1429092966676,57,-0.0458626,0.0240203,0.127243,76
1429092966688,57,0.154047,0.110222,0.201899,74
1429092966729,57,0.311636,0.191437,0.259505,72
1429092966771,58,0.313078,0.176888,0.199964,65
1429092966783,58,0.194408,0.0564063,0.0516718,65
1429092966824,58,0.0590737,-0.0836508,-0.108077,58
1429092966836,58,-0.0323317,-0.218187,-0.248672,58
1429092966877,58,-0.136285,-0.284421,-0.292658,59
1429092966918,58,-0.188868,-0.245819,-0.230232,59
1429092966960,58,-0.148401,-0.09838,-0.0657623,52
1429092966971,58,-0.158271,-0.0154036,0.0269136,50
1429092967012,58,-0.147624,0.000753934,0.0085679,44
1429092967054,58,-0.180649,-0.0977715,-0.140658,39
1429092967095,58,-0.118558,-0.132504,-0.204116,36
1429092967136,58,0.141294,0.0603042,-0.0147925,32
1429092967178,58,0.491585,0.407821,0.365537,30
1429092967219,58,0.73077,0.730077,0.752061,26
1429092967262,58,0.71763,0.811776,0.853048,25
1429092967303,58,0.468213,0.640195,0.668038,23
1429092967345,58,0.0453439,0.192209,0.165054,21
1429092967385,58,-0.390872,-0.315086,-0.404512,18
1429092967427,58,-0.599354,-0.622279,-0.74122,12
1429092967468,58,-0.711582,-0.768804,-0.880054,10
1429092967510,58,-0.673039,-0.68548,-0.743136,11
1429092967551,58,-0.615449,-0.540174,-0.532927,25
1429092967592,58,-0.55184,-0.387198,-0.346977,58
1429092967633,58,-0.343458,-0.143653,-0.100755,71
1429092967674,58,-0.0525011,0.143501,0.142063,68
1429092967716,58,0.318405,0.453347,0.415602,64
1429092967757,58,0.605809,0.663816,0.667489,61
1429092967798,58,0.757348,0.658097,0.729108,56
1429092967839,58,0.637214,0.376133,0.528937,47
1429092967884,58,0.305179,-0.115547,0.0547533,47
1429092967896,58,-0.0938518,-0.605363,-0.481388,48
1429092967937,58,-0.423453,-0.90289,-0.84233,46
1429092967979,58,-0.410527,-0.755232,-0.752712,42
1429092968021,58,-0.151808,-0.276602,-0.273515,37
1429092968064,58,0.233815,0.363424,0.392167,33
1429092968109,58,0.546518,0.860236,0.916643,30
1429092968122,58,0.487231,0.90311,0.960989,30
1429092968166,58,0.14205,0.522822,0.505565,28
1429092968178,58,-0.229025,0.040396,-0.0613505,27
1429092968220,58,-0.517891,-0.41171,-0.571267,25
1429092968264,58,-0.496763,-0.513877,-0.659665,20
1429092968275,58,-0.28587,-0.380402,-0.46326,18
1429092968316,58,-0.0559248,-0.164487,-0.178151,15
1429092968358,58,0.10966,0.0562203,0.0658947,12
1429092968400,58,0.0486299,0.0325254,0.00894178,10
1429092968441,58,-0.0877644,-0.0865351,-0.188762,9
1429092968482,58,-0.106776,-0.119032,-0.275468,9
1429092968527,58,0.057156,0.0536997,-0.0584871,10
1429092968538,58,0.275512,0.314525,0.293164,10
1429092968580,58,0.472128,0.582742,0.673845,18
1429092968621,58,0.581302,0.742023,0.901525,38
1429092968662,58,0.46434,0.614218,0.751671,67
1429092968703,58,0.168514,0.224432,0.268587,71
1429092968744,57,-0.170479,-0.231152,-0.267119,65
1429092968786,57,-0.490641,-0.603259,-0.663617,63
1429092968827,57,-0.590484,-0.695683,-0.7094,59
1429092968868,57,-0.5663,-0.645355,-0.606671,52
1429092968910,57,-0.293854,-0.373484,-0.27562,47
1429092968951,57,-0.0646107,-0.189501,-0.0922185,47
1429092968993,57,0.147209,-0.00798184,0.105936,45
1429092969034,57,0.308886,0.128476,0.220395,42
1429092969076,57,0.346762,0.21419,0.295393,37
1429092969121,57,0.287868,0.202917,0.241209,34
1429092969132,57,0.138383,0.150746,0.158661,32
1429092969173,57,-0.0529263,0.0544811,0.00898669,28
1429092969215,57,-0.151464,0.0110487,-0.0763527,27
1429092969256,57,-0.151255,0.0367725,-0.0893746,26
1429092969298,57,0.0100217,0.159711,0.0135517,26
1429092969339,57,0.180759,0.219315,0.0864981,25
1429092969382,57,0.0821091,0.0214043,-0.106908,23
1429092969423,57,-0.105072,-0.247537,-0.378519,22
1429092969465,57,-0.390624,-0.514838,-0.637525,20
1429092969506,57,-0.557052,-0.588302,-0.665296,19
1429092969547,57,-0.367233,-0.282473,-0.240083,18
1429092969589,57,0.0399084,0.224314,0.381279,16
1429092969630,57,0.555603,0.755415,0.98513,21
1429092969672,57,0.752404,0.960849,1.18884,37
1429092969714,57,0.633725,0.748404,0.883875,65
1429092969762,57,0.28025,0.269266,0.299877,69
1429092969774,57,-0.0139323,-0.16395,-0.222386,69
1429092969815,57,-0.257083,-0.473318,-0.582765,60
1429092969861,57,-0.260213,-0.427957,-0.515891,55
1429092969873,57,-0.131858,-0.243797,-0.279056,55
1429092969914,57,-0.000429922,-0.0272061,0.0186042,48
1429092969956,57,0.0174187,0.0625957,0.169387,45
1429092969997,57,-0.138603,-0.109828,-0.0264201,46
1429092970038,57,-0.361957,-0.382538,-0.348383,45
1429092970083,57,-0.506319,-0.591351,-0.633033,40
1429092970096,57,-0.435655,-0.549794,-0.644639,39
1429092970137,57,-0.159692,-0.240057,-0.309189,35
1429092970179,57,0.082697,0.0955392,0.070886,31
1429092970220,57,0.193902,0.275932,0.281995,29
1429092970262,57,0.151611,0.299737,0.299989,28
1429092970273,57,0.0861098,0.254368,0.229953,28
1429092970315,57,0.0341382,0.174827,0.147432,27
1429092970356,57,0.0367647,0.136184,0.124398,26
1429092970397,57,0.189875,0.225073,0.236555,25
1429092970439,57,0.262153,0.305925,0.354244,24
1429092970481,57,0.304396,0.392271,0.462102,21
1429092970523,57,0.175275,0.284527,0.333241,19
1429092970564,57,0.0977191,0.191766,0.206899,17
1429092970606,57,0.00693023,-0.0296083,-0.0883398,18
1429092970647,57,0.0758502,-0.0810435,-0.173962,34
1429092970688,57,-0.0365626,-0.280244,-0.380705,53
1429092970729,57,-0.10563,-0.370016,-0.445945,71
1429092970771,57,-0.234742,-0.421954,-0.448633,69
1429092970813,57,-0.155918,-0.254002,-0.236657,62
1429092970854,57,-0.027019,-0.0279384,0.0193054,58
1429092970896,57,0.0908973,0.163837,0.24343,50
1429092970908,57,0.0772737,0.196853,0.288864,50
1429092970950,57,-0.0739766,0.0738272,0.160087,47
1429092970962,57,-0.281969,-0.176071,-0.12269,48
1429092971003,57,-0.346016,-0.318358,-0.289451,49
1429092971015,57,-0.321422,-0.351185,-0.337033,48
1429092971056,57,-0.0473156,-0.13518,-0.144681,45
1429092971098,57,0.188149,0.101348,0.0788223,39
1429092971110,57,0.362875,0.351389,0.348216,39
1429092971151,57,0.280355,0.293147,0.281471,34
1429092971193,57,0.122596,0.12598,0.117937,33
1429092971204,57,-0.0700004,-0.100633,-0.112039,32
1429092971245,57,-0.122041,-0.187179,-0.222289,32
1429092971256,57,-0.0754095,-0.149885,-0.196308,32
1429092971298,57,0.0371495,-0.0198392,-0.0904043,30
1429092971343,57,0.156368,0.161105,0.0565435,29
1429092971355,57,0.236507,0.302652,0.174616,28
1429092971396,57,0.168144,0.310398,0.16837,25
1429092971437,57,0.009045,0.152155,0.0206861,24
1429092971482,57,-0.0760338,0.0329082,-0.0172843,20
1429092971526,57,-0.234021,-0.17505,-0.116518,18
1429092971539,57,-0.160943,-0.159463,-0.0027988,17
1429092971584,57,0.0064969,0.00297405,0.235248,17
1429092971596,57,0.134842,0.134869,0.354188,18
1429092971638,57,0.208442,0.164811,0.290583,30
1429092971680,57,0.120754,-0.0156632,-0.0237113,61
1429092971722,57,-0.0164988,-0.206245,-0.303308,74
1429092971777,57,-0.16818,-0.299416,-0.408504,74
1429092971796,57,-0.227497,-0.242384,-0.285452,70
1429092971812,57,-0.321353,-0.181816,-0.129143,69
1429092971826,57,-0.223229,0.00215239,0.13364,69
1429092971867,57,0.00561231,0.223963,0.376966,65
1429092971909,57,0.0948812,0.227668,0.334054,58
1429092971950,57,0.15073,0.151444,0.141833,52
1429092971992,57,0.0604477,-0.0657985,-0.174334,52
1429092972033,57,-0.140812,-0.33533,-0.504382,49
1429092972074,57,-0.357011,-0.59549,-0.759066,45
1429092972115,57,-0.350332,-0.560084,-0.628478,39
1429092972157,57,-0.300806,-0.441345,-0.405383,36
1429092972198,57,0.0761158,0.0334644,0.167803,32
1429092972239,57,0.468652,0.504185,0.675658,30
1429092972281,57,0.682621,0.812577,0.962444,28
1429092972323,57,0.611693,0.777252,0.821107,27
1429092972364,57,0.393379,0.567816,0.501829,26
1429092972406,57,0.128867,0.306871,0.159282,26
1429092972447,57,-0.173154,-0.00951914,-0.17214,23
1429092972488,57,-0.295403,-0.215225,-0.339318,21
1429092972529,57,-0.320025,-0.357228,-0.425072,18
1429092972571,57,-0.25516,-0.404516,-0.446946,17
1429092972612,57,-0.113832,-0.308803,-0.365456,16
1429092972653,57,-0.0318989,-0.178749,-0.244231,17
1429092972695,57,-0.0547766,-0.0725168,-0.11348,22
1429092972736,57,-0.160305,-0.0602179,-0.0872359,48
1429092972778,57,-0.247608,-0.0496796,-0.0359494,67
1429092972819,57,-0.0406031,0.141871,0.183179,73
1429092972861,57,0.333854,0.42224,0.47882,68
1429092972902,57,0.615279,0.596079,0.672528,63
1429092972944,57,0.641164,0.50089,0.563373,60
1429092972985,57,0.462297,0.287209,0.365786,51
1429092973027,57,0.122428,-0.0281933,0.057731,49
1429092973070,57,-0.10715,-0.221967,-0.134613,49
1429092973111,57,-0.328991,-0.381665,-0.313929,46
1429092973152,57,-0.354868,-0.385948,-0.332639,39
1429092973194,57,-0.351284,-0.374455,-0.314851,34
1429092973235,57,-0.418718,-0.404519,-0.330939,29
1429092973278,57,-0.395701,-0.364333,-0.263766,27
1429092973289,57,-0.265059,-0.250512,-0.181409,26
1429092973330,57,0.038529,0.0114297,0.0296735,25
1429092973371,57,0.132203,0.104917,0.0514793,24
1429092973413,57,0.198717,0.183521,0.0723855,24
1429092973454,57,0.0452055,0.112219,-0.00339668,22
1429092973496,57,-0.064063,0.087088,-0.0180711,21
1429092973536,57,-0.0838337,0.0940722,-0.00481907,20
1429092973578,57,-0.054747,0.114071,0.0233282,19
1429092973619,57,0.029035,0.115976,0.0176799,17
1429092973661,57,0.179045,0.158952,0.0275875,16
1429092973702,57,0.192611,0.134,-0.0165986,14
1429092973745,57,0.21617,0.124112,-0.046258,14
1429092973786,57,0.109567,0.0567255,-0.0558188,18
1429092973828,57,-0.0834845,-0.0448184,-0.0777814,34
1429092973869,57,-0.14468,-0.0429264,0.0206136,66
1429092973911,57,-0.250902,-0.131394,0.00761079,77
1429092973952,57,-0.134102,-0.0978586,0.0622572,71
1429092973993,57,0.00365479,-0.0965887,0.0607132,67
1429092974034,57,0.197104,0.0134474,0.138178,64
1429092974076,57,0.183279,-0.0354875,0.0338534,58
1429092974087,57,0.146749,-0.00661596,0.0528982,55
1429092974129,57,0.16554,0.000319763,0.0676825,51
1429092974170,57,0.205908,0.0510938,0.176594,50
1429092974212,57,0.227784,0.0543106,0.203544,49
1429092974253,57,0.228272,0.103142,0.253705,44
1429092974265,57,-0.0110623,0.00446635,0.101908,44
1429092974306,57,-0.159518,-0.00571649,0.00365918,40
1429092974347,57,-0.299702,-0.0464877,-0.114191,37
1429092974388,57,-0.476819,-0.199521,-0.33087,35
1429092974430,57,-0.495733,-0.261967,-0.40507,33
1429092974471,57,-0.369884,-0.199055,-0.301861,30
1429092974512,57,-0.110136,-0.0283025,-0.0944638,29
1429092974554,57,0.117028,0.147302,0.103158,26
1429092974596,57,0.277744,0.281232,0.204315,25
1429092974607,57,0.287547,0.303794,0.195417,24
1429092974648,57,0.231818,0.295313,0.21201,23
1429092974690,57,0.168891,0.265605,0.220447,21
1429092974735,57,0.234365,0.291993,0.284164,19
1429092974746,57,0.303019,0.279904,0.281346,18
1429092974788,57,0.170696,0.0485425,0.0338036,18
1429092974829,57,-0.0498037,-0.232053,-0.278984,18
1429092974870,57,-0.321998,-0.498147,-0.529068,16
1429092974911,57,-0.513359,-0.637603,-0.671789,18
1429092974951,57,-0.458926,-0.547392,-0.552119,29
1429092974993,57,-0.323074,-0.36385,-0.34709,62
1429092975034,57,-0.0759145,-0.0907786,-0.0390402,79
1429092975076,57,0.223769,0.226209,0.348672,78
1429092975087,57,0.428683,0.471677,0.656523,75
1429092975129,57,0.527661,0.568485,0.741265,71
1429092975140,57,0.425707,0.461679,0.589235,69
1429092975182,57,0.129239,0.129839,0.157499,65
1429092975193,57,-0.209696,-0.242701,-0.299484,62
1429092975234,57,-0.361911,-0.407807,-0.466696,57
1429092975276,57,-0.336193,-0.385119,-0.414638,56
1429092975287,57,-0.0558013,-0.113354,-0.065588,56
1429092975329,57,0.260757,0.169891,0.258554,56
1429092975341,57,0.391296,0.335122,0.416803,55
1429092975383,57,0.313071,0.276686,0.297999,50
1429092975424,57,0.0756973,0.10534,0.0582313,42
1429092975466,57,-0.238796,-0.133239,-0.250044,39
1429092975478,57,-0.352586,-0.238072,-0.402188,37
1429092975519,57,-0.410815,-0.31337,-0.479641,33
1429092975561,57,-0.246199,-0.210702,-0.323852,31
1429092975602,57,-0.0384529,0.00288247,-0.00577941,30
1429092975644,57,0.0407875,0.128645,0.24025,28
1429092975685,57,-0.0391908,0.123391,0.278467,26
1429092975726,57,-0.225254,0.000809312,0.139928,24
1429092975768,57,-0.307457,-0.117958,-0.0666924,22
1429092975809,57,-0.239952,-0.176146,-0.242298,21
1429092975851,57,0.0603413,-0.039393,-0.196951,20
1429092975892,57,0.285127,0.0899063,-0.099551,19
1429092975933,57,0.393477,0.15174,-0.00817209,18
1429092975975,57,0.31068,0.125124,0.0542309,17
1429092976016,57,0.061525,-0.0574448,-0.0438318,18
1429092976058,57,-0.139162,-0.208449,-0.144488,36
1429092976099,57,-0.294926,-0.332191,-0.255065,56
1429092976141,57,-0.240275,-0.253852,-0.210083,76
1429092976183,57,0.0474117,0.0623941,0.0565304,73
1429092976224,57,0.302638,0.359228,0.325368,64
1429092976265,57,0.481197,0.552611,0.515037,59
1429092976306,57,0.372198,0.437205,0.447587,51
1429092976348,57,0.112904,0.137958,0.201823,50
1429092976389,57,0.076237,0.0574014,0.167944,55
1429092976431,57,0.0581499,0.00143933,0.146402,56
1429092976472,57,0.235547,0.173451,0.307514,51
1429092976513,57,0.242849,0.219999,0.355757,45
1429092976554,57,0.166349,0.107834,0.211628,40
1429092976596,57,-0.0489656,-0.165496,-0.100486,35
1429092976637,57,-0.313276,-0.460796,-0.435551,33
1429092976679,57,-0.53778,-0.649999,-0.667807,31
1429092976720,57,-0.697784,-0.686701,-0.764505,30
1429092976761,57,-0.624333,-0.510631,-0.646917,29
1429092976802,57,-0.326748,-0.112653,-0.255432,28
1429092976844,57,-0.0512774,0.1633,0.0541565,25
1429092976885,57,0.161379,0.33275,0.282261,24
1429092976927,57,0.266374,0.403408,0.397904,22
1429092976968,57,0.350136,0.403821,0.380771,20
1429092977009,57,0.35476,0.324581,0.247542,24
1429092977051,57,0.462154,0.368448,0.216828,40
1429092977092,57,0.424262,0.273589,0.0658203,75
1429092977133,57,0.239665,0.141159,-0.0654394,90
1429092977175,57,0.0390179,0.0749408,-0.0567522,88
1429092977217,57,-0.27054,-0.104786,-0.108398,83
1429092977258,57,-0.504971,-0.294706,-0.180793,79
1429092977299,57,-0.364738,-0.232638,-0.0301014,74
1429092977341,57,-0.0983379,-0.085924,0.142164,67
1429092977382,57,0.26198,0.131789,0.357689,67
1429092977424,57,0.34133,0.0821921,0.284456,67
1429092977465,57,0.0272373,-0.235558,-0.0818896,63
1429092977506,57,-0.347357,-0.521633,-0.414613,58
1429092977547,57,-0.557153,-0.577274,-0.513848,51
