1429697539583,100,-0.345047,-0.379467,-0.362713,44
1429697539619,100,-0.328583,-0.369815,-0.390857,44
1429697539651,100,-0.331009,-0.362318,-0.405698,45
1429697539693,100,-0.437515,-0.43935,-0.484975,43
1429697539719,100,-0.525828,-0.494686,-0.526447,40
1429697539761,100,-0.555912,-0.507625,-0.51903,38
1429697539783,100,-0.388556,-0.350764,-0.35294,35
1429697539824,100,-0.0761575,-0.0525691,-0.0563456,33
1429697539851,100,0.302502,0.31715,0.305575,30
1429697539893,100,0.638311,0.658866,0.653123,29
1429697539919,100,0.744846,0.779052,0.780235,38
1429697539961,100,0.656654,0.70269,0.699076,53
1429697540002,100,0.365811,0.403309,0.391532,75
1429697540044,100,0.125941,0.148921,0.112924,79
1429697540085,100,-0.0653228,-0.0550808,-0.117718,72
1429697540130,100,-0.0599188,-0.0665112,-0.149904,61
1429697540143,100,0.0273837,0.0100979,-0.0695974,61
1429697540185,100,0.16184,0.133877,0.0855084,53
1429697540226,100,0.14615,0.108245,0.0984468,50
1429697540268,100,0.10243,0.0602166,0.0882042,45
1429697540309,100,-0.0565222,-0.106497,-0.056989,40
1429697540351,100,-0.218707,-0.266536,-0.197397,34
1429697540392,100,-0.249907,-0.298132,-0.222592,28
1429697540434,100,-0.130744,-0.16014,-0.0787058,23
1429697540475,100,0.0125242,0.00435196,0.0620887,20
1429697540517,100,0.176812,0.191186,0.2285,17
1429697540559,100,0.192175,0.216706,0.217544,15
1429697540601,100,0.0971364,0.11548,0.0766157,23
1429697540643,100,-0.00956185,0.0031365,-0.0581661,39
1429697540684,100,-0.111679,-0.100464,-0.169695,61
1429697540726,100,-0.163697,-0.144289,-0.206841,64
1429697540768,100,-0.176842,-0.148353,-0.199031,60
1429697540810,100,-0.168262,-0.14117,-0.179705,54
1429697540852,100,-0.110356,-0.0989629,-0.110866,43
1429697540893,100,-0.0656547,-0.0837069,-0.0723201,40
1429697540935,100,-0.0139915,-0.0613433,-0.0238596,41
1429697540977,100,0.0272632,-0.0337965,0.0273615,42
1429697541018,100,0.0468724,-0.00392757,0.0627304,39
1429697541060,100,0.0794183,0.0535956,0.126752,35
1429697541102,100,0.0860746,0.0902108,0.14692,29
1429697541143,100,0.0685741,0.101417,0.129394,25
1429697541185,100,0.038745,0.0914431,0.0871963,19
1429697541226,100,0.0166183,0.0827914,0.058327,17
1429697541268,100,-0.0332034,0.0201102,-0.0376594,31
1429697541309,100,-0.0897339,-0.0647239,-0.162955,46
1429697541351,100,-0.126631,-0.132908,-0.254322,62
1429697541393,100,-0.127627,-0.154884,-0.278653,61
1429697541435,100,-0.0885473,-0.12105,-0.207909,52
1429697541447,100,-0.0187123,-0.0430601,-0.0750293,52
1429697541488,100,0.0810819,0.0800418,0.124965,42
1429697541530,100,0.169271,0.189202,0.312864,38
1429697541571,100,0.20781,0.235881,0.40248,37
1429697541613,100,0.154851,0.1711,0.331612,37
1429697541655,100,0.0242955,0.00982686,0.10516,32
1429697541696,100,-0.156614,-0.207047,-0.218184,28
1429697541738,100,-0.27346,-0.341092,-0.418748,22
1429697541779,100,-0.28491,-0.346559,-0.432493,20
1429697541821,100,-0.164032,-0.195812,-0.218356,17
1429697541863,100,-0.0156139,-0.0208953,0.0126138,15
1429697541910,100,0.141178,0.156815,0.24652,18
1429697541923,100,0.195293,0.208749,0.292485,24
1429697541965,100,0.146193,0.152966,0.179995,40
1429697542007,100,0.0777133,0.0831635,0.0494653,65
1429697542020,100,0.00530674,0.0194652,-0.0626471,68
1429697542062,100,-0.0320026,0.00422234,-0.0885769,68
1429697542104,100,-0.0389647,0.0101868,-0.0490603,60
1429697542116,100,-0.0367891,0.0171125,0.0217202,60
1429697542158,100,-0.0797942,-0.0387906,-0.00165687,48
1429697542170,100,-0.153453,-0.126494,-0.0974125,44
1429697542212,100,-0.228671,-0.216701,-0.236968,38
1429697542226,100,-0.258345,-0.25289,-0.326914,36
1429697542267,100,-0.212989,-0.209486,-0.313006,30
1429697542310,100,-0.0736228,-0.0731845,-0.148537,26
1429697542322,100,0.0930506,0.0900234,0.0724186,24
1429697542366,100,0.200255,0.200349,0.225567,20
1429697542378,100,0.247679,0.25492,0.305016,18
1429697542420,100,0.244563,0.255918,0.309058,15
1429697542461,100,0.220466,0.225332,0.27296,13
1429697542504,100,0.191401,0.179616,0.219722,10
1429697542516,100,0.14659,0.112348,0.137695,10
1429697542557,100,0.0904308,0.0432512,0.0549553,9
1429697542569,100,0.0223208,-0.0206608,-0.0216647,12
1429697542611,100,-0.0723252,-0.0943088,-0.121059,26
1429697542623,100,-0.147171,-0.146323,-0.193531,35
1429697542664,100,-0.20454,-0.178444,-0.243018,49
1429697542706,100,-0.192941,-0.153474,-0.206384,52
1429697542719,100,-0.140206,-0.104635,-0.129749,50
1429697542760,100,-0.0559645,-0.0368035,-0.0206961,44
1429697542801,100,0.0163858,0.00881742,0.0549822,38
1429697542819,100,0.0597767,0.0222667,0.0797333,30
1429697542860,100,0.0783932,0.0209195,0.0750374,24
1429697542901,100,0.0891554,0.0288385,0.0732619,21
1429697542943,100,0.100266,0.0591148,0.0980239,22
1429697542985,100,0.108688,0.0983629,0.139496,21
1429697543027,100,0.120114,0.1466,0.202017,18
1429697543039,100,0.14143,0.188363,0.265502,16
1429697543081,100,0.151261,0.202758,0.290891,12
1429697543093,100,0.138606,0.178262,0.257331,10
1429697543136,100,0.0981032,0.11853,0.164913,6
1429697543150,100,0.0482102,0.0533057,0.0615913,6
1429697543192,100,-0.0176909,-0.0212323,-0.0612378,11
1429697543219,100,-0.0771623,-0.0858233,-0.167129,18
1429697543250,100,-0.134494,-0.143188,-0.257587,38
1429697543291,100,-0.173599,-0.177836,-0.300463,59
1429697543318,100,-0.192309,-0.187633,-0.296307,61
1429697543360,100,-0.18222,-0.164754,-0.23743,53
1429697543382,100,-0.152358,-0.126612,-0.16156,49
1429697543424,100,-0.127842,-0.104392,-0.124153,37
1429697543450,100,-0.0927697,-0.0831108,-0.101436,34
1429697543491,100,-0.0517546,-0.0581707,-0.0764329,28
1429697543518,100,-0.01267,-0.0303829,-0.0459037,28
1429697543559,100,0.0302876,0.00645813,0.000748667,30
1429697543582,100,0.0557397,0.034945,0.0381562,30
1429697543623,100,0.0570649,0.0374987,0.0403988,27
1429697543650,100,0.0590658,0.0358827,0.0355058,25
1429697543692,100,0.0667353,0.0399034,0.0426112,19
1429697543718,100,0.06018,0.0310333,0.0342879,16
1429697543750,100,0.0562655,0.0283113,0.0354514,12
1429697543782,100,0.0341039,0.0194744,0.0272391,18
1429697543818,100,0.013935,0.012887,0.0200618,36
1429697543850,100,0.0168793,0.0164224,0.0277752,59
1429697543882,100,0.00903398,0.00351124,0.0215111,75
1429697543918,100,0.0132519,-0.000260205,0.0316497,77
1429697543950,100,0.0031416,-0.0126224,0.0265625,71
1429697543982,100,-0.00890321,-0.0146527,0.0249243,61
1429697544018,100,-0.0106982,-0.0019361,0.0242536,50
1429697544050,100,0.00844612,0.0279234,0.0367248,41
1429697544082,100,0.0326233,0.0567443,0.0500177,36
1429697544118,100,0.0904663,0.113625,0.109828,35
1429697544150,100,0.12709,0.145365,0.147702,36
1429697544191,100,0.141668,0.151591,0.16376,36
1429697544233,100,0.105584,0.111483,0.115685,33
1429697544278,100,0.0419807,0.0481553,0.0322979,27
1429697544293,100,-0.0470139,-0.0322362,-0.0787942,26
1429697544336,100,-0.0851767,-0.0545737,-0.107665,24
1429697544378,100,-0.108304,-0.0662441,-0.113261,40
1429697544419,100,-0.113632,-0.0748226,-0.099173,61
1429697544461,100,-0.108006,-0.0831068,-0.0813046,82
1429697544502,100,-0.10624,-0.107337,-0.0948194,81
1429697544543,101,-0.0845458,-0.111121,-0.0979443,71
1429697544585,101,-0.0430313,-0.0846975,-0.0784965,62
1429697544627,101,0.00825879,-0.0362946,-0.0304772,50
1429697544669,101,0.020517,-0.0173259,-0.00689603,46
1429697544711,101,0.0258893,-0.000931939,0.0211342,46
1429697544752,101,0.0377952,0.0219891,0.0617041,46
1429697544794,101,0.0632816,0.051857,0.103172,42
1429697544835,101,0.110555,0.103602,0.158056,37
1429697544878,101,0.168487,0.166206,0.220445,27
1429697544919,101,0.13924,0.136094,0.155456,24
1429697544964,101,0.0809759,0.0752514,0.0645749,41
1429697544977,101,-0.046282,-0.0587906,-0.112943,51
1429697545019,101,-0.149448,-0.158761,-0.240551,74
1429697545061,101,-0.208428,-0.208063,-0.295513,85
1429697545103,102,-0.17553,-0.154955,-0.218557,82
1429697545145,102,-0.105518,-0.0719795,-0.099404,71
1429697545187,102,-0.00116155,0.0425334,0.0654735,61
1429697545228,102,0.0668217,0.104849,0.160523,48
1429697545270,102,0.110715,0.132934,0.214048,45
1429697545311,102,0.104791,0.101884,0.181658,44
1429697545353,102,0.0459918,0.0136434,0.0587426,42
1429697545395,102,-0.0480248,-0.100341,-0.11531,35
1429697545437,102,-0.10209,-0.159696,-0.217371,30
1429697545479,102,-0.0845282,-0.113681,-0.171146,24
1429697545521,102,-0.0346024,-0.0348052,-0.0728312,24
1429697545563,102,0.0210549,0.0472932,0.0365718,46
1429697545605,102,0.0783218,0.121366,0.14086,69
1429697545649,102,0.110023,0.154276,0.188509,88
1429697545661,102,0.101971,0.13526,0.159809,89
1429697545702,102,0.015768,0.0144801,-0.00978431,86
1429697545744,102,-0.0569112,-0.0876789,-0.146292,73
1429697545790,102,-0.117849,-0.167305,-0.241724,59
1429697545802,102,-0.14358,-0.196243,-0.259303,59
1429697545844,102,-0.108334,-0.13862,-0.155741,54
1429697545885,102,-0.0377289,-0.0336247,0.00363018,54
1429697545927,102,0.0565025,0.0978278,0.189942,51
1429697545969,102,0.11216,0.17659,0.295634,47
1429697546013,102,0.100793,0.162376,0.263878,39
1429697546025,102,0.0405237,0.0846154,0.13739,35
1429697546067,102,-0.045397,-0.026724,-0.0365656,26
1429697546079,102,-0.0858221,-0.0788641,-0.129345,21
1429697546121,102,-0.0894902,-0.0856849,-0.149174,11
1429697546132,102,-0.0737579,-0.0764253,-0.139942,10
1429697546174,102,-0.0258791,-0.0304565,-0.0762273,18
1429697546216,102,-0.000925379,-0.0135096,-0.0486305,45
1429697546228,102,0.00317017,-0.0177164,-0.0518034,52
1429697546270,102,0.00431276,-0.0158324,-0.0462282,58
1429697546282,102,0.016048,0.00331255,-0.0102985,58
1429697546323,102,0.0346355,0.0259843,0.0343352,52
1429697546365,102,0.0822334,0.0768395,0.127718,41
1429697546407,102,0.119307,0.108695,0.193463,35
1429697546418,102,0.142555,0.125533,0.223796,32
1429697546460,102,0.155912,0.133015,0.225814,29
1429697546508,102,0.140894,0.124296,0.191919,30
1429697546520,102,0.105438,0.104576,0.136065,30
1429697546561,102,0.0488189,0.0640371,0.0592416,30
1429697546573,102,-0.00225127,0.0223358,-0.00753803,30
1429697546615,102,-0.049198,-0.0320972,-0.0852972,26
1429697546627,102,-0.0965729,-0.0905247,-0.162659,25
1429697546668,102,-0.128566,-0.128785,-0.210777,21
1429697546685,102,-0.141598,-0.139868,-0.220507,20
1429697546727,102,-0.138569,-0.125735,-0.19065,14
1429697546769,102,-0.120349,-0.0962165,-0.140255,18
1429697546781,102,-0.106206,-0.0787125,-0.111036,25
1429697546823,102,-0.0938645,-0.0755666,-0.101388,45
1429697546849,102,-0.0685264,-0.071929,-0.0932612,66
1429697546891,102,-0.032586,-0.058014,-0.0674056,75
1429697546933,102,0.00398592,-0.0320058,-0.0184232,70
1429697546949,102,0.0378487,0.0060499,0.047119,65
1429697546991,102,0.0551949,0.0394121,0.101858,56
1429697547020,102,0.0703599,0.0828207,0.166354,46
1429697547049,102,0.0635108,0.0929044,0.171669,40
1429697547091,102,0.0479107,0.0764845,0.135205,37
1429697547119,102,0.0194627,0.0383214,0.0685425,35
1429697547149,102,-0.0114979,-0.00656597,-0.0112508,33
1429697547191,102,-0.05104,-0.0615461,-0.095616,29
1429697547218,102,-0.072794,-0.0805809,-0.129502,25
1429697547249,102,-0.0628359,-0.0637126,-0.11727,20
1429697547291,102,-0.0394116,-0.0524445,-0.107274,17
1429697547319,102,0.0165955,0.00236878,-0.0280557,13
1429697547350,102,0.0926454,0.0912114,0.0991153,10
1429697547391,102,0.162908,0.222592,0.283152,18
1429697547417,102,0.194103,0.342774,0.44091,37
1429697547449,102,0.146504,0.396234,0.489636,59
1429697547491,102,0.0371378,0.312191,0.357588,72
1429697547518,102,-0.125566,0.072408,0.0230197,71
1429697547551,102,-0.242546,-0.245282,-0.391562,64
1429697547581,102,-0.262948,-0.488466,-0.677469,53
1429697547617,102,-0.166808,-0.584086,-0.74592,43
1429697547649,102,-0.0222761,-0.461202,-0.533079,38
1429697547691,102,0.167139,-0.199602,-0.139975,36
1429697547717,102,0.280808,0.0721782,0.228417,38
1429697547749,102,0.256921,0.217869,0.37444,39
1429697547791,102,0.226777,0.299853,0.434979,39
1429697547817,102,0.147888,0.279206,0.367337,37
1429697547849,102,0.0696271,0.220389,0.271784,35
1429697547891,102,-0.0308171,0.0843579,0.0924407,31
1429697547917,102,-0.122784,-0.057988,-0.0953612,28
1429697547949,102,-0.192047,-0.178926,-0.265812,28
1429697547981,102,-0.184029,-0.220376,-0.332901,36
1429697548017,102,-0.0683897,-0.122487,-0.193595,52
1429697548049,102,0.0542496,0.0177194,0.00668244,69
1429697548085,102,0.173827,0.178932,0.257363,78
1429697548118,102,0.194002,0.223855,0.344386,76
1429697548149,102,0.128938,0.182647,0.28944,70
1429697548181,102,-0.00766958,0.0434821,0.0816044,61
1429697548217,102,-0.116325,-0.072378,-0.102246,51
1429697548249,102,-0.170264,-0.133097,-0.208276,45
1429697548285,102,-0.142891,-0.104519,-0.176497,43
1429697548327,102,-0.0606727,-0.0289507,-0.0638292,44
1429697548349,102,0.0341982,0.0652826,0.0798469,44
1429697548391,102,0.0811091,0.113661,0.157621,42
1429697548433,102,0.0850459,0.115686,0.169094,37
1429697548474,102,0.0671584,0.0862796,0.132695,31
1429697548516,102,0.0289518,0.039086,0.0623644,24
1429697548558,102,-0.0216525,-0.0188177,-0.024083,32
1429697548599,102,-0.0723719,-0.0610123,-0.091255,63
1429697548641,102,-0.110924,-0.0844851,-0.133877,82
1429697548683,102,-0.136806,-0.102702,-0.159316,86
1429697548724,102,-0.113692,-0.0861596,-0.128121,80
1429697548766,102,-0.082882,-0.0786527,-0.103949,65
1429697548807,102,-0.0451855,-0.0683803,-0.0752402,57
1429697548849,102,-0.0168966,-0.0637395,-0.0594814,51
1429697548891,102,0.00412325,-0.0553415,-0.0496423,50
1429697548933,102,0.0038113,-0.0582048,-0.0670544,47
1429697548979,102,0.0201353,-0.0258939,-0.0356395,40
1429697548991,102,0.0343233,0.0104801,0.00170119,40
1429697549032,102,0.0520014,0.0433699,0.0455201,33
1429697549075,102,0.0590248,0.0562386,0.0657517,28
1429697549120,102,0.0566831,0.0461962,0.0601155,27
1429697549132,102,0.0441767,0.0243602,0.0360773,32
1429697549174,102,0.0394336,0.0178349,0.0280014,51
1429697549216,102,0.0114931,-0.00322393,-0.0101376,83
1429697549258,102,-0.0137294,-0.0199012,-0.0421035,90
1429697549299,102,-0.0287229,-0.0247241,-0.0551104,84
1429697549343,102,-0.0354787,-0.0316409,-0.0633753,75
1429697549356,102,-0.0290406,-0.0329359,-0.0513793,71
1429697549397,102,-0.0110348,-0.0156926,-0.0132632,59
1429697549439,102,0.0048761,0.00365049,0.0267627,55
1429697549481,102,0.0259466,0.037273,0.0777163,53
1429697549524,102,0.0404855,0.0665506,0.114792,51
1429697549565,102,0.0353952,0.0700514,0.112346,45
1429697549607,102,0.0127343,0.04684,0.0684237,40
1429697549649,102,-0.0257441,0.00115445,-0.00756647,33
1429697549695,102,-0.0666872,-0.050358,-0.0884994,28
1429697549707,102,-0.0830737,-0.0719832,-0.122077,27
1429697549748,102,-0.0593834,-0.0419886,-0.071913,39
1429697549790,102,-0.0040628,0.0193344,0.0298042,57
1429697549833,102,0.0624407,0.0913285,0.139913,81
1429697549875,102,0.0788917,0.101357,0.148833,83
1429697549917,102,0.0561239,0.0680913,0.0824691,75
1429697549958,102,-0.000102829,-0.00299322,-0.0353896,67
1429697550000,102,-0.04245,-0.0554102,-0.119017,53
1429697550042,102,-0.0569312,-0.0765572,-0.145113,45
1429697550084,102,-0.039349,-0.0613257,-0.105697,39
1429697550126,102,-0.00665366,-0.0297324,-0.0349675,35
1429697550168,102,0.0324513,0.0106082,0.0480397,26
1429697550209,102,0.0649487,0.0507547,0.117146,20
1429697550251,102,0.0884769,0.0858018,0.160411,12
1429697550293,102,0.0924226,0.101357,0.161917,8
1429697550335,102,0.0713902,0.0874471,0.115175,5
1429697550377,102,0.0327678,0.0467108,0.0413483,3
1429697550419,102,-0.0119882,-0.00870008,-0.0391742,3
1429697550460,102,-0.0504008,-0.0581612,-0.0976196,15
1429697550502,102,-0.079562,-0.0968876,-0.13879,50
1429697550544,102,-0.0869913,-0.105345,-0.143438,69
1429697550587,102,-0.0734237,-0.0868495,-0.11753,74
1429697550599,102,-0.0482868,-0.0532301,-0.0766603,74
1429697550642,102,-0.0221418,-0.0174168,-0.0272782,67
1429697550654,102,-0.00458607,-0.00283265,0.00355271,64
1429697550696,102,-0.00610004,-0.00641038,0.0084881,57
1429697550707,102,-0.0176421,-0.0208891,-0.00460437,54
1429697550749,102,-0.0172129,-0.0224956,-0.011122,48
1429697550761,102,-0.0110886,-0.0142368,-0.0141277,46
1429697550803,102,0.00593977,0.00442903,-0.00306537,44
1429697550814,102,0.0331003,0.0303949,0.0243649,44
1429697550856,102,0.0497016,0.0475829,0.0470996,40
1429697550868,102,0.0469423,0.0503485,0.0597642,38
1429697550910,102,0.0287491,0.0358942,0.0493621,32
1429697550922,102,0.00223587,0.0120235,0.0208823,29
1429697550963,102,-0.0183704,-0.00796515,-0.00534737,24
1429697551005,102,-0.0177313,-0.0149002,-0.0162565,17
1429697551016,102,-0.011565,-0.012569,-0.0186033,17
1429697551058,102,0.00354278,0.00550418,0.0045615,12
1429697551085,102,0.0192491,0.0272212,0.0328561,11
1429697551127,102,0.0335369,0.0515373,0.0656621,9
1429697551169,102,0.0436682,0.0637106,0.0850326,11
1429697551181,102,0.0449433,0.056726,0.0767391,11
1429697551222,102,0.0292328,0.0258136,0.0358028,38
1429697551248,102,0.0138481,-0.00205526,0.00012697,50
1429697551290,102,-0.0133274,-0.0365062,-0.0497199,76
1429697551317,102,-0.0490371,-0.0694643,-0.0954138,78
1429697551358,102,-0.0803326,-0.0882088,-0.121925,73
1429697551380,102,-0.0981289,-0.091313,-0.124359,69
1429697551422,102,-0.111789,-0.080741,-0.113016,56
1429697551448,102,-0.0854024,-0.0558852,-0.076991,52
1429697551490,102,-0.0912294,-0.03295,-0.0564564,44
1429697551518,102,-0.0662157,-0.00666117,-0.0159996,42
1429697551548,102,-0.0120201,0.0400034,0.0544536,40
1429697551590,102,0.0198911,0.0947636,0.131676,35
1429697551618,102,0.0599708,0.131977,0.191005,32
1429697551648,102,0.0863071,0.145583,0.212772,27
1429697551690,102,0.0837496,0.114982,0.172137,19
1429697551716,102,0.0639945,0.0637684,0.0946325,17
1429697551758,102,0.022729,0.0185814,0.0202022,14
1429697551780,102,-0.0354551,-0.0252645,-0.0607196,14
1429697551822,102,-0.0379383,-0.0440441,-0.0896818,13
1429697551848,102,-0.00179282,-0.0504542,-0.0859515,12
1429697551890,102,0.0546546,-0.0478598,-0.0632579,16
1429697551916,102,0.097129,-0.0474358,-0.0415124,23
1429697551958,102,0.100147,-0.0460758,-0.0309347,52
1429697551980,102,0.0357823,-0.0518569,-0.0557754,63
1429697552022,102,0.00946745,-0.0527177,-0.0633701,78
1429697552048,102,-0.00173545,-0.0531491,-0.0673737,78
1429697552090,102,0.0153334,-0.0580496,-0.0644985,70
1429697552116,102,0.0607664,-0.0596195,-0.0426055,67
1429697552158,102,0.0801247,-0.0461271,-0.0144772,55
1429697552180,102,0.0781214,-0.0311375,0.00460131,52
1429697552222,102,0.066731,-0.0112869,0.0241684,45
1429697552248,102,0.0163392,0.0162356,0.0368837,43
1429697552290,102,-0.0326221,0.0432956,0.046509,40
1429697552316,102,-0.0526059,0.0760386,0.076223,39
1429697552348,102,-0.0872195,0.0894507,0.0769073,34
1429697552380,102,-0.108829,0.0818933,0.0671468,30
1429697552416,102,-0.11495,0.0589998,0.0396248,25
1429697552448,102,-0.127159,0.0357553,0.00140752,21
1429697552484,102,-0.141439,0.00539354,-0.0548907,15
1429697552517,102,-0.0864528,-0.00144749,-0.0511281,9
1429697552548,102,-0.0158228,-0.00507582,-0.0366571,4
1429697552584,102,0.0688715,-0.00751962,-0.00785171,11
1429697552626,102,0.154011,-0.00970692,0.0224562,43
1429697552668,102,0.146004,-0.00605607,0.0349333,64
1429697552709,102,0.0702303,-0.0107674,0.0182724,73
1429697552751,102,-0.0301233,-0.0152208,-0.00456948,69
1429697552792,102,-0.100528,-0.0127309,-0.0216066,54
1429697552834,102,-0.0950955,-0.00977804,-0.0224102,42
1429697552876,102,-0.0355543,-0.000215731,0.000902162,34
1429697552920,102,0.0586911,0.0150949,0.0415791,37
1429697552931,102,0.162632,0.0213851,0.0785219,37
1429697552973,102,0.206292,0.00560715,0.0726529,37
1429697553015,102,0.182882,-0.0151734,0.0398416,35
1429697553057,102,0.095469,-0.0404002,-0.0187664,30
1429697553100,102,0.0116326,-0.0564427,-0.0676407,26
1429697553142,102,-0.0788703,-0.0588155,-0.0983081,18
1429697553184,102,-0.117683,-0.0392436,-0.0984118,16
1429697553225,102,-0.184854,-0.0105376,-0.0898917,35
1429697553267,102,-0.332939,0.00548087,-0.0998668,56
1429697553312,102,-0.495685,-0.0102073,-0.137389,74
1429697553324,102,-0.623363,-0.0425309,-0.178616,74
1429697553366,101,-0.631834,-0.0713524,-0.18071,69
1429697553408,101,-0.438128,-0.0688344,-0.124099,54
1429697553449,101,-0.0692189,-0.0197625,0.00981405,44
1429697553491,101,0.348838,0.0314704,0.129356,38
1429697553535,101,0.6765,0.0680539,0.198056,38
1429697553576,101,0.85536,0.100806,0.246331,39
1429697553618,101,0.846397,0.11286,0.251564,36
1429697553659,101,0.699999,0.104404,0.224936,28
1429697553701,101,0.479896,0.0634891,0.14738,23
1429697553744,101,0.254446,0.00504471,0.0432803,14
1429697553786,101,0.0890128,-0.0382575,-0.0321573,12
1429697553829,101,-0.0321689,-0.0559017,-0.0703928,33
1429697553871,101,-0.1023,-0.0335546,-0.0432122,58
1429697553912,101,-0.160903,0.00597205,0.00434216,82
1429697553954,101,-0.235579,0.0349922,0.0285163,83
1429697553996,101,-0.281567,0.0400417,0.0218815,74
1429697554038,101,-0.332099,0.0215595,-0.0266222,61
1429697554081,101,-0.329486,0.0130204,-0.0399814,53
1429697554123,101,-0.310886,-0.00361657,-0.058603,47
1429697554164,101,-0.2462,-0.00165162,-0.0281919,45
1429697554208,101,-0.164012,-0.0150739,-0.0173664,41
1429697554220,101,-0.115617,-0.0328168,-0.0304555,41
1429697554261,101,-0.0931497,-0.0554681,-0.0634982,35
1429697554303,101,-0.114002,-0.0856604,-0.131417,29
1429697554344,101,-0.120958,-0.0971887,-0.168335,21
1429697554386,101,-0.0879236,-0.0852294,-0.159524,16
1429697554427,101,-0.00614334,-0.0431024,-0.0924331,19
1429697554469,101,0.0904433,0.00744442,0.000854789,38
1429697554511,101,0.185793,0.0631177,0.106254,72
1429697554552,101,0.23054,0.0972822,0.16675,82
1429697554594,101,0.245315,0.116873,0.200892,79
1429697554605,100,0.194161,0.0990704,0.162632,79
1429697554647,100,0.117008,0.0675211,0.104518,67
1429697554660,100,0.029004,0.012623,0.0140577,63
1429697554703,100,-0.0212645,-0.0269933,-0.0403888,55
1429697554714,100,-0.00748967,-0.0312805,-0.0317835,51
1429697554756,100,0.033768,-0.017737,0.002112,47
1429697554768,100,0.0750426,-0.00198894,0.0321234,46
1429697554809,100,0.0885089,-0.00212096,0.0317852,42
1429697554852,100,0.0559487,-0.0251647,-0.0171784,39
1429697554894,100,-0.000468416,-0.0517536,-0.0792633,30
1429697554905,100,-0.0378727,-0.0592112,-0.113938,30
1429697554947,100,-0.0674777,-0.0508455,-0.122887,20
1429697554959,100,-0.0837812,-0.0267603,-0.0981312,18
1429697555001,100,-0.0740941,0.010128,-0.0387299,12
1429697555042,100,-0.054822,0.0422427,0.0258187,6
1429697555084,100,-0.0180139,0.0650473,0.0866154,10
1429697555096,100,0.00824696,0.0641194,0.11005,18
1429697555138,100,0.0194061,0.0469273,0.0969046,40
1429697555151,100,0.00886148,0.0177547,0.0538053,53
1429697555193,100,0.00306323,-0.00221065,0.019245,78
1429697555217,100,-0.00448964,-0.011098,-0.00542035,79
1429697555258,99,-0.0299651,-0.0208026,-0.0280023,73
1429697555284,99,-0.04899,-0.0274497,-0.0340274,69
1429697555325,99,-0.0795388,-0.0447074,-0.0546496,57
1429697555348,99,-0.0843633,-0.0448962,-0.0458206,54
1429697555389,99,-0.0567122,-0.0247428,-0.0116046,48
1429697555417,99,-0.0179252,4.13743e-05,0.0159236,47
1429697555460,99,0.0150126,0.0172575,0.0293979,47
1429697555484,99,0.0346289,0.0405598,0.0445166,46
1429697555526,99,0.0413528,0.0626527,0.0652705,41
1429697555548,99,0.0194614,0.0601886,0.0617706,40
1429697555590,99,-0.00465944,0.0316348,0.0306793,35
1429697555616,99,-0.0363469,-0.0345517,-0.0527907,29
1429697555648,99,-0.0343922,-0.0810156,-0.103235,25
1429697555689,99,-0.00728196,-0.0889452,-0.116063,22
1429697555716,99,0.0113142,-0.074963,-0.106561,19
1429697555748,99,0.0202638,-0.0559202,-0.0863549,28
1429697555789,99,-0.00497265,-0.0324979,-0.0645235,45
1429697555816,99,-0.0423464,-0.0265299,-0.0540712,66
1429697555848,99,-0.0783894,-0.0185239,-0.036854,76
1429697555885,99,-0.108938,-0.00903319,-0.0238815,76
1429697555916,98,-0.115533,-0.00468544,-0.0107187,70
1429697555948,98,-0.0769871,-0.000355213,0.0119158,61
1429697555985,98,0.00183221,0.00684742,0.0453502,52
1429697556015,98,0.0801974,0.00173145,0.0673152,44
1429697556048,98,0.159166,0.00581925,0.0919033,40
1429697556085,98,0.192131,0.0032985,0.0870266,38
1429697556116,98,0.199276,0.0207718,0.0976862,37
1429697556148,98,0.181208,0.0505704,0.114207,34
1429697556184,98,0.123152,0.0570145,0.0962661,29
1429697556215,98,0.0483668,0.0415662,0.0489816,23
1429697556247,98,-0.0318409,0.00402909,-0.029775,16
1429697556284,98,-0.0991274,-0.0350868,-0.104915,11
1429697556315,98,-0.146639,-0.0696657,-0.170822,8
1429697556347,98,-0.165097,-0.0782434,-0.194524,4
1429697556383,98,-0.173458,-0.0823298,-0.204015,1
1429697556415,98,-0.171037,-0.0748749,-0.192021,3
1429697556447,98,-0.14512,-0.0522008,-0.1475,20
1429697556484,98,-0.115377,-0.0338425,-0.105589,45
1429697556515,98,-0.059056,0.00119655,-0.0388762,69
1429697556547,98,-0.00597208,0.0238999,0.0141137,78
1429697556583,98,0.0416059,0.0487387,0.0709299,77
1429697556615,98,0.0681782,0.0542351,0.100441,70
1429697556647,98,0.0907019,0.0761258,0.147814,60
1429697556684,98,0.111512,0.0973486,0.190592,50
1429697556715,98,0.131602,0.12299,0.226929,43
1429697556747,98,0.131456,0.121857,0.216383,41
1429697556786,98,0.140643,0.130873,0.206326,40
1429697556815,98,0.129552,0.116439,0.161092,38
1429697556857,98,0.129329,0.113858,0.137223,33
1429697556898,98,0.103933,0.0834936,0.0871679,24
1429697556940,98,0.0588701,0.0303859,0.0201113,17
1429697556981,98,-0.0135711,-0.051071,-0.0742854,7
1429697557027,98,-0.0821257,-0.1308,-0.161887,0
1429697557039,98,-0.111253,-0.152656,-0.179752,0
1429697557080,98,-0.0674944,-0.0767456,-0.0800648,9
1429697557122,98,0.00844594,0.042134,0.0651444,31
1429697557164,98,0.0396787,0.10683,0.133461,66
1429697557205,98,0.0204469,0.0896418,0.100422,73
1429697557247,98,-0.0309002,0.0208271,0.0071734,67
1429697557288,98,-0.0994586,-0.0820706,-0.121592,58
1429697557330,98,-0.108347,-0.108139,-0.146826,44
1429697557371,98,-0.0988335,-0.102577,-0.126424,39
1429697557413,98,-0.0773614,-0.0764097,-0.0844612,36
1429697557455,98,-0.0948088,-0.104586,-0.112168,35
1429697557496,98,-0.0879607,-0.12176,-0.129997,30
1429697557538,98,-0.056526,-0.121605,-0.131051,25
1429697557580,98,0.0141894,-0.0779074,-0.0824789,18
1429697557621,98,0.0811243,-0.0203227,-0.0193603,13
1429697557663,98,0.117765,0.0247183,0.0275938,6
1429697557705,98,0.111349,0.0454411,0.0474092,4
1429697557751,98,0.0819543,0.0538681,0.0553286,24
1429697557762,98,0.0426043,0.0544181,0.0551266,36
1429697557804,98,0.0282037,0.0733591,0.0798792,62
1429697557846,98,0.0376455,0.102976,0.116664,79
1429697557888,97,0.0523249,0.122372,0.140747,76
1429697557929,97,0.0620952,0.127493,0.150246,63
1429697557971,97,0.051807,0.105912,0.126843,53
1429697558013,97,0.0333971,0.0771638,0.0945551,42
1429697558054,97,0.00800211,0.0408313,0.0540296,40
1429697558096,97,-0.0123821,0.0104989,0.023753,40
1429697558138,97,-0.0233801,-0.0104857,0.00831389,38
1429697558180,97,-0.0215174,-0.0144699,0.0142116,29
1429697558222,97,-0.0208318,-0.016925,0.0148972,22
1429697558263,97,-0.0192657,-0.0155351,0.0107397,17
1429697558304,97,-0.0340137,-0.0255465,-0.0185943,10
1429697558345,97,-0.0488391,-0.0371256,-0.0505351,6
1429697558387,97,-0.0638154,-0.0512448,-0.082699,21
1429697558428,97,-0.0672993,-0.0603096,-0.101232,45
1429697558470,97,-0.0551944,-0.057146,-0.0980594,78
1429697558511,97,-0.0417136,-0.0526412,-0.0923626,84
1429697558553,95,-0.0243787,-0.0407328,-0.0768986,77
1429697558594,95,-0.0113517,-0.0284964,-0.0593645,68
1429697558640,95,-0.0158076,-0.0351771,-0.0651189,54
1429697558652,95,-0.03361,-0.0577508,-0.0884929,51
1429697558697,95,-0.0520655,-0.0811878,-0.110105,47
1429697558709,95,-0.0640981,-0.0967987,-0.120599,46
1429697558751,95,-0.0550875,-0.0853159,-0.0986677,44
1429697558793,95,-0.0197484,-0.0411347,-0.0393601,40
1429697558836,95,0.0318759,0.0215594,0.0453053,33
1429697558848,95,0.0828243,0.0863761,0.132994,30
1429697558890,95,0.109217,0.119395,0.175331,24
1429697558932,95,0.10111,0.109051,0.157589,18
1429697558973,95,0.0728477,0.0744661,0.103806,15
1429697559015,95,0.0326713,0.0282222,0.0319955,11
1429697559058,95,0.00422045,-0.000732756,-0.0154877,16
1429697559101,95,-0.0141275,-0.0141376,-0.0392233,47
1429697559113,95,-0.01473,-0.00463561,-0.0301871,47
1429697559155,95,-0.00542885,0.0142481,-0.00713692,81
1429697559167,95,0.0119539,0.0364353,0.0187397,86
1429697559209,95,0.0234034,0.046279,0.0293466,87
1429697559251,95,0.0177719,0.0305312,0.0131047,79
1429697559262,95,0.0069885,0.00951666,-0.00560985,79
1429697559305,95,-0.00191858,-0.00955499,-0.0176239,66
1429697559317,95,-0.0216973,-0.0351278,-0.0362289,61
1429697559358,95,-0.0316176,-0.045563,-0.0403982,54
1429697559371,95,-0.0420741,-0.0536368,-0.0485195,52
1429697559412,95,-0.040208,-0.0466105,-0.0409915,50
1429697559454,95,-0.0219484,-0.020875,-0.0150375,46
1429697559465,95,0.00457435,0.0164049,0.0263182,44
1429697559508,95,0.0359077,0.0599404,0.0784906,40
1429697559520,95,0.0580718,0.0915181,0.119377,37
1429697559562,95,0.0613205,0.096852,0.128996,31
1429697559582,95,0.043292,0.0719808,0.102338,26
1429697559625,95,0.00964086,0.0243884,0.0428728,21
1429697559647,95,-0.0242188,-0.0257449,-0.0233334,19
1429697559689,95,-0.0493259,-0.0636469,-0.0758441,12
1429697559717,95,-0.0579491,-0.0799751,-0.101057,9
1429697559747,95,-0.0552987,-0.0794434,-0.101907,9
1429697559788,95,-0.04675,-0.0648903,-0.083216,29
1429697559815,95,-0.0376631,-0.0461686,-0.0595709,40
1429697559856,95,-0.0269919,-0.0257206,-0.0339669,76
1429697559884,95,-0.0129052,-0.00574714,-0.0100258,86
1429697559917,95,-0.00461172,-0.000648258,-0.00486932,86
1429697559947,95,0.00529577,-0.00439014,-0.00456296,82
1429697559989,95,0.00712576,-0.0180174,-0.0167836,70
1429697560015,95,-0.000679269,-0.0335877,-0.0350311,66
1429697560057,95,-0.00377128,-0.0347146,-0.039117,56
1429697560084,95,0.00183754,-0.0146367,-0.0208538,52
1429697560115,95,0.017399,0.016954,0.00979336,51
1429697560156,95,0.0315378,0.0420074,0.0370051,47
1429697560184,95,0.0406434,0.058748,0.0560151,42
1429697560215,95,0.0342155,0.0530838,0.0502561,40
1429697560256,95,0.0191503,0.0437025,0.0425761,28
1429697560285,95,0.0206043,0.0484431,0.0482281,20
1429697560315,95,0.0215289,0.0504691,0.0523943,18
1429697560357,95,0.0376657,0.0588723,0.0704429,12
1429697560385,95,0.0396934,0.0442657,0.0599101,11
1429697560415,95,0.0258174,0.0144009,0.0362953,8
1429697560456,95,-0.00674958,-0.0303322,-0.00637493,4
1429697560485,95,-0.0552616,-0.0864581,-0.0698471,8
1429697560515,95,-0.0925079,-0.122025,-0.113655,25
1429697560557,95,-0.110783,-0.133338,-0.135609,62
1429697560583,95,-0.113289,-0.123729,-0.141269,71
1429697560615,95,-0.113671,-0.109471,-0.137676,78
1429697560647,95,-0.0794218,-0.0721228,-0.0968214,75
1429697560683,95,-0.0515904,-0.0499259,-0.0682897,67
1429697560715,95,-0.0231506,-0.0288426,-0.0331209,57
1429697560747,95,0.000161068,-0.0130367,-0.00405335,47
1429697560783,95,-0.00185725,-0.0157933,-0.00191092,40
1429697560816,95,0.0180176,0.00651263,0.029386,37
1429697560847,95,0.0456163,0.0436305,0.0718539,33
1429697560883,95,0.0853179,0.103733,0.132972,28
1429697560914,95,0.107212,0.142318,0.164569,23
1429697560947,95,0.10183,0.139544,0.147911,18
1429697560983,95,0.0614733,0.0886127,0.0803812,14
1429697561024,95,0.0135825,0.0221355,0.00404456,7
1429697561066,95,-0.0247221,-0.0354852,-0.0577834,0
1429697561107,95,-0.0250314,-0.048825,-0.0649339,0
1429697561149,95,0.00394241,-0.0247588,-0.0312787,0
1429697561191,95,0.0519435,0.0267996,0.0296685,0
1429697561232,95,0.0827945,0.0659579,0.0710462,14
1429697561274,95,0.0857372,0.0755284,0.0760358,57
1429697561316,95,0.0690097,0.0584607,0.0521407,67
1429697561357,95,0.0448775,0.0321288,0.0237547,59
1429697561398,95,0.0309738,0.0191746,0.018921,49
1429697561440,95,0.0331046,0.0248289,0.038839,34
1429697561481,95,0.0245846,0.0273906,0.0505116,30
1429697561523,95,0.00685486,0.0256093,0.0510002,35
1429697561564,95,-0.0405713,-0.00605949,0.00658986,37
1429697561606,95,-0.0841827,-0.0419257,-0.0449449,33
1429697561647,95,-0.112735,-0.0722004,-0.0878657,27
1429697561689,95,-0.122385,-0.0927385,-0.116727,19
1429697561731,95,-0.0990381,-0.0848972,-0.10554,15
1429697561773,95,-0.0592935,-0.0609566,-0.0740031,8
1429697561814,95,-0.0161784,-0.0292393,-0.032621,5
1429697561856,95,0.0233743,0.00205299,0.00708187,27
1429697561898,95,0.0421215,0.0189424,0.026848,55
1429697561940,95,0.044269,0.0245709,0.029554,86
1429697561982,95,0.0362341,0.019551,0.0181359,88
1429697562023,94,0.0142566,0.00288887,-0.00754548,77
1429697562065,94,-0.009732,-0.0152023,-0.0329278,67
1429697562107,94,-0.0413415,-0.0383123,-0.0617447,55
1429697562148,94,-0.0513816,-0.0403307,-0.0585566,52
1429697562190,94,-0.0406322,-0.0303752,-0.0383497,52
1429697562232,94,-0.0132084,-0.00870996,-0.00176731,50
1429697562274,94,0.0337567,0.0287625,0.0532565,41
1429697562319,94,0.0728298,0.0625411,0.0984284,35
1429697562331,94,0.0954364,0.0881668,0.129975,31
1429697562373,94,0.0906301,0.0899773,0.127275,21
1429697562415,94,0.0638012,0.0667252,0.0919405,15
1429697562456,94,0.038067,0.035436,0.0461235,13
1429697562498,94,0.0265332,0.0146439,0.0163103,29
1429697562540,94,0.00387676,-0.0150899,-0.0274211,69
1429697562583,94,-0.0131866,-0.0328184,-0.0572754,86
1429697562624,94,-0.034503,-0.0450629,-0.0810599,89
1429697562666,93,-0.0420769,-0.0433216,-0.0823002,83
1429697562709,93,-0.0302805,-0.0218973,-0.0504656,70
1429697562720,93,-0.0278067,-0.0144327,-0.031923,70
1429697562762,93,-0.0272045,-0.0132439,-0.0190104,57
1429697562804,93,-0.0325918,-0.0231528,-0.020762,52
1429697562846,93,-0.0195187,-0.0168036,-0.00321507,49
1429697562888,93,-0.00654948,-0.0094306,0.0107674,45
1429697562929,93,-0.0354941,-0.0355749,-0.02917,37
1429697562971,93,-0.0543472,-0.0502826,-0.0579061,29
1429697563013,93,-0.0721052,-0.0635513,-0.0873994,21
1429697563055,93,-0.090824,-0.0787025,-0.11705,13
1429697563097,93,-0.0601638,-0.0501254,-0.0824965,8
1429697563138,93,-0.0278567,-0.021217,-0.0408139,4
1429697563180,93,0.0447881,0.0432083,0.0520748,26
1429697563221,93,0.0812342,0.0766764,0.102109,53
1429697563263,93,0.103329,0.0973689,0.131723,86
1429697563275,93,0.144328,0.135985,0.181695,89
1429697563317,93,0.190222,0.176048,0.232801,88
1429697563329,93,0.196862,0.181371,0.238038,86
1429697563371,92,0.137058,0.124469,0.164668,78
1429697563382,92,-0.0365232,-0.0320133,-0.039306,74
1429697563424,92,-0.176385,-0.158082,-0.201415,59
1429697563436,92,-0.250365,-0.223898,-0.283671,59
1429697563477,92,-0.252191,-0.224658,-0.283189,50
1429697563519,92,-0.17554,-0.153273,-0.190451,48
1429697563531,92,-0.0471635,-0.0394763,-0.0432264,48
1429697563572,92,0.10321,0.0913024,0.125626,46
1429697563584,92,0.214868,0.188433,0.250181,44
1429697563626,92,0.295065,0.258071,0.339815,36
1429697563646,92,0.244194,0.214893,0.279339,33
1429697563688,92,0.140962,0.125313,0.157688,28
1429697563714,92,-0.0453635,-0.0407974,-0.0652831,24
1429697563756,92,-0.204321,-0.185236,-0.258578,20
1429697563783,92,-0.297322,-0.27042,-0.371876,16
1429697563824,92,-0.257891,-0.2359,-0.3239,13
1429697563846,92,-0.135015,-0.120675,-0.168162,16
1429697563889,92,0.00912538,0.0146464,0.0143922,34
1429697563914,92,0.121098,0.119535,0.156917,59
1429697563956,92,0.168188,0.162517,0.215305,80
1429697563984,92,0.161574,0.150151,0.201655,87
1429697564014,92,0.0927963,0.0796252,0.112358,84
1429697564046,92,0.0137302,0.00107195,0.0129341,76
1429697564084,92,-0.0600051,-0.0638241,-0.0692672,66
1429697564115,92,-0.121736,-0.113552,-0.132413,56
1429697564146,92,-0.152615,-0.131685,-0.157669,49
1429697564188,92,-0.140632,-0.112652,-0.135587,45
1429697564214,92,-0.125413,-0.0962888,-0.118586,43
1429697564246,92,-0.0899244,-0.0618855,-0.0809755,40
1429697564289,92,-0.0326185,-0.00958765,-0.0203416,35
1429697564314,92,0.0420605,0.0555003,0.0589997,28
1429697564356,92,0.105859,0.107347,0.123969,22
1429697564383,92,0.153514,0.141363,0.168535,16
1429697564414,92,0.139588,0.12137,0.143556,12
1429697564456,92,0.115586,0.0944708,0.110881,8
1429697564482,92,0.0891199,0.0692145,0.0820036,4
1429697564514,92,0.0710462,0.0521003,0.0651023,1
1429697564546,92,0.0590194,0.0419566,0.0560969,4
1429697564583,92,0.0330533,0.0219773,0.0322628,21
1429697564614,92,0.0148571,0.00993999,0.0167762,47
1429697564646,92,-0.00622578,-0.00517683,-0.00348793,70
1429697564682,92,-0.0246885,-0.0182791,-0.0195034,78
1429697564714,92,-0.044939,-0.0365361,-0.0379715,77
1429697564746,91,-0.0749,-0.0654768,-0.0685247,70
1429697564782,91,-0.110152,-0.102579,-0.110478,61
1429697564814,91,-0.119508,-0.11962,-0.12978,51
1429697564846,91,-0.0921228,-0.103784,-0.113565,44
1429697564882,91,-0.0264832,-0.0534782,-0.0578174,42
1429697564914,91,0.033877,-0.000520886,0.000443766,43
1429697564946,91,0.071981,0.0416548,0.0457093,42
1429697564982,91,0.0521824,0.040187,0.0376391,40
1429697565014,91,0.014799,0.0251457,0.0169019,35
1429697565046,91,-0.0298473,-0.00359727,-0.0197899,29
1429697565083,91,-0.0630821,-0.0261195,-0.0498474,24
1429697565114,91,-0.0731251,-0.0362672,-0.0627012,20
1429697565146,91,-0.0690203,-0.036875,-0.0643779,17
1429697565183,91,-0.050069,-0.0298256,-0.0539344,8
1429697565214,91,-0.0293001,-0.0206576,-0.037829,1
1429697565256,91,-0.00252705,-0.00920073,-0.0189107,7
1429697565298,91,0.0211918,0.00128335,-0.00197655,38
1429697565340,91,0.0388026,0.0139127,0.0162281,58
1429697565382,91,0.0524931,0.0295481,0.036066,64
1429697565423,90,0.055196,0.0429103,0.0539553,59
1429697565465,90,0.0564801,0.0544879,0.0744165,46
1429697565509,90,0.0527003,0.0542124,0.0805899,34
1429697565522,90,0.0435641,0.0469898,0.0774515,34
1429697565571,90,0.0387485,0.0399474,0.0700282,30
1429697565585,90,0.0417523,0.0410489,0.0666534,30
1429697565627,90,0.0498606,0.0433402,0.0633394,29
1429697565668,90,0.05198,0.0417536,0.056026,24
1429697565713,90,0.0314602,0.0177994,0.0238299,12
1429697565726,90,-0.00797323,-0.0192698,-0.0206584,12
1429697565769,90,-0.051693,-0.0538029,-0.0620672,3
1429697565815,90,-0.0768773,-0.0666695,-0.0793169,0
1429697565827,90,-0.0819662,-0.0643965,-0.0795255,0
1429697565869,90,-0.0470838,-0.0295022,-0.0415649,0
1429697565911,90,0.00536689,0.0149217,0.00808629,7
1429697565952,90,0.0515366,0.0480555,0.04725,31
1429697565997,90,0.0664385,0.0585366,0.0606045,71
1429697566040,90,0.0582276,0.0483674,0.0504802,80
1429697566054,90,0.0185111,0.014885,0.0134885,81
1429697566096,90,-0.0186968,-0.0158478,-0.0199839,73
1429697566139,90,-0.0616821,-0.051543,-0.0579795,64
1429697566151,90,-0.0861629,-0.0716527,-0.0745724,59
1429697566194,90,-0.0896871,-0.0788009,-0.0759542,49
1429697566236,90,-0.0903447,-0.0853538,-0.078099,42
1429697566277,90,-0.0862122,-0.0856951,-0.0754302,40
1429697566319,90,-0.0680876,-0.0709223,-0.0594273,36
1429697566361,90,-0.0330675,-0.0376713,-0.0290581,26
1429697566403,90,0.00846962,0.00234292,0.00604363,20
1429697566444,90,0.0354503,0.0279999,0.0233901,14
1429697566486,90,0.0498179,0.0394954,0.0285724,11
1429697566528,90,0.0378709,0.0285338,0.0116178,9
1429697566570,90,0.0133385,0.00771223,-0.0135111,16
1429697566611,90,-0.00191401,0.00130104,-0.0217645,49
1429697566653,90,-0.00961775,0.00165177,-0.0228494,77
1429697566695,90,0.00507737,0.0217156,-0.00103709,98
1429697566737,90,0.0321654,0.0473761,0.0282982,97
1429697566779,89,0.0506599,0.0577973,0.0443772,63
1429697566821,89,0.0545391,0.0500068,0.0470012,59
1429697566862,89,0.0445897,0.0324588,0.0406725,52
1429697566904,89,0.0184566,0.00626161,0.0277883,49
1429697566945,89,0.00589259,-0.00223302,0.0313738,47
1429697566988,89,-0.012354,-0.0119074,0.0270636,46
1429697567000,89,-0.00944959,-0.00323381,0.0344746,44
1429697567043,89,0.000890572,0.0127492,0.0418745,40
1429697567054,89,0.00906968,0.0229278,0.040078,39
1429697567096,89,0.0186313,0.0257742,0.0314408,34
1429697567138,89,0.0280429,0.0269059,0.0232679,31
1429697567150,89,0.0297743,0.0243715,0.0139121,30
1429697567192,89,0.0236198,0.0223589,0.00643886,28
1429697567234,89,0.00174223,0.0100159,-0.00868277,27
1429697567245,89,-0.0162844,-0.00393393,-0.022089,27
1429697567287,89,-0.0255314,-0.0188036,-0.0356114,33
1429697567335,89,-0.0191178,-0.0256947,-0.0402191,50
1429697567348,89,0.000215802,-0.0199493,-0.0313405,56
1429697567389,89,0.0149277,-0.0111209,-0.0211866,63
1429697567431,89,0.010608,-0.011832,-0.0185403,63
1429697567473,89,-0.00551924,-0.0158595,-0.0184551,59
1429697567514,89,-0.0195633,-0.0225669,-0.0183153,50
1429697567556,89,-0.0208891,-0.0259166,-0.0132585,45
1429697567597,89,-0.0048162,-0.0125633,0.00610222,43
1429697567609,89,0.0233361,0.0124278,0.0331781,43
1429697567651,89,0.0389677,0.0306311,0.0479528,43
1429697567662,89,0.0265958,0.0247616,0.0333114,43
1429697567704,89,-0.00888328,-0.00184953,-0.00464305,40
1429697567716,89,-0.0500946,-0.0360744,-0.0473456,38
1429697567757,89,-0.0729845,-0.0539466,-0.0686354,34
1429697567799,89,-0.0630326,-0.04458,-0.0572327,31
1429697567811,89,-0.0279307,-0.0157804,-0.0233706,31
1429697567852,89,0.0224018,0.0249154,0.0239245,31
1429697567864,89,0.0522518,0.0513323,0.0520231,31
1429697567905,89,0.0507661,0.0541921,0.0525334,30
1429697567947,89,0.0341267,0.0463289,0.0414365,28
1429697567958,89,0.00841496,0.028114,0.0194759,28
1429697568000,89,-0.00371131,0.0123657,0.00294853,38
1429697568014,89,-0.0027107,0.000396834,-0.00604267,38
1429697568056,89,0.00342315,-0.00922565,-0.0117794,55
1429697568082,89,0.0153141,-0.013964,-0.0104001,59
1429697568123,89,0.0135889,-0.0216433,-0.0121387,62
1429697568146,89,-0.00203321,-0.0277473,-0.0140734,61
1429697568187,88,-0.0229464,-0.0313647,-0.0150778,56
1429697568213,88,-0.0453435,-0.0316592,-0.0158929,54
1429697568255,88,-0.0531972,-0.0207528,-0.00757467,42
1429697568398,88,-0.0446991,-0.00918784,0.00121999,42
1429697568440,88,-0.0222782,0.000363156,0.00779623,37
1429697568483,88,-0.00546036,-0.0022817,0.000102119,36
1429697568525,88,-0.00481961,-0.0155716,-0.0193232,34
1429697568537,88,-0.011045,-0.0213177,-0.0315075,32
1429697568578,88,-0.0146469,-0.0191769,-0.0320783,29
1429697568590,88,-0.0125245,-0.0053237,-0.0203224,27
1429697568632,88,-0.000398077,0.0143888,-0.000812409,24
1429697568645,88,0.00789667,0.0195103,0.000302272,24
1429697568687,88,-0.00620172,-0.00719055,-0.0341383,32
1429697568699,88,-0.0327557,-0.0500609,-0.0870139,32
1429697568742,88,-0.042465,-0.0749594,-0.116995,50
1429697568754,88,-0.035463,-0.0758589,-0.114742,55
1429697568796,88,0.00129787,-0.0335086,-0.0562686,60
1429697568813,88,0.0330567,0.00789473,0.00571675,61
1429697568856,88,0.0460374,0.0376579,0.0574137,38
1429697569387,88,0.0499583,0.0488514,0.0853857,43
1429697569428,88,0.0529592,0.0531716,0.0987114,53
1429697569440,88,0.06806,0.0660334,0.114842,56
1429697569482,88,0.0779871,0.0797253,0.123883,58
1429697569494,88,0.0682095,0.0774693,0.111468,57
1429697569536,88,0.0459898,0.0702998,0.0926234,52
1429697569578,88,0.0334591,0.0739524,0.0914058,47
1429697569625,88,0.036342,0.0889901,0.109556,41
1429697569641,88,0.056649,0.109648,0.138428,40
1429697569656,88,0.0684513,0.112786,0.145747,40
1429697569698,88,0.0507637,0.0770118,0.104523,39
1429697569740,88,0.0146527,0.0194248,0.0301972,38
1429697569781,88,-0.0304823,-0.0463465,-0.0588927,35
1429697569823,88,-0.082035,-0.108167,-0.144242,31
1429697569865,88,-0.123978,-0.152382,-0.202687,29
1429697569906,88,-0.144002,-0.166661,-0.221286,27
1429697569948,88,-0.132831,-0.148902,-0.195058,26
1429697569990,88,-0.0874544,-0.0961132,-0.124774,34
1429697570032,88,-0.00332474,-0.0103482,-0.0164764,45
1429697570074,88,0.076189,0.0672046,0.0777495,59
1429697570116,88,0.131671,0.120431,0.13725,61
1429697570158,89,0.140594,0.129045,0.141825,58
1429697570199,89,0.110322,0.100679,0.106713,54
1429697570241,89,0.046993,0.0401977,0.039792,46
1429697570282,89,-0.0152813,-0.0197124,-0.0206739,42
1429697570324,89,-0.0611432,-0.0667669,-0.0659815,40
1429697570366,89,-0.0652784,-0.0758666,-0.0721611,39
1429697570407,89,-0.0448619,-0.0613048,-0.0567856,35
1429697570449,89,-0.0199842,-0.0377281,-0.0375251,31
1429697570491,89,0.00179931,-0.0119464,-0.0169005,26
1429697570533,89,0.002549,-0.00413398,-0.015323,22
1429697570575,89,-0.00396434,-0.00589459,-0.0249191,17
1429697570617,89,-0.0157454,-0.00943991,-0.0310788,14
1429697570658,89,-0.0153832,-0.00710538,-0.0265808,18
1429697570704,89,-0.0192282,-0.00786637,-0.0207735,38
1429697570716,89,-0.0434666,-0.0290067,-0.0401421,38
1429697570758,89,-0.0504559,-0.032504,-0.0397976,56
1429697570799,89,-0.0443684,-0.0233882,-0.0284922,59
1429697570845,89,-0.0334526,-0.00777867,-0.0119156,57
1429697570857,89,-0.00377366,0.0247293,0.0272145,55
1429697570899,89,0.0178388,0.0401494,0.0486532,51
1429697570944,89,0.023644,0.0365377,0.0512027,44
1429697570955,89,0.0193302,0.0195461,0.0407139,43
1429697571000,89,0.0169365,0.00420046,0.0327124,41
1429697571013,89,0.0176537,-0.0038794,0.0265375,40
1429697571056,89,0.0228499,0.00440616,0.0335046,38
1429697571069,89,0.0222472,0.0119679,0.0353036,38
1429697571110,89,0.0289583,0.0286786,0.045549,34
1429697571152,89,0.00879248,0.0189057,0.0216853,32
1429697571198,89,0.00404257,0.0139482,0.00556762,27
1429697571212,89,-0.00644182,-0.00323087,-0.0226577,26
1429697571258,89,-0.016123,-0.0199328,-0.0408716,24
1429697571270,89,-0.0145252,-0.0229707,-0.0396123,24
1429697571312,89,0.00621345,-0.00796874,-0.0217472,23
1429697571355,89,0.0274754,0.0135597,-0.0052148,23
1429697571397,89,0.0410412,0.0309159,0.0014539,30
1429697571438,89,0.0441336,0.0383366,0.00093383,50
1429697571480,89,0.0355499,0.0337253,-0.00397877,62
1429697571522,89,0.020345,0.0213624,-0.00684192,66
1429697571566,89,0.00483616,0.00518047,-0.00379422,64
1429697571577,89,-0.0141855,-0.0190268,-0.0084638,62
1429697571619,89,-0.0308576,-0.0423674,-0.014102,57
1429697571661,89,-0.0487611,-0.0652402,-0.0262302,50
1429697571703,89,-0.0676694,-0.08048,-0.0379671,47
1429697571715,89,-0.071101,-0.075047,-0.0330334,46
1429697571757,89,-0.0607938,-0.0548243,-0.0192945,44
1429697571770,89,-0.0452901,-0.0359564,-0.0101288,44
1429697571812,89,-0.0459283,-0.0395425,-0.0253055,41
1429697571853,89,-0.0435243,-0.0391233,-0.0302869,39
1429697571895,89,-0.0624004,-0.0590267,-0.0601835,35
1429697571937,89,-0.064749,-0.0587307,-0.0731037,32
1429697571979,89,-0.0384371,-0.0312498,-0.0680179,29
1429697572022,89,0.00500546,0.0143699,-0.0408589,27
1429697572064,89,0.0478455,0.0621264,-0.000578235,25
1429697572106,89,0.0819569,0.102232,0.0476425,34
1429697572118,89,0.0966179,0.125386,0.0958861,34
1429697572160,89,0.101579,0.130002,0.128668,52
1429697572201,89,0.0915688,0.111151,0.133324,59
1429697572243,89,0.0580417,0.0539756,0.0826718,60
1429697572285,89,-0.00158743,-0.029845,-0.00807739,56
1429697572327,89,-0.03763,-0.0762898,-0.0637712,47
1429697572369,89,-0.0556553,-0.0921711,-0.0853499,42
1429697572382,89,-0.0318427,-0.0490797,-0.0359129,40
1429697572423,89,-0.0146537,-0.0161005,0.00890388,41
1429697572466,89,0.00953437,0.0196333,0.054572,41
1429697572478,89,0.0322251,0.0429225,0.0821025,40
1429697572520,89,0.0568985,0.060419,0.0961069,38
1429697572532,89,0.107371,0.105011,0.131363,37
1429697572574,89,0.112599,0.103854,0.115555,32
1429697572615,89,0.0795987,0.0685748,0.0607216,30
1429697572627,89,0.012084,0.0040982,-0.0210055,28
1429697572669,89,-0.0567811,-0.05459,-0.0870141,26
1429697572711,89,-0.094595,-0.0848297,-0.116508,23
1429697572722,89,-0.0854087,-0.0732878,-0.0990772,23
1429697572764,89,-0.0532952,-0.0445992,-0.0617438,28
1429697572777,89,-0.0069576,-0.00200392,-0.0176964,33
1429697572820,89,0.027039,0.0323562,0.0158966,45
1429697572834,89,0.0265835,0.0375474,0.0187486,51
1429697572845,89,-0.0035955,0.00980531,-0.00971938,55
1429697572887,89,-0.0612248,-0.0491733,-0.0679663,58
1429697572913,89,-0.127629,-0.128535,-0.140399,55
1429697572955,89,-0.155747,-0.171712,-0.169601,51
1429697572981,89,-0.156007,-0.17952,-0.161498,45
1429697573016,89,-0.0897817,-0.115061,-0.0776617,40
1429697573045,89,-0.0392501,-0.0573159,-0.00575809,37
1429697573087,89,-0.0225014,-0.0255936,0.032853,37
1429697573113,89,-0.0245779,-0.0183728,0.0348774,39
1429697573154,89,-0.0447645,-0.0352086,0.00348417,38
1429697573181,89,-0.0225758,-0.0177259,0.00319229,35
1429697573213,89,0.0361343,0.0276179,0.0286295,29
1429697573256,89,0.0984957,0.082716,0.0673688,23
1429697573281,89,0.128174,0.117058,0.0910002,16
1429697573312,89,0.124675,0.130494,0.0969195,12
1429697573354,89,0.0880302,0.113902,0.0780836,8
1429697573381,89,0.0458257,0.0762729,0.0396742,3
1429697573422,89,0.0389338,0.051821,0.0166214,3
1429697573444,89,0.0311224,0.0232174,-0.00733919,17
1429697573486,89,0.0649708,0.0371831,0.0145759,38
1429697573513,89,0.0835353,0.0522169,0.0391379,57
1429697573555,89,0.0824316,0.0611441,0.0613329,63
1429697573581,89,0.0843699,0.0739934,0.087533,63
1429697573613,89,0.0308147,0.0352437,0.0580519,60
1429697573645,89,0.000592514,0.0161764,0.0484262,56
1429697573681,89,-0.0297587,-0.00863209,0.0269343,50
1429697573713,89,-0.0608517,-0.0360999,-0.00415108,45
1429697573754,89,-0.0958185,-0.0665816,-0.0437301,43
1429697573796,89,-0.150276,-0.123965,-0.116481,42
1429697573838,89,-0.196295,-0.172107,-0.17892,40
1429697573885,89,-0.200575,-0.178901,-0.19437,38
1429697573897,89,-0.147523,-0.130007,-0.149217,37
1429697573942,89,-0.0763098,-0.060254,-0.0789463,32
1429697573954,89,-0.0115427,0.00515839,-0.0121904,32
1429697573995,89,0.02828,0.0411727,0.0224872,28
1429697574037,89,0.042751,0.0509091,0.0328334,24
1429697574078,89,0.0593254,0.0569076,0.0433313,25
1429697574120,89,0.0816147,0.066769,0.0604992,35
1429697574161,89,0.114312,0.0893528,0.0923925,54
1429697574203,89,0.132472,0.105598,0.116236,60
1429697574249,89,0.126329,0.102368,0.117423,59
1429697574261,89,0.0806728,0.0630656,0.0798479,57
1429697574303,89,0.0179992,0.00504001,0.0240129,51
1429697574345,89,-0.0326503,-0.0504862,-0.0299633,42
1429697574387,89,-0.0513838,-0.0730496,-0.0502471,38
1429697574428,89,-0.0301093,-0.0541945,-0.0315706,35
1429697574470,89,0.0193865,-0.00210185,0.0151056,34
1429697574513,89,0.0545128,0.0453428,0.0527665,31
1429697574554,89,0.0693756,0.0715272,0.0683606,28
1429697574597,89,0.0617471,0.0765003,0.0652535,22
1429697574641,89,0.0408954,0.0604016,0.0469179,18
1429697574653,89,0.0178472,0.0359138,0.0232583,16
1429697574694,89,0.00577556,0.0191952,0.00767957,12
1429697574737,89,0.00346998,0.0101728,-0.00166142,13
1429697574778,89,0.0029515,0.00554153,-0.00861466,32
1429697574820,89,0.0089414,0.0113122,-0.00281079,48
1429697574862,89,-0.0101525,-0.00245718,-0.0159745,62
1429697574904,89,-0.0307601,-0.0165164,-0.0275757,62
1429697574947,89,-0.048252,-0.0351954,-0.0413663,57
1429697574989,89,-0.057348,-0.0498199,-0.0507005,51
1429697575030,89,-0.0775074,-0.0824034,-0.0784529,43
1429697575072,89,-0.0946859,-0.110251,-0.101732,41
1429697575114,89,-0.0886387,-0.108192,-0.0962126,41
1429697575155,89,-0.0670471,-0.0805027,-0.066916,40
1429697575198,89,-0.0304038,-0.0346131,-0.023804,38
1429697575240,89,0.00940966,0.0155572,0.0206586,35
1429697575282,89,0.041358,0.0567161,0.0559535,30
1429697575324,89,0.0618362,0.0808559,0.0756195,27
1429697575366,89,0.0656303,0.0806135,0.0757254,26
1429697575408,89,0.0615668,0.0657765,0.06497,36
1429697575450,89,0.0554259,0.0459735,0.0472964,57
1429697575491,89,0.046255,0.0287502,0.0295792,66
1429697575540,90,0.0549402,0.0314335,0.0277066,65
1429697575552,90,0.0737912,0.0527118,0.0446461,63
1429697575594,90,0.101628,0.0860264,0.0785751,57
1429697575636,90,0.117615,0.107763,0.104803,47
1429697575678,90,0.113253,0.107515,0.113449,42
1429697575720,90,0.0868622,0.0821446,0.0957347,41
1429697575732,90,0.0411827,0.0359794,0.0523208,41
1429697575774,90,-0.0284559,-0.0321557,-0.0201059,41
1429697575816,90,-0.0905293,-0.0914972,-0.086257,39
1429697575858,90,-0.140925,-0.138752,-0.141842,36
1429697575900,90,-0.164172,-0.158412,-0.16725,32
1429697575942,90,-0.142688,-0.136287,-0.148419,30
1429697575983,90,-0.0904293,-0.0813626,-0.0910081,27
1429697576026,90,-0.0326619,-0.0192172,-0.0245162,27
1429697576067,90,0.00865053,0.0253014,0.0220635,40
1429697576109,90,0.0141576,0.031397,0.0294137,55
1429697576150,90,0.00942067,0.0243342,0.0223002,71
1429697576193,90,-0.0032386,0.00761977,0.00426976,72
1429697576204,90,0.000199807,0.00700245,-0.00146841,71
1429697576246,90,0.021398,0.0246445,0.00860856,66
1429697576287,90,0.0298939,0.0312116,0.0085851,56
1429697576329,90,0.0263614,0.0229797,-0.00581206,50
1429697576371,90,0.00646949,-0.00165892,-0.0332237,46
1429697576413,90,-0.0153551,-0.0239706,-0.0525936,46
1429697576454,90,-0.022725,-0.0291767,-0.048409,46
1429697576496,90,-0.0149412,-0.0161568,-0.0220017,43
1429697576537,90,0.00199305,0.00875973,0.0193446,39
1429697576580,90,0.0129743,0.0234868,0.0466883,36
1429697576592,90,0.0221631,0.0335464,0.0681928,34
1429697576634,90,0.0251904,0.0327756,0.0694408,28
1429697576675,90,-0.00127203,-0.00694885,0.020169,24
1429697576717,90,-0.0271551,-0.0442914,-0.0281248,31
1429697576729,90,-0.0655684,-0.0931335,-0.0894919,31
1429697576770,90,-0.0815339,-0.112867,-0.116299,50
1429697576782,90,-0.0513453,-0.0762787,-0.0783424,57
1429697576825,90,0.00151694,-0.012374,-0.00974525,65
1429697576837,90,0.0496757,0.0520751,0.0593616,66
1429697576878,90,0.0654776,0.0789074,0.0860309,65
1429697576891,90,0.056073,0.0670161,0.0688971,64
1429697576933,90,0.0150489,0.0197781,0.0163787,57
1429697576944,90,-0.024184,-0.0229683,-0.0301163,57
1429697576986,90,-0.0340477,-0.027914,-0.0324932,49
1429697577012,90,-0.00952065,0.00936954,0.015023,47
1429697577053,90,0.0341659,0.0673713,0.0809203,45
1429697577095,90,0.066765,0.102526,0.120216,44
1429697577112,90,0.068769,0.0930665,0.107919,43
1429697577154,90,0.0385785,0.0411831,0.0443031,39
1429697577180,90,-0.00281187,-0.0229821,-0.0339848,37
1429697577221,90,-0.0289579,-0.0564031,-0.0780365,33
1429697577244,90,-0.0304407,-0.0533878,-0.0805574,33
1429697577286,90,-0.0110086,-0.0189225,-0.0429124,31
1429697577312,90,-0.000254148,0.00575111,-0.0104349,30
1429697577354,90,-0.00274087,0.00421852,-0.00458891,28
1429697577380,90,-0.0261458,-0.0267342,-0.0317616,28
1429697577421,90,-0.0376645,-0.0476168,-0.0512973,39
1429697577444,90,-0.0435645,-0.0634406,-0.070521,45
1429697577486,90,-0.0225228,-0.0365377,-0.0411281,64
1429697577512,90,0.00147814,-0.00159964,0.00108944,67
1429697577554,90,0.0218015,0.0363642,0.0498011,68
1429697577581,90,0.00438179,0.0364121,0.0574953,67
1429697577612,90,-0.0468782,-0.00726934,0.0148072,62
1429697577645,90,-0.0885952,-0.0529915,-0.0364921,55
1429697577680,90,-0.112565,-0.0838635,-0.0754911,48
1429697577712,90,-0.10057,-0.0850779,-0.0824089,44
1429697577744,90,-0.0726718,-0.0730318,-0.0768897,42
1429697577780,90,-0.0234553,-0.0381034,-0.043023,40
1429697577815,90,0.0269091,-0.00118981,-0.00363384,36
1429697577844,90,0.0735789,0.0378539,0.0385155,30
1429697577881,90,0.114958,0.0812386,0.0877002,24
1429697577912,90,0.130742,0.101423,0.111493,21
1429697577944,90,0.128265,0.102397,0.110904,19
1429697577986,90,0.101236,0.0767853,0.0803166,16
1429697578027,90,0.0675136,0.0472152,0.0452495,14
1429697578069,90,0.0278708,0.0190329,0.00907012,21
1429697578110,90,0.00751532,0.0180201,0.00548095,36
1429697578152,90,-0.00995999,0.0241042,0.0119526,54
1429697578194,90,-0.0252609,0.0245311,0.0141488,57
1429697578235,91,-0.0410753,0.0138236,0.0091787,52
1429697578277,91,-0.0509195,-0.0121339,-0.0114753,46
1429697578320,91,-0.0452617,-0.0358104,-0.0312784,38
1429697578332,91,-0.0389409,-0.0597412,-0.0516532,38
1429697578373,91,-0.0335219,-0.0709503,-0.0646937,35
1429697578415,91,-0.0445913,-0.079506,-0.0806911,36
1429697578457,91,-0.0502037,-0.0699605,-0.0766588,35
1429697578500,91,-0.0571057,-0.0576483,-0.070544,33
1429697578543,91,-0.0722433,-0.0580231,-0.0758904,28
1429697578586,91,-0.0824329,-0.0535705,-0.0750844,24
1429697578599,91,-0.0880594,-0.0477733,-0.0699896,24
1429697578645,91,-0.0499847,-0.0147592,-0.0246625,20
1429697578660,91,-0.00921119,0.0225133,0.0251136,20
1429697578672,91,0.0459005,0.0591942,0.0780363,22
1429697578714,91,0.0864216,0.0798542,0.107958,33
1429697578755,91,0.114356,0.0812632,0.114674,54
1429697578798,91,0.100006,0.0430191,0.0765515,60
1429697578839,91,0.0629902,-0.00787074,0.0228792,59
1429697578881,92,0.0103002,-0.0559414,-0.0279688,54
1429697578923,92,-0.0448717,-0.0827467,-0.0595765,45
1429697578964,92,-0.075041,-0.0832121,-0.0698347,41
1429697579006,92,-0.078371,-0.0629824,-0.059563,40
1429697579048,92,-0.056615,-0.0334645,-0.0414543,40
1429697579090,92,-0.0217699,-0.00252995,-0.0213622,37
1429697579132,92,0.0141816,0.026281,0.000536229,34
1429697579174,92,0.0303637,0.0363809,0.00602806,30
1429697579216,92,0.0448136,0.0486277,0.0147421,27
1429697579257,92,0.0588757,0.0589719,0.0285564,24
1429697579299,92,0.0623116,0.0577518,0.0374869,28
1429697579341,92,0.060356,0.0486425,0.0444155,46
1429697579383,92,0.0299657,0.0087133,0.0165375,61
1429697579424,92,0.00861983,-0.0159285,-0.000105487,69
1429697579466,92,0.00780934,-0.0128293,0.00351317,68
1429697579508,92,0.0300001,0.0206894,0.0349201,61
1429697579549,92,0.0551472,0.0637168,0.0746163,55
1429697579591,92,0.0489951,0.073625,0.0806431,48
1429697579632,92,0.0292834,0.0658609,0.073494,45
1429697579677,92,0.00169165,0.0423248,0.0529038,44
1429697579689,92,-0.0254077,0.0132203,0.0252705,43
1429697579731,92,-0.0580152,-0.0288998,-0.0201791,41
1429697579772,92,-0.072158,-0.0572952,-0.0559378,38
1429697579814,92,-0.0650315,-0.0626855,-0.0677323,35
1429697579856,92,-0.0463402,-0.0526515,-0.0638119,31
1429697579901,92,-0.0291999,-0.0364672,-0.0507389,28
1429697579912,92,-0.0250469,-0.0309165,-0.045277,28
1429697579954,92,-0.010474,-0.0162061,-0.027478,40
1429697579997,92,0.0149818,0.00687543,0.000135862,52
1429697580009,92,0.0562022,0.0397394,0.0371512,57
1429697580051,92,0.0627007,0.0432576,0.0398916,62
1429697580093,92,0.0550717,0.0409727,0.0373951,61
1429697580135,94,0.037418,0.0338293,0.0318387,58
1429697580177,94,0.0191941,0.0241024,0.0282141,49
1429697580218,94,-0.00450627,0.00549417,0.0171355,42
1429697580260,94,-0.0167887,-0.0114572,0.0057662,40
1429697580302,94,-0.0396148,-0.0437389,-0.0264073,40
1429697580344,94,-0.0620792,-0.0759316,-0.0634846,40
1429697580385,94,-0.0759044,-0.0943028,-0.0891678,37
1429697580427,94,-0.0667029,-0.078545,-0.0786985,31
1429697580469,94,-0.0389449,-0.0378114,-0.0408324,27
1429697580510,94,0.0199051,0.0337794,0.0317017,22
1429697580552,94,0.0646073,0.0863982,0.0851076,20
1429697580594,94,0.0821253,0.106908,0.104,28
1429697580606,94,0.0663107,0.0876838,0.0825327,34
1429697580648,94,0.024734,0.0398076,0.0316121,47
1429697580690,94,-0.0124013,-0.00348484,-0.0146143,59
1429697580701,94,-0.0211086,-0.0158884,-0.0268902,59
1429697580743,94,-0.00626799,-0.00365758,-0.0113702,59
1429697580785,94,0.0128556,0.0129678,0.0113813,56
1429697580827,94,0.0269918,0.0222062,0.0294533,49
1429697580869,94,0.0261803,0.0181566,0.0338686,43
1429697580881,94,0.0213218,0.00971203,0.0318912,41
1429697580922,94,0.0122488,-0.000292909,0.0240442,40
1429697580964,94,0.0114393,-0.00414358,0.0174952,39
1429697580975,94,0.00609063,-0.00470316,0.00691821,38
1429697581017,94,0.00467504,-0.000519974,-0.000234757,35
1429697581059,94,0.00161837,-6.14003e-05,-0.0108956,30
1429697581101,94,0.00449897,0.000536367,-0.0174116,28
1429697581113,94,0.00482011,-0.00383791,-0.0246878,27
1429697581155,94,0.0011216,-0.00773497,-0.0292911,26
1429697581197,94,-0.00652067,-0.010586,-0.0307413,23
1429697581209,94,-0.00663588,-0.00559587,-0.0221643,22
1429697581251,94,-0.00296472,0.000918374,-0.0103323,23
1429697581263,94,0.0122631,0.014564,0.00863791,27
1429697581305,94,0.0331741,0.0310216,0.0295839,40
1429697581317,94,0.0453556,0.041416,0.0409364,46
1429697581359,94,0.0512277,0.0489116,0.0494593,59
1429697581371,94,0.0349347,0.0396081,0.0388775,59
1429697581413,94,0.00572299,0.0163296,0.0190392,58
1429697581424,94,-0.032414,-0.0219483,-0.0154076,57
1429697581465,94,-0.0477387,-0.039312,-0.0257021,53
1429697581480,94,-0.0565173,-0.0511302,-0.0330116,51
1429697581521,94,-0.0630485,-0.0631986,-0.0509691,46
1429697581547,94,-0.0529871,-0.0570807,-0.0540843,42
1429697581579,94,-0.0546119,-0.0619394,-0.0714815,40
1429697581621,94,-0.0464763,-0.0523662,-0.0673985,40
1429697581643,94,-0.0264115,-0.026932,-0.0417343,40
1429697581685,94,-0.00632763,0.000557706,-0.00767354,40
1429697581711,94,0.00460629,0.0148873,0.0129974,37
1429697581752,94,0.00376597,0.00987772,0.00919101,35
1429697581779,94,-0.00890068,-0.0103462,-0.013215,33
1429697581821,94,-0.0301527,-0.0402862,-0.0468587,31
1429697581843,94,-0.0368599,-0.0522515,-0.0611699,30
1429697581885,94,-0.0213845,-0.0338614,-0.0378342,27
1429697581912,94,0.00220494,-0.00439365,-0.00361661,24
1429697581953,94,0.0316748,0.0330834,0.0348593,25
1429697581979,94,0.0409265,0.0478149,0.0442486,34
1429697582021,94,0.0411162,0.052168,0.0406778,46
1429697582043,94,0.0330096,0.0433639,0.025375,56
1429697582085,94,0.0280488,0.0326428,0.020106,58
1429697582111,94,0.0335278,0.0365288,0.0404202,57
1429697582153,93,0.0476968,0.050213,0.0695897,53
1429697582179,93,0.0630252,0.0703678,0.0996575,48
1429697582221,93,0.0742439,0.0857702,0.116018,42
1429697582262,93,0.0749562,0.0906562,0.114523,37
1429697582304,93,0.0562169,0.0696941,0.0849771,36
1429697582346,93,0.0188583,0.0231067,0.0286972,35
1429697582387,93,-0.0267404,-0.0315482,-0.0343543,31
1429697582429,93,-0.0640731,-0.0765761,-0.0837956,25
1429697582471,93,-0.0808605,-0.0942302,-0.101722,20
1429697582513,93,-0.0745321,-0.0848869,-0.092976,15
1429697582555,93,-0.0652967,-0.068852,-0.0757081,13
1429697582597,93,-0.0582271,-0.0559696,-0.0646697,15
1429697582641,93,-0.0528698,-0.0494043,-0.0612236,27
1429697582653,93,-0.0433957,-0.0412322,-0.0561539,35
1429697582695,93,-0.0232728,-0.0261595,-0.0442697,55
1429697582737,93,-0.0037718,-0.0059488,-0.0248341,59
1429697582779,93,0.0163942,0.0151857,0.00123576,56
1429697582821,93,0.0356915,0.0345994,0.028527,50
1429697582863,93,0.0349926,0.0306052,0.0324411,40
1429697582904,93,0.00996835,-0.000398527,0.00869104,36
1429697582946,93,-0.025351,-0.0382041,-0.0263667,35
1429697582988,93,-0.0576939,-0.0718983,-0.058061,36
1429697583031,93,-0.0673129,-0.0771492,-0.0660381,34
1429697583074,93,-0.0530429,-0.0542512,-0.0455895,31
1429697583115,93,-0.0182701,-0.00814095,-0.000282058,26
1429697583157,93,0.0249735,0.0417554,0.0498679,24
1429697583199,93,0.0658901,0.080467,0.0879572,21
1429697583242,93,0.0808211,0.089246,0.0916961,21
1429697583287,93,0.0801561,0.0828363,0.0811464,34
1429697583299,93,0.051216,0.0567004,0.0494543,40
1429697583341,93,0.00440408,0.022275,0.0139384,55
1429697583383,93,-0.035945,-0.00991228,-0.0198966,62
1429697583424,93,-0.0548136,-0.0241415,-0.0326556,60
1429697583466,93,-0.0522707,-0.028282,-0.0370106,52
1429697583508,93,-0.0337453,-0.030774,-0.039175,46
1429697583549,93,0.00605222,-0.0135668,-0.0182273,40
1429697583591,93,0.0427417,0.0126245,0.012217,38
1429697583637,93,0.0555884,0.0280686,0.0354115,40
1429697583649,93,0.0434498,0.0228,0.0396506,40
1429697583692,93,0.00817004,-0.0149839,0.0086062,40
1429697583705,93,-0.0418045,-0.0689376,-0.042083,40
1429697583750,93,-0.076313,-0.105591,-0.0818704,35
1429697583763,93,-0.0971318,-0.114575,-0.0981967,34
1429697583806,93,-0.0910288,-0.0882735,-0.0832459,30
1429697583818,93,-0.0560097,-0.0314946,-0.0378271,28
1429697583860,93,-0.011969,0.0255688,0.0111571,21
1429697583902,93,0.0195098,0.0584502,0.038596,18
1429697583943,93,0.0460654,0.0788918,0.0578588,26
1429697583986,93,0.0670798,0.0905781,0.0719317,46
1429697584028,93,0.071077,0.0835894,0.0658179,58
1429697584070,93,0.0652805,0.0651053,0.0487683,57
1429697584112,93,0.0549674,0.0423965,0.0284655,51
1429697584153,93,0.0323961,0.00933111,-0.001801,44
1429697584195,93,-0.0130334,-0.0445261,-0.0509035,38
1429697584236,93,-0.0496293,-0.0791388,-0.0786632,37
1429697584278,93,-0.0794989,-0.111872,-0.10635,37
1429697584319,93,-0.075905,-0.103877,-0.0947737,35
1429697584361,93,-0.0493884,-0.0670707,-0.0592577,32
1429697584403,93,-0.0141845,-0.0119684,-0.00785125,27
1429697584444,93,0.0211236,0.0451362,0.0450675,23
1429697584486,93,0.0445521,0.0802445,0.0798831,18
1429697584528,93,0.0604587,0.0849406,0.0874797,14
1429697584570,93,0.0804779,0.0805617,0.0906043,12
1429697584612,93,0.105559,0.0867856,0.105661,31
1429697584624,93,0.118816,0.0925183,0.116,31
1429697584665,93,0.11152,0.0959052,0.118919,54
1429697584677,93,0.0708143,0.0732759,0.0892372,54
1429697584718,93,0.00363612,0.0201096,0.0247906,60
1429697584730,93,-0.0619209,-0.0405336,-0.0446038,59
1429697584772,92,-0.0983582,-0.0786902,-0.0863093,54
1429697584813,92,-0.0908011,-0.0798419,-0.0845874,44
1429697584856,92,-0.0579049,-0.0532119,-0.0513153,39
1429697584867,92,-0.0185589,-0.0167459,-0.00998424,37
1429697584909,92,0.00595587,0.00915566,0.0153622,36
1429697584922,92,0.00301159,0.00900218,0.0104133,37
1429697584963,92,-0.00677803,0.00204958,-0.00146632,40
1429697585005,92,-0.00365322,0.00517422,-0.000248299,37
1429697585046,92,0.00738532,0.0116291,0.00681398,33
1429697585057,92,0.017814,0.0155364,0.0128169,31
1429697585103,92,0.0176281,0.00787038,0.00477755,25
1429697585116,92,0.00178756,-0.0140039,-0.0191457,23
1429697585157,92,-0.0112852,-0.0276939,-0.0359636,19
1429697585199,92,-0.0115334,-0.0234939,-0.0349211,16
1429697585211,92,0.00606505,0.00010074,-0.0118069,16
1429697585253,92,0.0310029,0.0295797,0.0202088,35
1429697585265,92,0.0352367,0.0341115,0.027746,43
1429697585279,92,0.0156902,0.0136926,0.00973391,43
1429697585320,92,-0.032984,-0.039759,-0.0418263,63
1429697585347,92,-0.0686534,-0.0765217,-0.0763885,65
1429697585388,92,-0.0772641,-0.0851137,-0.0810619,62
1429697585411,92,-0.0484116,-0.0521138,-0.0416644,59
1429697585453,92,0.0103146,0.0130098,0.0314336,49
1429697585479,92,0.0622649,0.0723709,0.0956005,45
1429697585521,92,0.0846576,0.100312,0.122607,40
1429697585548,92,0.0692881,0.084148,0.100898,40
1429697585579,92,0.0304764,0.0405165,0.0477772,40
1429697585621,92,-0.00956331,-0.00694974,-0.00991851,40
1429697585662,92,-0.0315441,-0.0359779,-0.0463669,37
1429697585679,92,-0.0283366,-0.0342189,-0.0483307,35
1429697585721,92,-0.013392,-0.0169883,-0.0325931,29
1429697585747,92,0.00523706,0.00575639,-0.00804918,27
1429697585788,92,0.0138165,0.0202405,0.00921731,24
1429697585811,92,0.00491826,0.0126896,0.00240608,25
1429697585852,92,-0.00412408,-0.00164254,-0.0116493,43
1429697585879,92,-0.00806903,-0.0137336,-0.0221829,52
1429697585920,92,6.12538e-05,-0.0152895,-0.0212888,70
1429697585947,92,0.0193077,-0.00303703,-0.00323981,72
1429697585979,93,0.0363067,0.0131398,0.0212777,70
1429697586021,93,0.0391488,0.0237629,0.0382987,60
1429697586047,93,0.0270559,0.023735,0.0423224,55
1429697586088,93,-0.00280962,0.00873384,0.0283635,40
1429697586111,93,-0.0249465,-0.00339365,0.0130132,35
1429697586152,93,-0.0494301,-0.0277421,-0.0181877,28
1429697586179,93,-0.0779723,-0.0661758,-0.0651347,28
1429697586220,93,-0.0867231,-0.0872391,-0.0953792,27
1429697586247,93,-0.0819823,-0.0869922,-0.103129,26
1429697586288,93,-0.0805454,-0.0819547,-0.101062,22
1429697586311,93,-0.0503539,-0.0419129,-0.0581864,20
1429697586352,93,-0.0296119,-0.0187536,-0.0321221,15
1429697586379,93,-0.000111255,0.00716677,-0.00184137,13
1429697586421,93,0.0275105,0.0258552,0.0183932,9
1429697586463,93,0.0617876,0.049714,0.0436167,16
1429697586504,93,0.0879381,0.0750914,0.0714364,41
1429697586547,93,0.0829221,0.0852916,0.0829688,59
1429697586588,93,0.0505056,0.0719749,0.0726882,66
1429697586630,93,0.0263998,0.0594555,0.064996,64
1429697586671,93,0.0145155,0.0438194,0.0528545,59
1429697586713,93,0.0149193,0.029771,0.042525,55
1429697586754,93,-3.26399e-05,-0.00340353,0.0081898,49
1429697586796,93,-0.0247156,-0.0466713,-0.0407532,46
1429697586837,93,-0.0618182,-0.0999055,-0.100739,45
1429697586886,93,-0.0587074,-0.101797,-0.109709,42
1429697586899,93,-0.0453133,-0.0877667,-0.100851,41
1429697586949,93,-0.0174995,-0.0443166,-0.0573923,35
1429697586963,93,-0.00424666,-0.00877287,-0.0209448,35
1429697587006,93,-0.00552142,0.0106204,0.00371944,28
1429697587052,93,-0.0222472,-0.00499729,-0.00606781,23
1429697587064,93,-0.037862,-0.0266557,-0.0251265,23
1429697587106,93,-0.0414691,-0.0422465,-0.0369906,24
1429697587148,93,-0.0354366,-0.0524714,-0.0480569,34
1429697587189,93,0.0150811,0.01366,0.0192787,56
1429697587232,93,0.0664658,0.0977769,0.104472,64
1429697587274,93,0.0875017,0.166731,0.169723,63
1429697587316,93,0.0681054,0.173113,0.175852,58
1429697587358,93,0.00257146,0.0928327,0.096947,50
1429697587399,93,-0.0368763,-0.00152221,0.0144453,45
1429697587441,93,-0.0330493,-0.0756817,-0.0448055,41
1429697587482,93,-0.0214937,-0.126243,-0.0842738,40
1429697587525,93,-0.0416827,-0.177079,-0.139376,40
1429697587572,93,-0.103224,-0.234339,-0.214943,36
1429697587585,93,-0.170355,-0.247621,-0.253023,34
1429697587626,93,-0.193574,-0.208348,-0.23356,30
1429697587669,93,-0.154006,-0.101859,-0.137097,25
1429697587712,93,-0.0601624,0.0394506,0.0021164,21
1429697587724,93,0.0538289,0.162552,0.126903,19
1429697587766,93,0.157175,0.252562,0.222881,19
1429697587807,93,0.196444,0.2567,0.230883,34
1429697587849,93,0.222977,0.242007,0.222845,48
1429697587891,93,0.214424,0.203711,0.191955,59
1429697587932,93,0.20433,0.181437,0.179109,58
1429697587974,93,0.187068,0.160324,0.166876,51
1429697588016,93,0.148013,0.123198,0.139446,45
1429697588057,93,0.0854738,0.0539821,0.0761478,37
1429697588099,93,-0.00854822,-0.0359075,-0.00927353,36
1429697588141,93,-0.113528,-0.143598,-0.117862,37
1429697588183,93,-0.188934,-0.218493,-0.197103,36
1429697588224,93,-0.213536,-0.244497,-0.228781,31
1429697588266,93,-0.181402,-0.210439,-0.201157,26
1429697588308,93,-0.0966175,-0.127797,-0.122823,20
1429697588350,93,-0.0102864,-0.0432295,-0.0409012,16
1429697588392,93,0.0629347,0.0319717,0.0331798,12
1429697588433,93,0.0974757,0.0701085,0.0709743,15
1429697588476,93,0.0853856,0.0620857,0.0614005,37
1429697588518,93,0.0357504,0.0202172,0.0177284,53
1429697588559,93,-0.0239286,-0.031389,-0.0373768,61
1429697588601,93,-0.0709707,-0.0698539,-0.0762607,57
1429697588643,93,-0.0824848,-0.0725676,-0.0779168,47
1429697588685,93,-0.0652376,-0.0475671,-0.0496389,40
1429697588727,93,-0.0295914,-0.00507935,-0.00367691,34
1429697588738,93,0.0141425,0.0448525,0.0499446,34
1429697588780,93,0.0454559,0.0913931,0.0987772,35
1429697588822,93,0.075244,0.134049,0.141478,36
1429697588864,93,0.0800063,0.146182,0.151518,35
1429697588905,93,0.0706613,0.136282,0.137782,30
1429697588947,93,0.05885,0.111464,0.10804,24
1429697588989,93,0.0350286,0.0646794,0.0556878,17
1429697589030,93,0.0146051,0.0171695,0.00506141,15
1429697589073,93,0.00207429,-0.0207211,-0.0346194,34
1429697589084,93,0.00348616,-0.0316001,-0.0456035,34
1429697589126,93,0.0103071,-0.0251345,-0.0381534,59
1429697589167,93,0.00388915,-0.0224898,-0.035156,66
1429697589209,94,-0.0113317,-0.0249505,-0.0354815,61
1429697589221,94,-0.0222436,-0.0288717,-0.0345966,61
1429697589262,94,-0.0225321,-0.0283373,-0.0276176,52
1429697589274,94,-0.0204687,-0.033836,-0.0262366,48
1429697589315,94,-0.0201877,-0.0396961,-0.0263701,42
1429697589327,94,-0.0381312,-0.0619449,-0.0461941,41
1429697589369,94,-0.0616236,-0.083309,-0.0687366,40
1429697589381,94,-0.0697825,-0.0865183,-0.0741924,41
1429697589422,94,-0.0585452,-0.0656136,-0.0579603,43
1429697589434,94,-0.021827,-0.0188523,-0.0162812,43
1429697589476,94,0.014209,0.0240467,0.0230321,40
1429697589487,94,0.0379823,0.0516651,0.0473018,40
1429697589529,94,0.0383665,0.0506361,0.0424382,33
1429697589547,94,0.0214787,0.0289332,0.0193693,31
1429697589588,94,-0.00200554,-0.000894563,-0.0117366,26
1429697589610,94,-0.0182181,-0.024655,-0.0362853,22
1429697589652,94,-0.0220914,-0.032321,-0.0412278,20
1429697589678,94,-0.0134719,-0.0231464,-0.0255821,28
1429697589720,94,-0.0104414,-0.0163981,-0.0116919,44
1429697589746,94,-0.00251336,-0.00386801,0.0100449,63
1429697589778,94,-0.00501462,-0.00275468,0.0154847,71
1429697589820,94,-0.0118178,-0.0078233,0.00893082,71
1429697589846,94,-0.0142114,-0.0104776,0.00121261,67
1429697589878,94,-0.00635437,-0.00218951,0.0051994,61
1429697589920,94,0.0174106,0.0217794,0.0261604,55
1429697589946,94,0.045898,0.0492902,0.0533188,49
1429697589988,94,0.0660732,0.0722006,0.0766318,47
1429697590011,94,0.0686429,0.0760832,0.079169,47
1429697590052,94,0.049192,0.0600349,0.0576271,47
1429697590078,94,0.0197275,0.0314043,0.0218871,45
1429697590125,94,-0.00405133,0.00449844,-0.012569,40
1429697590147,94,-0.00973273,-0.00187148,-0.0215414,38
1429697590188,94,-0.0089636,-0.0024243,-0.0206965,34
1429697590210,94,-0.0149653,-0.00658445,-0.0233958,31
1429697590252,94,-0.0346401,-0.0284134,-0.0442846,28
1429697590278,94,-0.0725066,-0.071983,-0.0885176,27
1429697590321,94,-0.109181,-0.122207,-0.143238,34
1429697590346,94,-0.0958663,-0.114702,-0.134716,46
1429697590388,94,-0.0589735,-0.0793235,-0.0904041,59
1429697590410,94,-0.0160201,-0.0358054,-0.0341698,64
1429697590451,94,0.0172677,0.000835098,0.0186031,63
1429697590478,94,0.0391436,0.0257449,0.0571601,60
1429697590510,94,0.0709981,0.0732568,0.110926,55
1429697590546,94,0.0747976,0.0917969,0.126055,50
1429697590578,94,0.067833,0.102,0.125895,46
1429697590610,94,0.0280673,0.0593488,0.0672933,45
1429697590652,94,0.0022325,0.0241338,0.0225748,45
1429697590694,94,-0.0297963,-0.0285878,-0.0357592,43
1429697590736,94,-0.0143377,-0.0253225,-0.0343611,40
1429697590777,94,-0.0100247,-0.0346186,-0.0446198,35
1429697590819,94,-0.00443351,-0.0288844,-0.0391542,31
1429697590861,94,0.00984209,-0.0128154,-0.0252386,26
1429697590902,94,0.0100197,-0.000158802,-0.011499,24
1429697590944,94,0.0349854,0.0422713,0.032406,35
1429697590986,94,0.0664948,0.0911933,0.0814162,48
1429697591029,94,0.0925876,0.126102,0.118068,63
1429697591070,94,0.0964519,0.121431,0.113385,63
1429697591112,95,0.0511232,0.054536,0.0463515,57
1429697591153,95,-0.022817,-0.0445192,-0.0486144,51
1429697591195,95,-0.0962826,-0.139251,-0.137824,43
1429697591237,95,-0.136324,-0.184236,-0.175982,40
1429697591278,95,-0.133185,-0.177347,-0.161224,40
1429697591320,95,-0.0963987,-0.122845,-0.102119,39
1429697591363,95,-0.0264539,-0.0343527,-0.0138858,34
1429697591404,95,0.00933062,0.0206085,0.0287234,29
1429697591446,95,-0.00632367,0.0170507,0.0130619,23
1429697591487,95,-0.0743483,-0.0551778,-0.0640761,20
1429697591529,95,-0.13791,-0.132469,-0.130962,16
1429697591570,95,-0.14658,-0.161527,-0.141921,14
1429697591612,95,-0.097929,-0.113857,-0.0834102,19
1429697591655,95,-0.0300733,-0.0397045,-0.00847225,33
1429697591696,95,0.0228941,0.0346791,0.050705,57
1429697591738,95,0.0774506,0.115397,0.10864,63
1429697591780,95,0.114232,0.172757,0.143223,61
1429697591821,95,0.136333,0.203895,0.163071,55
1429697591863,95,0.139834,0.199079,0.156785,45
1429697591904,95,0.0932183,0.127805,0.0981529,40
1429697591946,95,0.0541766,0.0534911,0.0418822,36
1429697591987,95,0.00782817,-0.0281082,-0.0213765,35
1429697592029,95,-0.0296968,-0.0890257,-0.0704167,31
1429697592071,95,-0.0669783,-0.128132,-0.105748,27
1429697592113,95,-0.0990075,-0.148536,-0.126947,22
1429697592155,95,-0.121914,-0.151062,-0.13354,19
1429697592197,95,-0.100678,-0.102554,-0.0908604,17
1429697592239,95,-0.0465165,-0.0229535,-0.0181596,17
1429697592282,95,0.0157573,0.0639593,0.0609569,18
1429697592295,95,0.0697602,0.131173,0.120272,20
1429697592338,95,0.0929549,0.145612,0.130272,31
1429697592380,95,0.101082,0.137338,0.118607,55
1429697592421,95,0.0842169,0.103194,0.0840337,66
1429697592463,95,0.0802316,0.0919138,0.0726199,65
1429697592474,95,0.0980076,0.114029,0.0939563,65
1429697592486,95,0.114544,0.134239,0.116877,63
1429697592529,95,0.121163,0.131848,0.122134,54
1429697592541,95,0.115011,0.106186,0.106632,54
1429697592583,95,0.0792684,0.0345512,0.0474604,43
1429697592624,95,0.0306169,-0.0409307,-0.0191123,40
1429697592666,95,-0.026545,-0.116385,-0.0888832,40
1429697592708,95,-0.0814284,-0.167474,-0.137962,40
1429697592750,95,-0.113313,-0.180692,-0.152172,38
1429697592791,95,-0.112718,-0.14992,-0.125621,37
1429697592833,95,-0.0850031,-0.0933667,-0.0771113,32
1429697592875,95,-0.0578512,-0.0402272,-0.0335485,27
1429697592916,95,-0.0314254,-0.00219999,-0.00717339,20
1429697592958,95,-0.030714,0.0043941,-0.0100837,20
1429697593000,95,-0.043711,-0.00958487,-0.0292111,37
1429697593042,95,-0.0620568,-0.0328556,-0.0536707,52
1429697593084,95,-0.0699621,-0.0480036,-0.0670681,62
1429697593125,95,-0.0641538,-0.0521769,-0.0687376,61
1429697593168,95,-0.0478467,-0.0440783,-0.0580752,53
1429697593210,95,-0.0234178,-0.0262764,-0.0331775,47
1429697593251,95,-0.00370396,-0.0097231,-0.0086269,40
1429697593293,95,0.0241933,0.0220963,0.0325911,38
1429697593335,95,0.0655749,0.0735951,0.0907329,37
1429697593347,95,0.102219,0.119646,0.138843,36
1429697593389,95,0.120564,0.142766,0.159985,34
1429697593431,95,0.109879,0.129415,0.140379,29
1429697593473,95,0.0784943,0.0932956,0.0957859,26
1429697593515,95,0.0454121,0.0573115,0.053152,21
1429697593527,95,0.0210645,0.0303497,0.0215254,21
1429697593569,95,0.00426968,0.0123018,0.000910155,18
1429697593611,95,-0.00334491,0.00147647,-0.00935429,26
1429697593622,95,-0.0191701,-0.0204509,-0.0312896,33
1429697593664,95,-0.0295758,-0.0369689,-0.048331,58
1429697593676,95,-0.0347355,-0.0452517,-0.0590483,58
1429697593718,95,-0.0275177,-0.0398103,-0.0564075,68
1429697593730,95,-0.00923674,-0.0246896,-0.0407558,68
1429697593771,95,0.0035443,-0.0161309,-0.0235075,65
1429697593813,95,0.00310981,-0.0198585,-0.0134905,60
1429697593825,95,-0.0113515,-0.0346726,-0.014172,57
1429697593867,95,-0.0287391,-0.0472919,-0.0172242,49
1429697593909,95,-0.0382288,-0.0466769,-0.0166276,47
1429697593920,95,-0.0391785,-0.0401643,-0.0186713,46
1429697593962,95,-0.0260289,-0.0234822,-0.0137758,45
1429697593979,95,-0.0111906,-0.0104628,-0.0117653,45
1429697594020,95,-0.00549517,-0.00810738,-0.0163204,41
1429697594047,95,-0.00791832,-0.0125511,-0.0209305,40
1429697594078,95,-0.0196657,-0.0203972,-0.0263124,37
1429697594120,95,-0.0265837,-0.0228593,-0.0260949,32
1429697594146,95,-0.0239483,-0.0165815,-0.0186925,30
1429697594187,95,-0.0169673,-0.0100519,-0.0155603,26
1429697594210,95,-0.0108372,-0.00730468,-0.0179516,25
1429697594251,95,-0.0146321,-0.0119821,-0.0285027,31
1429697594278,95,-0.0219506,-0.0182909,-0.0409079,36
1429697594319,95,-0.0197957,-0.0119168,-0.0378176,58
1429697594346,95,-0.015642,-0.0101695,-0.0332187,64
1429697594387,95,-0.0135147,-0.0183388,-0.0323828,71
1429697594410,95,-0.0234395,-0.0380926,-0.0372581,70
1429697594452,95,-0.0471524,-0.0711493,-0.0552952,64
1429697594477,95,-0.082023,-0.109707,-0.0814803,62
1429697594519,95,-0.0740673,-0.0878694,-0.0544099,54
1429697594545,95,-0.0189872,-0.00887629,0.0204188,52
1429697594588,95,0.0617623,0.0992057,0.118298,49
1429697594610,95,0.130992,0.19089,0.199489,49
1429697594652,95,0.163443,0.230159,0.22977,47
1429697594678,95,0.143443,0.203897,0.198884,46
1429697594719,95,0.0879116,0.127296,0.122429,40
1429697594745,95,0.0317464,0.0464325,0.041706,38
1429697594787,95,-0.00370357,-0.0171084,-0.0218689,31
1429697594810,95,-0.00678996,-0.0377874,-0.0427441,29
1429697594851,95,0.00889432,-0.025736,-0.0329976,25
1429697594893,95,0.0151483,-0.0133405,-0.0224161,25
1429697594935,95,0.00729816,-0.0152064,-0.02331,34
1429697594976,95,-0.00939924,-0.0294745,-0.037172,46
1429697595018,95,-0.0297828,-0.0526977,-0.0601304,63
1429697595060,95,-0.0305762,-0.0521074,-0.0588374,65
1429697595103,95,-0.0146215,-0.0322439,-0.0364674,62
1429697595151,94,-0.00151364,-0.0134829,-0.014155,55
1429697595162,94,0.00751082,-0.0021098,0.00332545,55
1429697595204,94,0.00879444,-0.00546871,0.00566945,48
1429697595246,94,-0.0306686,-0.0508116,-0.0366345,45
1429697595287,94,-0.0583676,-0.081541,-0.0684281,44
1429697595329,94,-0.0663921,-0.0838561,-0.0759811,42
1429697595370,94,-0.0558974,-0.0614679,-0.0606587,38
1429697595412,94,-0.0386894,-0.0323249,-0.0379039,35
1429697595453,94,-0.0160573,0.00246871,-0.00660361,31
1429697595495,94,-0.0115259,0.00959878,0.00016633,28
1429697595536,94,-0.020984,-0.00464775,-0.0106657,25
1429697595578,94,-0.0287832,-0.0185025,-0.0229566,23
1429697595619,94,-0.0289462,-0.0228947,-0.0250329,31
1429697595661,94,0.00246656,0.0161769,0.0148105,41
1429697595703,94,0.0476788,0.0714863,0.0687583,58
1429697595745,94,0.0903241,0.11937,0.11436,61
1429697595791,93,0.104367,0.13192,0.122707,58
1429697595803,93,0.071324,0.0946041,0.083204,55
1429697595845,93,0.021305,0.0370027,0.0290114,50
1429697595886,93,-0.0317774,-0.0230029,-0.0216934,44
1429697595929,93,-0.0457257,-0.0458909,-0.0316094,42
1429697595971,93,-0.0408262,-0.0542112,-0.0299611,41
1429697596012,93,-0.0131647,-0.0391705,-0.0109213,40
1429697596058,93,0.020701,-0.0138763,0.0101782,37
1429697596070,93,0.0322989,-0.00396969,0.00904229,35
1429697596112,93,0.0104469,-0.0201357,-0.0202644,31
1429697596154,93,-0.0261455,-0.0478649,-0.0573399,27
1429697596196,93,-0.0586558,-0.0649427,-0.0779433,25
1429697596237,93,-0.0544934,-0.0418008,-0.0547744,22
1429697596279,93,-0.0334574,-0.00608457,-0.0176258,22
1429697596321,93,0.00566905,0.0423903,0.0322363,35
1429697596363,93,0.0319296,0.0700714,0.0596753,48
1429697596404,93,0.0504686,0.0856277,0.0731828,60
1429697596446,93,0.027898,0.0507917,0.0384727,59
1429697596487,93,0.0252243,0.0401462,0.0283174,51
1429697596529,93,0.0158297,0.0225369,0.0149992,44
1429697596571,93,0.0131552,0.0106052,0.00970154,35
1429697596613,93,-0.00043207,-0.0171528,-0.00928142,34
1429697596654,93,-0.0159767,-0.0428653,-0.0270714,35
1429697596696,93,-0.0362825,-0.0645937,-0.0447232,34
1429697596738,93,-0.0556275,-0.072993,-0.0537998,30
1429697596780,93,-0.0530936,-0.0553571,-0.045456,27
1429697596821,93,-0.0363646,-0.0239956,-0.0228812,23
1429697596863,93,-0.019774,-0.00356547,-0.00715388,21
1429697596906,93,-0.0262245,-0.0177819,-0.0185416,20
1429697596947,93,-0.0405581,-0.0489808,-0.0412116,29
1429697596989,93,-0.0358325,-0.0565475,-0.0404041,50
1429697597031,93,-0.00530777,-0.0295433,-0.0106141,61
1429697597075,93,0.0468283,0.029489,0.0415665,61
1429697597116,93,0.090119,0.085252,0.0853633,57
1429697597159,93,0.108348,0.11447,0.102135,47
1429697597171,93,0.0928357,0.10432,0.085341,44
1429697597212,93,0.0610481,0.0703103,0.0525398,40
1429697597254,93,0.0288453,0.0282133,0.0163043,39
1429697597296,93,0.00895185,-0.00157267,-0.00644257,39
1429697597339,93,0.00943877,-0.00924594,-0.0107398,35
1429697597350,93,0.0157067,-0.00217824,-0.00455377,35
1429697597392,93,0.018995,0.00833817,0.00297386,30
1429697597436,93,0.0163926,0.0173232,0.00858288,25
1429697597448,93,-0.000396818,0.00960997,0.000116806,23
1429697597490,93,-0.0200937,-0.0036087,-0.0109682,19
1429697597533,93,-0.0456351,-0.0295014,-0.0332818,16
1429697597546,93,-0.0640653,-0.0497653,-0.0510285,15
1429697597590,93,-0.078175,-0.0678037,-0.0659491,20
1429697597604,93,-0.0730316,-0.062606,-0.0603564,27
1429697597616,93,-0.051153,-0.0393444,-0.0383512,27
1429697597658,93,-0.0232939,-0.00997171,-0.00970012,53
1429697597702,93,0.00362688,0.0114221,0.0113177,65
1429697597715,93,0.0179826,0.0149003,0.0165534,66
1429697597756,93,0.020862,0.00624938,0.0124434,64
1429697597798,93,0.0120237,-0.00679868,0.00289377,59
1429697597841,93,0.0030317,-0.0128789,0.00138251,49
1429697597853,93,0.00683993,-0.00174286,0.0143317,49
1429697597894,93,0.0105056,0.00614698,0.0205644,41
1429697597936,93,0.0210043,0.0165425,0.0263637,40
1429697597948,93,0.0317839,0.0285908,0.0325729,40
1429697597989,93,0.0314582,0.0291365,0.0267827,37
1429697598001,93,0.0218342,0.0206544,0.0147747,37
1429697598043,93,0.0120841,0.0132047,0.0057619,32
1429697598084,93,0.00817315,0.00688523,-0.00296472,28
1429697598126,93,0.0139416,0.0106602,-0.000452398,23
1429697598138,93,0.0229379,0.0240161,0.0110681,23
1429697598179,93,0.0354857,0.0430385,0.0284879,20
1429697598191,93,0.034344,0.0466578,0.0338886,20
1429697598232,93,0.0248751,0.0369068,0.0282253,18
1429697598246,93,0.00914892,0.0204684,0.01544,17
1429697598288,93,0.000247065,0.00668913,0.00562218,20
1429697598309,93,0.0044433,0.00527808,0.00611805,34
1429697598351,93,0.0141251,0.00926693,0.0118087,52
1429697598377,93,0.00773228,0.000878832,0.00647146,66
1429697598419,93,-0.00785617,-0.0110184,-0.00119212,69
1429697598445,93,-0.031871,-0.0343535,-0.0202499,67
1429697598487,93,-0.0546356,-0.0576815,-0.0404527,62
1429697598509,93,-0.0742148,-0.0803726,-0.060524,56
1429697598551,93,-0.0710948,-0.0809222,-0.0631157,50
1429697598593,93,-0.0699477,-0.0844663,-0.0688405,44
1429697598610,93,-0.0532745,-0.0652554,-0.0536675,43
1429697598651,93,-0.0322558,-0.0404559,-0.0345543,43
1429697598678,93,-0.0312868,-0.0360217,-0.0372744,42
1429697598719,93,-0.0168452,-0.0189473,-0.0271636,40
1429697598745,93,-0.0134691,-0.0186274,-0.0325022,36
1429697598787,93,-0.00750075,-0.014752,-0.0308212,32
1429697598809,93,-0.014498,-0.0234592,-0.0375555,28
1429697598851,93,-0.0255076,-0.0319956,-0.043386,25
1429697598877,93,-0.0507524,-0.0496607,-0.0580136,23
1429697598919,93,-0.0590291,-0.0482244,-0.0538557,22
1429697598945,93,-0.0433129,-0.0212275,-0.0254215,22
1429697598988,93,0.00189764,0.029367,0.0263551,21
1429697599009,93,0.0545944,0.0774099,0.0760851,25
1429697599051,93,0.10365,0.115104,0.112628,39
1429697599077,93,0.128646,0.127777,0.122597,56
1429697599119,93,0.131484,0.124975,0.117853,70
1429697599164,93,0.123677,0.117037,0.110671,74
1429697599177,93,0.0968809,0.0910233,0.0923602,73
1429697599223,93,0.0674653,0.0607181,0.073895,66
1429697599245,93,0.0406696,0.0307465,0.0551273,63
1429697599287,93,0.0249969,0.0163621,0.0488783,58
1429697599328,93,-0.00803004,-0.0178699,0.0147421,52
1429697599370,93,-0.0501095,-0.0633295,-0.0397816,51
1429697599411,93,-0.0809755,-0.0965294,-0.088142,48
1429697599453,93,-0.0762329,-0.0870107,-0.0934084,44
1429697599495,93,-0.033872,-0.032164,-0.0499219,28
1429697599651,93,0.0362671,0.0559411,0.0340039,27
1429697599693,93,0.0838663,0.11478,0.096388,22
1429697599735,93,0.0951048,0.123487,0.11052,20
1429697599777,93,0.0537974,0.0686286,0.0603269,32
1429697599818,93,-0.012782,-0.0211021,-0.0265083,47
1429697599860,93,-0.0753564,-0.100843,-0.106212,65
1429697599901,93,-0.0950301,-0.128573,-0.13643,66
1429697599943,93,-0.0595613,-0.0876047,-0.0966614,61
1429697599985,93,0.012861,0.00472162,-0.00413092,55
1429697600026,93,0.0582166,0.0682255,0.0625479,45
1429697600068,93,0.0380623,0.0584906,0.0568927,42
1429697600110,93,-0.0479083,-0.0384562,-0.0347395,40
1429697600152,93,-0.124616,-0.130584,-0.119867,40
1429697600194,93,-0.16797,-0.190425,-0.171612,34
1429697600235,93,-0.126945,-0.148157,-0.122718,30
1429697600277,93,-0.0412307,-0.0476338,-0.0216362,24
1429697600319,93,0.0316821,0.0416207,0.0630458,22
1429697600360,93,0.0631689,0.0917116,0.100105,20
1429697600402,93,0.0475837,0.0856678,0.0770179,19
1429697600448,93,0.0161014,0.0490612,0.0275488,18
1429697600461,93,0.0148906,0.0377298,0.00957243,20
1429697600503,93,0.0224908,0.0306538,0.00405678,32
1429697600551,93,0.0229863,0.0209991,-0.0012648,55
1429697600563,93,-0.010086,-0.0231174,-0.0395031,61
1429697600605,93,-0.0556398,-0.0706358,-0.0835401,64
1429697600647,93,-0.0711343,-0.0843061,-0.0927534,58
1429697600691,93,-0.0640023,-0.0727729,-0.0751247,52
1429697600703,93,-0.0135617,-0.019614,-0.0112396,49
1429697600745,93,0.0358475,0.0274167,0.0456232,41
1429697600757,93,0.0659762,0.0498072,0.0755211,41
1429697600799,93,0.0676787,0.0502539,0.076451,40
1429697600840,93,0.0506874,0.0384606,0.0586747,41
1429697600882,93,0.0198419,0.0267305,0.037235,40
1429697600927,93,-0.00529667,0.0184647,0.0174679,36
1429697600938,93,-0.0153834,0.0177847,0.00928391,34
1429697600980,93,0.0048856,0.0329939,0.0252897,29
1429697601022,93,0.0144626,0.0324284,0.0266045,27
1429697601063,93,0.00778743,0.0129832,0.0115819,24
1429697601106,93,-0.00960641,-0.0149814,-0.015149,23
1429697601149,93,-0.0300585,-0.0489594,-0.0477823,36
1429697601162,93,-0.0328,-0.0601554,-0.0585231,42
1429697601205,93,0.00355845,-0.0222182,-0.0201342,57
1429697601246,93,0.0469763,0.0357276,0.0323752,64
1429697601288,93,0.0820006,0.0935992,0.0815548,60
1429697601330,93,0.0785974,0.108539,0.0898052,51
1429697601371,93,0.0495603,0.0886952,0.0677607,44
1429697601414,93,0.0155832,0.0507258,0.037452,39
1429697601426,93,-0.0232181,-0.00188274,-0.00191794,39
1429697601468,93,-0.0478925,-0.0426735,-0.0286717,38
1429697601510,93,-0.0676968,-0.0737331,-0.0507899,37
1429697601551,93,-0.057529,-0.0714,-0.0460222,32
1429697601594,93,-0.0291458,-0.0489688,-0.0262801,27
1429697601606,93,-0.00694633,-0.0300328,-0.0178705,25
1429697601648,93,0.00527073,-0.0185839,-0.0179176,17
1429697601690,93,-0.00312144,-0.0169938,-0.0282597,14
1429697601701,93,-0.017555,-0.0264092,-0.0466489,12
1429697601744,93,-0.0416585,-0.0452712,-0.067737,10
1429697601786,93,-0.0409813,-0.0461578,-0.0676543,26
1429697601799,93,-0.0282849,-0.0369542,-0.0570999,35
1429697601841,93,-0.0112649,-0.0294723,-0.0483334,52
1429697601883,93,0.0070015,-0.0159235,-0.0328054,61
1429697601900,93,0.0211888,-0.00505306,-0.0151082,60
1429697601911,93,0.0148885,-0.00828449,-0.00700144,60
1429697601953,93,0.00534535,-0.00274857,0.0123634,53
1429697601995,93,-0.00489308,0.00533271,0.0306564,46
1429697602041,93,0.0327879,0.0636018,0.0949305,38
1429697602054,93,0.0918114,0.126612,0.156624,36
1429697602095,93,0.114848,0.135916,0.158001,36
1429697602137,93,0.103214,0.114283,0.124644,37
1429697602148,93,0.0443918,0.0418373,0.0399338,36
1429697602192,93,-0.0578847,-0.0631403,-0.0739694,34
1429697602210,93,-0.164727,-0.171777,-0.184147,33
1429697602252,93,-0.250098,-0.260586,-0.27164,30
1429697602264,93,-0.28172,-0.292994,-0.298851,29
1429697602305,93,-0.228203,-0.226981,-0.233369,27
1429697602317,93,-0.133059,-0.114864,-0.12418,26
1429697602358,93,-0.0303489,-0.00272656,-0.0120424,24
1429697602378,93,0.0558909,0.072068,0.0646677,24
1429697602419,93,0.09172,0.0787338,0.0777057,29
1429697602445,93,0.117141,0.0741625,0.0780605,36
1429697602487,93,0.132788,0.0725125,0.0789385,60
1429697602510,93,0.113937,0.0529305,0.064707,67
1429697602551,93,0.0779253,0.0385563,0.0555853,72
1429697602579,93,0.0614475,0.0649282,0.0772537,70
1429697602609,93,0.0973919,0.14968,0.149511,66
1429697602651,93,0.186387,0.282206,0.264306,56
1429697602677,93,0.275993,0.389714,0.360264,53
1429697602719,93,0.309791,0.418176,0.388844,45
1429697602746,93,0.277241,0.361901,0.341352,43
1429697602787,93,0.184117,0.234952,0.225094,42
1429697602810,93,0.0411822,0.0502333,0.0522531,41
1429697602851,93,-0.0955009,-0.119221,-0.110767,38
1429697602878,93,-0.202987,-0.258133,-0.246235,36
1429697602910,93,-0.260558,-0.336381,-0.323461,32
1429697602946,93,-0.272212,-0.357058,-0.342492,29
1429697602978,93,-0.263211,-0.34993,-0.331722,26
1429697603010,93,-0.256931,-0.34091,-0.319146,22
1429697603045,93,-0.223326,-0.300361,-0.279526,20
1429697603078,93,-0.154442,-0.214741,-0.202943,24
1429697603110,93,-0.0679195,-0.114966,-0.117106,37
1429697603145,93,0.0219257,-0.0102525,-0.0226505,53
1429697603178,93,0.0991924,0.086682,0.0720453,63
1429697603210,93,0.161161,0.172802,0.164637,64
1429697603246,92,0.197943,0.234305,0.2389,60
1429697603278,92,0.204183,0.257181,0.275367,53
1429697603310,92,0.180887,0.234311,0.26111,46
1429697603351,92,0.120185,0.158018,0.183096,39
1429697603393,92,0.056157,0.082356,0.0986415,37
1429697603434,92,0.00957862,0.0324004,0.033749,37
1429697603476,92,-0.0125169,0.0189859,0.0060666,36
1429697603519,92,-0.0202577,0.0200242,-0.00272657,32
1429697603562,92,-0.0245974,0.0138564,-0.0127634,28
1429697603604,92,-0.0334734,-0.00482533,-0.0323129,23
1429697603646,92,-0.0511731,-0.0375436,-0.0616514,20
1429697603691,92,-0.0680732,-0.0679461,-0.086642,18
1429697603702,92,-0.060121,-0.0675046,-0.0826521,22
1429697603744,92,-0.0318851,-0.040978,-0.0536154,37
1429697603787,92,-0.006073,-0.013095,-0.0240263,61
1429697603828,92,0.00961642,0.00806592,-0.00128901,68
1429697603870,92,0.00134845,0.00242664,-0.00266442,63
1429697603912,92,-0.00996544,-0.00840727,-0.00529248,57
1429697603957,92,-0.0169667,-0.0205202,-0.00756694,46
1429697603969,92,0.000387875,-0.0119891,0.010571,43
1429697604010,92,0.0262227,0.00888983,0.0407897,41
1429697604052,92,0.0363727,0.0165108,0.0517309,41
1429697604093,92,0.0312708,0.0144943,0.0473847,41
1429697604135,92,0.00219146,-0.00953351,0.0132586,37
1429697604176,92,-0.0447594,-0.0514088,-0.042573,33
1429697604219,92,-0.0738122,-0.0744264,-0.0783693,27
1429697604261,92,-0.0871989,-0.0841582,-0.0967381,25
1429697604302,92,-0.0949048,-0.0865648,-0.10352,30
1429697604348,92,-0.0933522,-0.0830837,-0.100129,46
1429697604364,92,-0.0788799,-0.0709007,-0.0878624,28
1429697604377,92,-0.0443088,-0.0457712,-0.0639035,0
1429697604418,92,0.0175801,0.00597811,-0.0152484,0
1429697604460,92,0.097479,0.0739145,0.0478181,0
1429697604501,92,0.15226,0.122015,0.0988508,0
1429697604543,92,0.156921,0.129208,0.115422,0
1429697604584,92,0.10099,0.0834915,0.0841978,0
1429697604626,92,0.0262116,0.0183318,0.0344197,0
1429697604668,92,-0.041895,-0.0459416,-0.0180228,0
1429697604709,92,-0.0838754,-0.0909496,-0.0571822,0
1429697604751,92,-0.0593202,-0.0735317,-0.0443879,0
1429697604792,92,-0.0221409,-0.0355957,-0.0250066,0
1429697604834,92,0.0298675,0.0254848,0.0107231,0
1429697604876,92,0.0435825,0.0522799,0.0150191,0
1429697604918,92,0.0272424,0.0499943,-0.00043376,0
1429697604960,92,-0.00454299,0.0251285,-0.0221345,0
1429697605001,92,-0.0238723,0.00797547,-0.0240047,0
1429697605043,92,-0.0271877,0.00282886,-0.00730936,40
1429697605085,92,-0.0120499,0.0156346,0.0250206,56
1429697605127,92,0.0177569,0.043524,0.0673991,61
1429697605168,92,0.0450654,0.0610351,0.0920232,57
1429697605211,92,0.0605576,0.0652934,0.0961944,47
1429697605254,92,0.0471432,0.0425262,0.0713297,39
1429697605266,92,-0.00170357,-0.00727598,0.0180132,39
1429697605308,92,-0.052494,-0.0549573,-0.0291522,37
1429697605349,92,-0.0923302,-0.0901861,-0.0601611,38
1429697605391,92,-0.10008,-0.101217,-0.0683503,35
1429697605432,92,-0.0782028,-0.0869142,-0.0568933,31
1429697605475,92,-0.0368139,-0.0550229,-0.0399997,24
1429697605487,92,0.00558468,-0.0190918,-0.0229955,22
1429697605529,92,0.0251307,0.00238214,-0.0186277,19
1429697605570,92,0.0227683,0.00775278,-0.0227188,16
1429697605615,92,-0.000954905,-0.0100004,-0.0407297,16
1429697605627,92,-0.013471,-0.0146663,-0.0444242,20
1429697605669,92,-0.0161671,-0.0161426,-0.0466888,35
1429697605711,92,0.0104405,0.0108335,-0.0227712,63
1429697605724,92,0.047895,0.0456252,0.00764064,69
1429697605765,92,0.0514874,0.0490768,0.0113154,73
1429697605807,92,0.0370885,0.037174,0.00692891,66
1429697605849,92,0.0136877,0.0152347,-0.000870515,58
1429697605862,92,-0.0329151,-0.0265936,-0.0211908,53
1429697605903,92,-0.0683711,-0.0590289,-0.0295259,44
1429697605946,92,-0.0694263,-0.0659245,-0.0197432,39
1429697605987,92,-0.0480365,-0.0456025,0.00930273,38
1429697606029,92,0.00392746,0.00103586,0.0489244,36
1429697606070,92,0.0598732,0.0510827,0.0839995,33
1429697606112,92,0.0953039,0.0855584,0.10123,27
1429697606124,92,0.105093,0.10109,0.100436,25
1429697606167,92,0.0898792,0.103301,0.0914782,21
1429697606180,92,0.0412129,0.0750784,0.0595107,19
1429697606221,92,-0.0072648,0.0418577,0.0247524,16
1429697606263,92,-0.0516939,0.00264862,-0.00960613,13
1429697606305,92,-0.0724454,-0.032192,-0.0392862,8
1429697606347,92,-0.0544898,-0.0465718,-0.0491498,8
1429697606360,92,-0.0127573,-0.0332734,-0.0310753,14
1429697606401,92,0.02311,-0.0156157,-0.0131867,33
1429697606443,92,0.0552635,0.00798015,0.00687445,66
1429697606454,92,0.0624082,0.0196742,0.0162536,66
1429697606496,92,0.0677022,0.0352821,0.0282048,72
1429697606509,92,0.0528867,0.0309714,0.0236197,70
1429697606550,92,0.0200351,0.00590686,0.00218106,62
1429697606593,92,-0.033772,-0.0474322,-0.0467776,47
1429697606605,92,-0.107756,-0.12233,-0.113536,47
1429697606646,92,-0.156793,-0.165503,-0.149749,37
1429697606658,92,-0.167392,-0.164996,-0.148112,36
1429697606700,92,-0.140492,-0.117854,-0.103518,35
1429697606711,92,-0.108956,-0.0743235,-0.070921,35
1429697606753,92,-0.107777,-0.0713702,-0.0800591,34
1429697606795,92,-0.107964,-0.0774712,-0.095084,29
1429697606806,92,-0.0896881,-0.0677073,-0.0909805,29
1429697606848,92,-0.0734281,-0.0600634,-0.0800989,22
1429697606860,92,-0.0451545,-0.0380839,-0.0531767,20
1429697606902,92,-0.0289355,-0.0250435,-0.0374832,16
1429697606915,92,0.0282725,0.0432518,0.0326949,14
1429697606960,92,0.106482,0.140585,0.1307,10
1429697606980,92,0.162951,0.221765,0.21685,9
1429697607010,92,0.198483,0.270823,0.27092,7
1429697607051,92,0.207675,0.268733,0.272685,18
1429697607077,92,0.187481,0.214519,0.217256,40
1429697607119,92,0.134951,0.108462,0.111367,62
1429697607145,92,0.0598085,-0.0203463,-0.0140937,74
1429697607187,92,-0.00241953,-0.118402,-0.104073,73
1429697607210,92,-0.0374705,-0.156317,-0.131057,65
1429697607251,92,-0.0322942,-0.135108,-0.100073,54
1429697607278,92,0.0108667,-0.0583213,-0.0229138,43
1429697607319,92,0.07161,0.0367467,0.0651654,37
1429697607346,92,0.110215,0.113776,0.129223,35
1429697607378,92,0.0997614,0.132833,0.135172,37
1429697607410,92,0.0550097,0.104628,0.0987553,38
1429697607446,92,-0.0215087,0.0208428,0.0139302,36
1429697607478,92,-0.0887172,-0.0747202,-0.0784901,33
1429697607510,92,-0.117026,-0.136202,-0.136001,27
1429697607557,92,-0.115848,-0.149715,-0.146352,19
1429697607579,92,-0.100639,-0.128551,-0.126973,16
1429697607623,92,-0.0795858,-0.084291,-0.0868923,14
1429697607646,92,-0.0690575,-0.0446921,-0.0553876,25
1429697607688,92,-0.0677343,-0.0254222,-0.0447724,44
1429697607729,92,-0.0541676,-0.00671337,-0.0314878,70
1429697607771,92,-0.0254241,0.0127073,-0.00850042,71
1429697607813,92,0.00319659,0.0197879,0.00914615,59
1429697607854,92,0.0161251,0.0135684,0.0153214,43
1429697607896,92,0.0383689,0.0267432,0.0365587,19
1429697607938,92,0.0560919,0.0480691,0.0607821,12
1429697607980,92,0.0551785,0.054932,0.0651907,17
1429697608022,92,0.0488946,0.0573112,0.0623485,19
1429697608063,92,0.0416423,0.0559236,0.0566015,14
