1429008795357,108,0.135104,0.136714,0.157467,21
1429008795399,108,0.144329,0.177722,0.223602,60
1429008795425,109,0.11218,0.181645,0.232539,73
1429008795457,109,0.0501584,0.134844,0.167977,49
1429008795490,109,-0.0102875,0.067586,0.0752732,39
1429008795525,109,-0.0565427,-0.00735737,-0.0212672,37
1429008795557,109,-0.0739244,-0.0704148,-0.0906266,27
1429008795590,109,-0.0624388,-0.0993066,-0.110823,34
1429008795625,109,-0.0374701,-0.0951904,-0.0957979,74
1429008795657,109,-0.0182683,-0.0729782,-0.0643974,60
1429008795694,109,-0.0144476,-0.0491926,-0.0406284,40
1429008795725,109,-0.0407027,-0.0463091,-0.0429247,39
1429008795757,109,-0.0482658,-0.0302975,-0.0309606,31
1429008795790,109,-0.0472345,-0.0207481,-0.026418,22
1429008795826,109,-0.0260005,-0.0117386,-0.0169409,49
1429008795857,110,0.0164365,0.00456487,0.00867374,75
1429008795890,110,0.0676979,0.0271997,0.0440471,46
1429008795926,110,0.0857057,0.0378747,0.0587313,33
1429008795958,110,0.0675501,0.0395365,0.047266,38
1429008795990,110,0.0403893,0.0382946,0.0248545,30
1429008796025,110,0.00738406,0.0299343,-0.00532202,27
1429008796060,110,-0.00749737,0.0219407,-0.0206171,66
1429008796090,110,0.00231964,0.019379,-0.0101092,68
1429008796126,110,0.0135184,0.0132025,0.0105903,41
1429008796158,110,0.0255761,0.00936403,0.0310184,41
1429008796190,110,0.00356032,-0.010338,0.0201697,35
1429008796226,110,-0.0412546,-0.0425278,-0.0182027,27
1429008796257,110,-0.0875263,-0.0705211,-0.0579396,45
1429008796290,110,-0.112859,-0.0845784,-0.0807806,82
1429008796325,110,-0.112013,-0.085389,-0.0860357,65
1429008796357,110,-0.0878584,-0.0688091,-0.0736577,60
1429008796390,110,-0.0663463,-0.0473449,-0.0565971,56
1429008796425,110,-0.0348155,-0.0141482,-0.0249478,41
1429008796457,110,0.00516608,0.0261742,0.017395,36
1429008796490,110,0.0674144,0.0736054,0.0723739,78
1429008796525,110,0.104326,0.0907116,0.0947009,78
1429008796557,110,0.108507,0.0805029,0.0824512,53
1429008796589,110,0.0793181,0.0500705,0.0473501,44
1429008796626,110,0.0343008,0.0153922,0.00682861,38
1429008796658,110,-0.0203725,-0.0214631,-0.0353294,25
1429008796689,110,-0.0497579,-0.0446824,-0.0567024,40
1429008796725,110,-0.0388161,-0.0498532,-0.0504892,83
1429008796757,110,-0.00416626,-0.0339787,-0.0190198,69
1429008796790,110,0.0475494,0.0119907,0.0433248,49
1429008796825,110,0.105516,0.0757667,0.115248,42
1429008796859,110,0.124716,0.115283,0.149425,31
1429008796890,110,0.105046,0.111973,0.130326,20
1429008796925,110,0.0460712,0.0612478,0.0595961,36
1429008796960,110,-0.00932036,0.000232421,-0.0170136,77
1429008796990,110,-0.0412487,-0.0489023,-0.072157,59
1429008797033,110,-0.077901,-0.0888888,-0.114033,40
1429008797061,110,-0.0841901,-0.0939227,-0.119681,37
1429008797090,110,-0.107662,-0.0956033,-0.125141,24
1429008797127,110,-0.103225,-0.0727732,-0.103213,14
1429008797157,110,-0.0874765,-0.0442809,-0.0674194,14
1429008797190,110,-0.0662874,-0.0183375,-0.0292521,53
1429008797228,110,-0.0378873,-0.000417565,-0.000410433,73
1429008797259,110,-0.0188487,0.00461611,0.00859266,53
1429008797292,110,-0.0093426,-0.00114432,-0.00263107,42
1429008797328,110,0.029967,0.00800595,0.00213301,42
1429008797360,110,0.0465684,0.00545024,0.00174888,32
1429008797390,110,0.0747977,0.0230602,0.0351626,20
1429008797429,110,0.0748571,0.0328814,0.0631769,13
1429008797457,110,0.0551322,0.036267,0.0768564,49
1429008797499,109,0.0287202,0.0340025,0.07611,64
1429008797528,109,0.0107585,0.02745,0.0613585,46
1429008797560,109,0.00632189,0.016102,0.0384845,33
1429008797592,109,-0.00234123,-0.00755069,0.00134804,35
1429008797628,109,-0.0112738,-0.0234151,-0.0287986,31
1429008797659,109,-0.0106786,-0.0084664,-0.0199679,22
1429008797689,109,0.00971152,0.0287312,0.0100195,16
1429008797726,109,0.0317164,0.0648603,0.0473793,57
1429008797757,108,0.0422073,0.0719859,0.0520891,69
1429008797799,108,0.0477369,0.0562119,0.0373118,37
1429008797841,108,0.0571561,0.0408512,0.0237833,33
1429008797883,108,0.0623329,0.0260122,0.0112581,24
1429008797925,108,0.0521521,0.00898155,-0.00397371,16
1429008797968,108,-0.0101489,-0.042799,-0.0605657,65
1429008798011,108,-0.068815,-0.0883771,-0.103332,47
1429008798053,108,-0.128788,-0.131402,-0.139737,30
1429008798095,108,-0.138977,-0.132346,-0.125632,25
1429008798137,108,-0.0944103,-0.0858765,-0.0637908,14
1429008798179,108,-0.0276391,-0.0208559,0.0085705,54
1429008798221,108,0.0344461,0.0350332,0.0622768,65
1429008798262,108,0.0245928,0.0364562,0.0487648,38
1429008798305,108,-0.0217918,0.00418611,-0.00418228,36
1429008798346,108,-0.0448108,-0.0122814,-0.0280678,21
1429008798387,108,-0.0344092,0.00170687,-0.00667703,42
1429008798429,108,-0.00264561,0.0313191,0.0371978,76
1429008798474,108,0.0545113,0.0752643,0.0957372,45
1429008798486,108,0.0686982,0.0801476,0.0992754,42
1429008798527,108,0.0682614,0.0640455,0.0702688,38
1429008798570,108,0.0410611,0.0270883,0.0132512,25
1429008798582,108,-0.00696306,-0.0197676,-0.0469651,40
1429008798625,108,-0.0219499,-0.0278704,-0.045317,81
1429008798667,109,-0.0206754,-0.0218474,-0.0202442,53
1429008798711,109,0.0168941,0.0105148,0.0383603,41
1429008798722,109,0.0566079,0.0372634,0.0792317,40
1429008798764,109,0.0891698,0.0475439,0.0857799,26
1429008798807,109,0.0640937,0.00919291,0.0228463,57
1429008798849,110,0.0107929,-0.0378477,-0.0517389,68
1429008798860,110,-0.0720083,-0.0884729,-0.123067,52
1429008798903,110,-0.110424,-0.090185,-0.128033,37
1429008798916,110,-0.0892625,-0.0524089,-0.079955,36
1429008798957,110,-0.0313366,-0.00250043,-0.0175866,24
1429008799002,110,0.0205471,0.0359755,0.0326393,49
1429008799017,110,0.0253323,0.0333501,0.033009,65
1429008799058,111,0.00371759,0.0106996,0.00498145,52
1429008799100,111,0.00195686,0.00889132,0.00212058,33
1429008799112,111,0.0232043,0.0264721,0.0232319,33
1429008799154,111,0.055832,0.0550537,0.0656805,23
1429008799167,111,0.0467834,0.0466298,0.0623247,18
1429008799209,111,0.0160988,0.0163904,0.0302457,32
1429008799222,111,-0.0229404,-0.0222654,-0.0161742,59
1429008799264,112,-0.0105926,-0.0227411,-0.0196094,47
1429008799276,112,-0.00792377,-0.0215249,-0.0187268,38
1429008799318,112,0.013479,-0.00106674,0.0113617,29
1429008799331,112,-0.0069297,-0.00787739,0.0088854,28
1429008799373,112,-0.0209311,-0.0128737,0.00635213,18
1429008799390,112,-0.0403391,-0.0227326,-0.00538335,13
1429008799432,112,-0.0385308,-0.0247609,-0.0112713,26
1429008799457,112,-0.007629,-0.00535663,0.00599741,61
1429008799490,112,0.026696,0.0231485,0.0355211,50
1429008799528,112,0.0270812,0.03079,0.0362499,31
1429008799557,112,-0.0245421,-0.00234987,-0.0163094,34
1429008799590,112,-0.0696418,-0.0393313,-0.074511,26
1429008799626,112,-0.103603,-0.0751638,-0.124088,17
1429008799657,112,-0.0736305,-0.0641954,-0.113029,22
1429008799690,112,0.0178562,-0.00119093,-0.030997,64
1429008799725,112,0.0945797,0.055051,0.0407129,53
1429008799757,112,0.106188,0.0814956,0.079639,34
1429008799790,112,0.0498276,0.046276,0.043859,35
1429008799825,112,-0.0254147,0.00952505,0.00753853,28
1429008799858,112,-0.0901136,-0.0308857,-0.0282244,19
1429008799889,112,-0.0884688,-0.034909,-0.0172341,19
1429008799925,112,-0.0184429,-0.00539323,0.0319445,63
1429008799957,112,0.0725429,0.0261052,0.0780015,63
1429008799989,112,0.114102,0.0300891,0.0809409,40
1429008800025,112,0.113476,0.0166991,0.0542947,36
1429008800057,112,0.0525422,-0.0187489,-0.00587434,32
1429008800089,112,0.0207618,-0.0245803,-0.0383258,22
1429008800125,112,0.00876595,-0.00441226,-0.0322702,17
1429008800157,112,0.0100972,0.0209044,-0.00569003,54
1429008800189,112,-0.00225363,0.0290951,0.0132379,66
1429008800225,112,-0.0359639,0.00356944,-0.000898767,44
1429008800257,112,-0.064974,-0.0266423,-0.0262285,37
1429008800289,112,-0.0734136,-0.0425634,-0.0443534,36
1429008800325,112,-0.0634974,-0.0402617,-0.0501406,25
1429008800357,112,-0.0634054,-0.0378093,-0.0557443,19
1429008800399,112,-0.0772837,-0.0410763,-0.0643643,46
1429008800425,112,-0.0426911,-0.009128,-0.027975,67
1429008800457,112,0.0133045,0.0322748,0.0195181,49
1429008800489,112,0.0502019,0.0540671,0.0475591,37
1429008800525,112,0.0823806,0.0671152,0.0643832,35
1429008800557,112,0.0764725,0.0555015,0.0543719,28
1429008800589,112,0.08927,0.0573907,0.0613194,21
1429008800625,112,0.0515091,0.0299367,0.0357394,52
1429008800657,112,0.0265636,0.0129348,0.0206369,67
1429008800690,112,0.000701396,-0.00220883,0.00818341,45
1429008800725,112,-0.0164657,-0.01767,-0.00023536,38
1429008800757,112,-0.0326779,-0.0329824,-0.0126686,37
1429008800792,112,-0.0436486,-0.0473851,-0.0270657,27
1429008800825,112,-0.0633696,-0.063335,-0.0462634,22
1429008800859,112,-0.0923782,-0.0878955,-0.0763977,56
1429008800889,113,-0.11597,-0.107223,-0.106268,67
1429008800926,113,-0.100673,-0.100473,-0.109401,45
1429008800960,113,-0.0668062,-0.0655278,-0.082131,39
1429008800990,113,-0.0389497,-0.0286809,-0.0478521,36
1429008801028,113,-0.0182083,0.00606308,-0.00921946,26
1429008801059,113,0.0318427,0.0616429,0.0566897,21
1429008801090,113,0.112899,0.12816,0.133908,55
1429008801127,112,0.147553,0.146578,0.153405,71
1429008801160,112,0.164339,0.143117,0.145125,51
1429008801189,112,0.132375,0.0950352,0.088011,42
1429008801228,112,0.0949223,0.0509824,0.0403006,39
1429008801260,112,0.074725,0.024441,0.0146676,28
1429008801294,112,0.071099,0.0148134,0.0200122,21
1429008801328,112,0.0475353,-0.00394404,0.0128982,19
1429008801358,112,-0.0348986,-0.0595693,-0.0379178,59
1429008801390,112,-0.142849,-0.120828,-0.10504,71
1429008801426,112,-0.200747,-0.150386,-0.14377,48
1429008801460,112,-0.222492,-0.155683,-0.158747,40
1429008801493,112,-0.172274,-0.11282,-0.120309,37
1429008801525,112,-0.0952491,-0.0526257,-0.0614108,27
1429008801559,112,-0.0160125,0.00816662,-0.00185601,21
1429008801591,112,0.028491,0.0402569,0.0288477,17
1429008801628,112,0.0428597,0.0483032,0.0385321,18
1429008801660,112,-0.0114366,0.00216936,-0.0129893,54
1429008801697,112,-0.0513574,-0.0363369,-0.0553862,64
1429008801724,112,-0.0609121,-0.0546899,-0.0768039,46
1429008801759,112,0.000533739,-0.0173133,-0.0390513,37
1429008801790,112,0.0867801,0.0469367,0.0252557,36
1429008801828,112,0.13303,0.0920773,0.0675899,26
1429008801860,112,0.122123,0.0975921,0.0711786,21
1429008801897,112,0.0851803,0.0782791,0.0590951,15
1429008801925,112,0.067916,0.063141,0.0647241,15
1429008801968,112,0.0569667,0.0479085,0.0739319,66
1429008802009,112,0.0686533,0.0444605,0.0949479,54
1429008802051,112,0.0500915,0.0268977,0.0879226,37
1429008802094,112,-0.000210402,-0.00350018,0.0498227,35
1429008802136,112,-0.07838,-0.0466555,-0.0140785,23
1429008802178,112,-0.142958,-0.0799118,-0.0709189,17
1429008802220,112,-0.163535,-0.0872011,-0.0895077,26
1429008802261,112,-0.094711,-0.0442051,-0.0436099,68
1429008802304,112,-0.00378129,0.00604521,0.0113967,46
1429008802345,112,0.132917,0.0803122,0.095272,35
1429008802387,112,0.197791,0.125383,0.137749,31
1429008802429,112,0.201709,0.138119,0.145175,20
1429008802471,112,0.131314,0.10322,0.098927,15
1429008802513,112,0.0050519,0.0184825,-0.00215339,44
1429008802555,112,-0.0952214,-0.0641825,-0.100235,68
1429008802597,112,-0.13969,-0.113062,-0.161062,43
1429008802609,112,-0.120949,-0.116631,-0.166092,38
1429008802621,112,-0.0744559,-0.0933892,-0.134874,38
1429008802662,112,-0.0237627,-0.0560152,-0.0740107,32
1429008802704,112,0.00289538,-0.0242321,-0.0144536,21
1429008802745,112,0.00372504,-0.00928287,0.0230187,15
1429008802787,112,-0.0347594,-0.0202437,0.0238682,39
1429008802828,112,-0.0736023,-0.0344576,0.00512837,73
1429008802869,112,-0.093838,-0.0467546,-0.0183421,50
1429008802911,112,-0.0599255,-0.0295676,-0.0139933,40
1429008802952,112,0.0101468,0.00655707,0.0122832,34
1429008802993,112,0.100861,0.0646314,0.0640606,23
1429008803035,112,0.166314,0.108736,0.102839,17
1429008803076,112,0.156806,0.115687,0.10346,28
1429008803119,112,0.0996438,0.0899616,0.070116,76
1429008803160,112,0.0145558,0.0477338,0.0271856,54
1429008803202,112,-0.0723314,-0.00948395,-0.0280199,41
1429008803244,112,-0.102603,-0.0340692,-0.0462217,36
1429008803286,112,-0.0798305,-0.0288092,-0.0343435,24
1429008803328,112,-0.0206462,0.0045807,0.000305428,18
1429008803369,112,0.0384685,0.0340305,0.0315622,33
1429008803412,112,0.043701,0.026613,0.0276476,77
1429008803423,112,0.026612,0.000877072,0.0100923,71
1429008803465,112,-0.0124328,-0.0359442,-0.0165708,47
1429008803507,112,-0.0323416,-0.0582755,-0.0347171,45
1429008803519,112,-0.0288595,-0.0597271,-0.0369026,41
1429008803560,112,-0.00391931,-0.0442707,-0.0261043,28
1429008803601,112,-0.00856506,-0.0433453,-0.0305117,21
1429008803643,112,-0.0257846,-0.0463492,-0.0424558,59
1429008803685,112,-0.0405,-0.0401523,-0.0456911,77
1429008803727,112,-0.019516,-0.00169591,-0.0121234,49
1429008803739,112,0.0414229,0.0622109,0.0517485,46
1429008803781,112,0.108424,0.116162,0.107641,43
1429008803793,112,0.112342,0.107776,0.0953994,39
1429008803835,112,0.0869573,0.0695921,0.0517674,26
1429008803848,112,0.0102913,-0.00105521,-0.026451,22
1429008803891,112,-0.0519359,-0.0502119,-0.0802745,34
1429008803933,112,-0.0593388,-0.0531761,-0.0762774,83
1429008803945,109,-0.0280251,-0.01895,-0.0275304,76
1429008803989,109,-0.00248939,0.0125331,0.0189114,51
1429008804004,109,-0.00538004,0.0220072,0.0344231,47
1429008804016,109,-0.0505981,-0.00726727,0.00369429,47
1429008804057,109,-0.101861,-0.0524596,-0.0461073,36
1429008804069,109,-0.131982,-0.092567,-0.0867844,31
1429008804110,109,-0.0983735,-0.0899496,-0.0778374,19
1429008804125,109,-0.0193642,-0.0535257,-0.0348392,16
1429008804167,109,0.0741013,0.00633069,0.0282784,46
1429008804189,109,0.143348,0.069599,0.0962808,81
1429008804225,106,0.165354,0.108759,0.134097,66
1429008804257,106,0.127065,0.113014,0.13271,47
1429008804293,106,0.0464387,0.0737514,0.08223,45
1429008804325,106,-0.050113,0.00774659,0.00374707,36
1429008804357,106,-0.121141,-0.0558786,-0.0719124,24
1429008804389,106,-0.121768,-0.0763158,-0.101146,16
1429008804425,106,-0.0683592,-0.0562119,-0.0848639,11
1429008804457,106,0.00973266,-0.00887066,-0.0376492,49
1429008804495,106,0.0600314,0.0279281,0.00379688,80
1429008804526,106,0.0727156,0.0412389,0.0243284,58
1429008804557,106,0.0780456,0.0468395,0.0411941,44
1429008804589,106,0.043047,0.0203568,0.0211152,42
1429008804626,106,0.0143167,0.000627515,0.00614372,30
1429008804657,106,-0.00936842,-0.0137066,-0.00958772,19
1429008804694,106,-0.0380997,-0.029969,-0.032678,13
1429008804727,106,-0.041565,-0.0286826,-0.0337218,15
1429008804757,106,-0.0451289,-0.0272691,-0.0309422,77
1429008804789,102,-0.0456049,-0.0263419,-0.0202895,73
1429008804826,102,-0.0550175,-0.0371262,-0.0199545,53
1429008804858,102,-0.0647218,-0.0525273,-0.0266287,45
1429008804893,102,-0.0730103,-0.0697377,-0.0441482,38
1429008804925,102,-0.0355933,-0.0513145,-0.0280775,27
1429008804957,102,0.0141012,-0.00574807,0.0102954,16
1429008804991,102,0.041,0.0321699,0.0393643,10
1429008805025,102,0.033483,0.0556018,0.0501944,23
1429008805057,102,0.00715767,0.0561292,0.0436922,81
1429008805093,97,0.00976317,0.0582452,0.0451524,75
1429008805125,97,0.0117927,0.0426833,0.0318698,52
1429008805157,97,0.0297828,0.0278888,0.0180272,46
1429008805192,97,0.024731,-0.00279401,-0.0182806,39
1429008805226,97,0.0335602,-0.0124919,-0.034365,24
1429008805257,97,0.0337542,-0.0124264,-0.034772,14
1429008805294,97,0.0418775,0.0080551,-0.00540937,8
1429008805325,97,0.0452573,0.0259106,0.0228972,28
1429008805359,97,0.0455599,0.0403592,0.0484207,83
1429008805392,93,0.0465711,0.046901,0.059122,71
1429008805425,93,0.0400696,0.0396915,0.052048,49
1429008805459,93,0.0163269,0.0168869,0.0293279,45
1429008805494,93,-0.00620085,-0.00411962,0.0118637,36
1429008805525,93,-0.0287699,-0.0264172,-0.00660629,22
1429008805560,93,-0.0636466,-0.0583077,-0.040857,13
1429008805593,93,-0.0934056,-0.0859284,-0.0783492,7
1429008805625,93,-0.090158,-0.0854299,-0.0893978,42
1429008805657,93,-0.0685088,-0.0665961,-0.0813114,81
1429008805693,90,-0.0143114,-0.0214447,-0.041618,60
1429008805727,90,0.0203807,0.0132074,-0.00309941,43
1429008805760,90,0.0437045,0.0368483,0.0313185,42
1429008805790,90,0.0133815,0.0230202,0.0269153,29
1429008805826,90,-0.0163973,0.00816217,0.0169449,17
1429008805859,90,-0.0384208,-0.00400424,0.00148705,9
1429008805894,90,-0.041958,-0.00884367,-0.0101083,19
1429008805928,90,-0.0090371,0.00287326,-0.00460325,77
1429008805960,88,0.00976685,0.00864383,-0.00193068,72
1429008805992,88,0.0362992,0.0267038,0.0189621,51
1429008806025,88,0.0477603,0.0418116,0.040705,43
1429008806060,88,0.0478016,0.046902,0.0526057,41
1429008806096,88,0.0338438,0.0359292,0.0464595,28
1429008806125,88,0.0172188,0.00800235,0.0200583,13
1429008806157,88,0.0159566,-0.0107986,0.00145025,8
1429008806200,88,0.0235985,-0.016447,-0.004798,70
1429008806241,87,0.0585594,0.01138,0.0245384,77
1429008806283,87,0.0632969,0.0310766,0.0429375,49
1429008806325,87,0.0294914,0.023616,0.0289326,44
1429008806367,87,-0.0459859,-0.016308,-0.0190604,29
1429008806409,87,-0.1007,-0.0574175,-0.066242,15
1429008806451,87,-0.115817,-0.0720316,-0.0817241,7
1429008806492,87,-0.101563,-0.0689794,-0.0774022,67
1429008806533,85,-0.0583721,-0.0431596,-0.0520892,81
1429008806575,85,-0.00812236,-0.0109198,-0.0202543,54
1429008806616,85,0.0414892,0.0260678,0.016115,49
1429008806657,85,0.0855699,0.0633535,0.0545237,76
1429008806846,85,0.106743,0.0869272,0.0824833,69
1429008806887,85,0.0922406,0.080187,0.0773367,46
1429008806929,85,0.0447201,0.0434826,0.0408207,47
1429008806971,85,0.00291516,0.00886642,1.22374e-05,33
1429008807012,85,-0.0355054,-0.0343331,-0.0545949,24
1429008807054,85,-0.0303828,-0.0431168,-0.0651397,63
1429008807096,86,-0.00957616,-0.0201955,-0.025913,77
1429008807137,86,0.0116113,0.0146156,0.0368283,49
1429008807178,86,-0.013512,0.0154469,0.0610971,43
1429008807219,86,-0.0499175,-0.00520974,0.0478199,29
1429008807261,86,-0.0970381,-0.0629483,-0.0270788,15
1429008807303,86,-0.105421,-0.096401,-0.0843204,67
1429008807344,87,-0.0921508,-0.101853,-0.112755,75
1429008807385,87,-0.0538113,-0.0735858,-0.095774,50
1429008807427,87,0.0219078,-0.00599953,-0.0281289,45
1429008807468,87,0.0786084,0.0473199,0.0292253,32
1429008807481,87,0.118581,0.0855985,0.0735786,28
1429008807523,87,0.109761,0.0974839,0.0918523,43
1429008807535,87,0.103518,0.107853,0.106003,77
1429008807576,90,0.0692315,0.0933098,0.0912618,82
1429008807618,90,0.0227049,0.0516307,0.0448648,59
1429008807659,90,-0.0351009,-0.0143436,-0.0281609,55
1429008807671,90,-0.0773251,-0.0795459,-0.0987143,49
1429008807682,90,-0.114478,-0.133031,-0.15326,42
1429008807724,90,-0.0968809,-0.130125,-0.14235,23
1429008807765,90,-0.033948,-0.0744558,-0.0712559,51
1429008807777,90,0.0270289,0.00371271,0.0257475,74
1429008807818,92,0.0462707,0.0543291,0.0918999,70
1429008807860,92,0.0400025,0.0757629,0.119946,45
1429008807871,92,0.0116606,0.056222,0.0975385,40
1429008807912,92,0.00552102,0.0291034,0.060426,28
1429008807925,92,-0.000461801,0.000471118,0.0157978,22
1429008807967,92,0.0128366,-0.00353934,-0.00202781,7
1429008807995,92,0.0271653,0.00696267,-0.00390926,10
1429008808025,92,0.0536356,0.0367105,0.0150797,63
1429008808066,94,0.0620528,0.0524719,0.0250155,66
1429008808095,94,0.0360155,0.0363592,0.00643249,41
1429008808125,94,-0.0215912,-0.00871534,-0.0378462,31
1429008808167,94,-0.102673,-0.070798,-0.098202,17
1429008808194,94,-0.137581,-0.0958867,-0.122375,6
1429008808224,94,-0.126914,-0.0852939,-0.10887,0
1429008808266,94,-0.0345738,-0.0210134,-0.0348814,14
1429008808292,94,0.0481249,0.0337629,0.0332277,67
1429008808334,94,0.113893,0.0713841,0.0820278,60
1429008808357,94,0.120617,0.0692849,0.0866638,40
1429008808399,94,0.0904087,0.0456776,0.0641511,30
1429008808425,94,0.0354755,0.00882981,0.0259706,24
1429008808457,94,-0.0350915,-0.0349697,-0.0183709,12
1429008808493,94,-0.061107,-0.0462477,-0.0262879,11
1429008808525,94,-0.0656488,-0.0425995,-0.0184151,58
1429008808557,94,-0.0448955,-0.0288344,-0.000689933,63
1429008808593,94,-0.0170313,-0.00406198,0.0236852,38
1429008808626,94,-0.00610287,0.00462025,0.0247145,28
1429008808657,94,-0.0125633,-0.00203419,0.00160283,26
1429008808693,94,-0.0123987,-0.0102463,-0.0246186,14
1429008808725,94,-0.00654252,-0.0111388,-0.0429037,23
1429008808757,94,0.00741206,-0.00858121,-0.045046,68
1429008808795,94,0.00412835,-0.00735009,-0.0397397,64
1429008808826,94,-0.00792943,-0.00872332,-0.0283133,41
1429008808857,94,-0.00474901,0.0014706,-0.0107971,31
1429008808893,94,0.0151116,0.0226921,0.0171724,23
1429008808925,94,0.0274392,0.035329,0.0344803,8
1429008808957,94,0.0385133,0.0459834,0.047476,22
1429008808993,94,0.0471317,0.0524878,0.0503161,73
1429008809025,94,0.0646506,0.0580939,0.0514608,59
1429008809057,94,0.0701233,0.050227,0.0381283,34
1429008809094,94,0.0539402,0.0285226,0.0207866,29
1429008809125,94,0.00425109,-0.0142584,-0.00893643,21
1429008809158,94,-0.0610567,-0.0590214,-0.0379456,6
1429008809193,94,-0.145062,-0.110902,-0.078466,44
1429008809225,94,-0.165406,-0.1188,-0.0851719,75
1429008809258,94,-0.138024,-0.0962765,-0.070337,52
1429008809293,94,-0.042249,-0.0306201,-0.0164946,32
1429008809325,94,0.055088,0.0352011,0.0378205,32
1429008809359,94,0.114253,0.0739647,0.0698171,22
1429008809393,94,0.0988559,0.061763,0.0578041,16
1429008809425,94,0.0489566,0.0260935,0.0265003,62
1429008809460,94,-0.0278976,-0.0275074,-0.0248284,71
1429008809497,94,-0.0616732,-0.0466019,-0.0467668,38
1429008809525,94,-0.0129294,-0.0005858,-0.00962416,35
1429008809559,94,0.0860938,0.0805156,0.0577478,31
1429008809593,94,0.180756,0.150845,0.121842,16
1429008809625,94,0.212486,0.167914,0.139679,30
1429008809660,94,0.189371,0.140249,0.120561,78
1429008809693,94,0.075625,0.0485414,0.0416431,56
1429008809728,94,-0.0500999,-0.0466135,-0.0387439,31
1429008809760,94,-0.129465,-0.096994,-0.0818937,31
1429008809795,94,-0.145892,-0.095727,-0.0799122,21
1429008809828,94,-0.127036,-0.0725155,-0.0659164,12
1429008809860,94,-0.115744,-0.0658519,-0.0714569,48
1429008809896,94,-0.120586,-0.0758315,-0.0913774,73
1429008809929,94,-0.143986,-0.103345,-0.118482,50
1429008809958,94,-0.170963,-0.134272,-0.137093,37
1429008809993,94,-0.152112,-0.127928,-0.111039,37
1429008810028,94,-0.0993399,-0.0989371,-0.0643617,27
1429008810059,94,-0.020115,-0.0365609,0.00755464,19
1429008810095,94,0.06758,0.0333906,0.0711949,62
1429008810128,94,0.118252,0.0911559,0.113484,73
1429008810160,94,0.129833,0.116738,0.120732,49
1429008810195,94,0.104208,0.111434,0.0989971,33
1429008810228,94,0.0953704,0.0943125,0.0733884,34
1429008810260,94,0.0864149,0.0716264,0.0466322,28
1429008810296,94,0.0914518,0.0525527,0.027468,18
1429008810325,94,0.101033,0.0422761,0.0197011,25
1429008810360,94,0.099129,0.0330478,0.0117042,71
1429008810395,94,0.0868295,0.0289345,0.00722679,48
1429008810426,94,0.0187226,-0.00354067,-0.0250932,31
1429008810468,94,-0.0366056,-0.0265832,-0.0435252,33
1429008810510,94,-0.0900965,-0.0488119,-0.0584626,20
1429008810552,94,-0.0915948,-0.0434784,-0.0430544,46
1429008810595,94,-0.0329922,0.00466813,0.0086761,67
1429008810608,94,0.0549626,0.0705258,0.0763508,48
1429008810650,94,0.09727,0.0834391,0.0890229,36
1429008810692,94,0.115423,0.0929106,0.0977348,33
1429008810734,94,0.0516901,0.0504346,0.0602331,19
1429008810776,94,-0.00694465,0.0182049,0.0380746,65
1429008810818,94,-0.0844349,-0.0319489,0.0019504,62
1429008810860,94,-0.110236,-0.0629284,-0.017773,39
1429008810902,94,-0.131331,-0.100853,-0.0574262,39
1429008810943,94,-0.146246,-0.143395,-0.111727,24
1429008810984,94,-0.156008,-0.178446,-0.166428,51
1429008811026,97,-0.161934,-0.19536,-0.203547,76
1429008811068,97,-0.124447,-0.166196,-0.189957,46
1429008811110,97,-0.0624341,-0.102678,-0.127461,42
1429008811152,97,0.0269994,-0.00680818,-0.025087,32
1429008811193,97,0.0751288,0.060626,0.0494509,29
1429008811236,97,0.0710519,0.0941285,0.0800219,76
1429008811278,100,0.0296115,0.0935872,0.0682238,55
1429008811319,100,0.0104233,0.0888149,0.050958,40
1429008811361,100,0.0653673,0.121392,0.08055,34
1429008811403,100,0.139044,0.154382,0.120034,19
1429008811445,100,0.215402,0.193014,0.170151,25
1429008811457,100,0.256554,0.215174,0.198117,44
1429008811499,100,0.218617,0.188008,0.1735,68
1429008811511,100,0.119981,0.106491,0.0933634,51
1429008811553,100,0.0205889,0.0140941,0.0103663,36
1429008811566,100,-0.0169324,-0.0453479,-0.0330533,37
1429008811607,100,0.00735301,-0.058473,-0.0240901,26
1429008811649,100,-0.0103159,-0.101048,-0.0354584,14
1429008811661,100,-0.0808322,-0.168444,-0.0778057,12
1429008811703,100,-0.238262,-0.272097,-0.164843,58
1429008811744,100,-0.424635,-0.374507,-0.272718,59
1429008811786,100,-0.499419,-0.38311,-0.310084,38
1429008811798,100,-0.442054,-0.314171,-0.287146,39
1429008811840,100,-0.226059,-0.144494,-0.16995,34
1429008811883,100,0.100726,0.119132,0.0547722,76
1429008811986,100,0.344337,0.34978,0.263621,56
1429008812048,100,0.448526,0.472592,0.381997,40
1429008812061,100,0.443025,0.497844,0.396654,40
1429008812103,100,0.324231,0.389256,0.281541,28
1429008812115,100,0.172483,0.205224,0.0995,23
1429008812156,100,0.0527532,0.0347723,-0.0643351,16
1429008812198,100,0.0508772,-0.0277345,-0.105303,68
1429008812210,100,0.0202129,-0.0941578,-0.133213,79
1429008812251,100,0.0497153,-0.0560809,-0.0649834,57
1429008812264,100,-0.0182665,-0.0943333,-0.0792433,45
1429008812275,100,-0.0741386,-0.0939179,-0.0573859,42
1429008812317,100,-0.0921969,-0.0721193,-0.0137633,38
1429008812328,100,-0.125439,-0.0977738,0.000764604,29
1429008812370,100,-0.164442,-0.160351,-0.0240095,17
1429008812393,100,-0.152736,-0.180301,-0.0359822,14
1429008812434,100,-0.17829,-0.222496,-0.0934116,44
1429008812457,100,-0.166911,-0.182512,-0.0982446,78
1429008812499,100,-0.149616,-0.122297,-0.0830136,56
1429008812525,100,-0.112466,-0.0595996,-0.0556963,43
1429008812567,100,-0.0408075,-0.00967834,-0.0321495,40
1429008812593,100,0.0207982,-0.00568768,-0.0389495,30
1429008812624,100,-0.0323962,-0.0932321,-0.136868,19
1429008812667,100,-0.0816028,-0.127256,-0.175901,11
1429008812693,100,-0.105158,-0.0880881,-0.149942,10
1429008812725,100,0.0373104,0.12073,0.0525254,58
1429008812757,100,0.252709,0.380722,0.30404,68
1429008812793,100,0.419102,0.542962,0.466689,44
1429008812825,100,0.414556,0.480779,0.424044,39
1429008812857,100,0.329643,0.321825,0.274529,33
1429008812893,100,0.0971505,0.027727,-0.013524,20
1429008812925,100,-0.135528,-0.242864,-0.281439,12
1429008812956,100,-0.187817,-0.306232,-0.323763,8
1429008812992,100,-0.163335,-0.266462,-0.258737,15
1429008813025,100,-0.117729,-0.213585,-0.18302,67
1429008813056,100,-0.0339916,-0.106663,-0.0444192,59
1429008813093,100,0.00117442,0.0576317,0.155662,38
1429008813125,100,0.0756943,0.295875,0.418334,39
1429008813157,100,0.0973793,0.408946,0.538262,33
1429008813193,100,0.0117613,0.271943,0.380459,19
1429008813224,100,-0.139064,-0.0206255,0.0494639,13
1429008813256,100,-0.317283,-0.391676,-0.379688,11
1429008813293,100,-0.354561,-0.567706,-0.600627,67
1429008813324,100,-0.185109,-0.469373,-0.522495,69
1429008813356,100,0.0186885,-0.233866,-0.30757,43
1429008813393,100,0.176098,0.0121146,-0.0611227,40
1429008813424,100,0.2292,0.172171,0.0960796,35
1429008813459,100,0.150512,0.161817,0.0855877,23
1429008813493,100,0.0494772,0.0897857,0.00813606,14
1429008813525,100,-0.0109911,0.0187355,-0.0483504,19
1429008813556,100,-0.0430444,-0.0658069,-0.135681,72
1429008813593,100,0.0688312,0.023253,-0.0140786,72
1429008813625,100,0.176705,0.195011,0.210837,47
1429008813657,100,0.127258,0.296365,0.353346,42
1429008813693,100,0.0458279,0.280547,0.358725,36
1429008813725,100,-0.145804,0.11736,0.160123,22
1429008813758,100,-0.285384,-0.0708425,-0.0679255,13
1429008813793,100,-0.258245,-0.13155,-0.121925,18
1429008813825,100,-0.136427,-0.0244429,0.0272949,75
1429008813859,100,0.0386102,0.1363,0.251062,76
1429008813893,100,0.159081,0.216324,0.367271,52
1429008813924,100,0.17059,0.100843,0.239032,46
1429008813959,100,0.0788845,-0.180492,-0.121809,40
1429008813993,100,-0.069045,-0.473806,-0.503332,26
1429008814026,100,-0.150309,-0.619491,-0.718222,19
1429008814059,100,-0.126197,-0.517698,-0.652388,13
1429008814093,100,-0.00571464,-0.245124,-0.367263,40
1429008814126,100,0.104381,0.0423063,-0.0480093,84
1429008814159,99,0.164668,0.23511,0.180191,65
1429008814193,99,0.230863,0.362134,0.345761,47
1429008814234,99,0.246313,0.384348,0.390683,44
1429008814259,99,0.223468,0.333846,0.35493,37
1429008814293,99,0.135812,0.242073,0.262906,22
1429008814324,99,-0.0236543,0.0971689,0.100533,16
1429008814359,99,-0.151771,-0.00107306,-0.019192,12
1429008814395,99,-0.174707,-0.0132798,-0.0443487,52
1429008814427,99,-0.0373945,0.0841067,0.0683329,82
1429008814459,96,0.0770496,0.13654,0.149793,61
1429008814495,96,0.119569,0.113477,0.153955,46
1429008814527,96,0.0435504,0.0143927,0.0668508,46
1429008814559,96,-0.0934687,-0.119884,-0.0850819,39
1429008814599,96,-0.216138,-0.215347,-0.194569,25
1429008814624,96,-0.304697,-0.316311,-0.338078,17
1429008814657,96,-0.35465,-0.312615,-0.345402,13
1429008814698,96,-0.306055,-0.2333,-0.260279,40
1429008814741,94,-0.198936,-0.0929752,-0.0956019,78
1429008814783,94,-0.0106793,0.0700468,0.0988093,48
1429008814825,94,0.120671,0.147469,0.195519,46
1429008814867,94,0.190522,0.131017,0.150123,35
1429008814909,94,0.153535,0.0426031,0.0354262,21
1429008814951,94,0.0890028,-0.0693298,-0.107012,15
1429008814992,94,0.116754,-0.0340785,-0.0140497,44
1429008815034,92,0.147432,0.0229678,0.0952671,81
1429008815075,92,0.213862,0.177639,0.283384,51
1429008815116,92,0.272233,0.302503,0.384978,48
1429008815158,92,0.278101,0.349463,0.3813,35
1429008815200,92,0.23691,0.285068,0.254491,21
1429008815240,92,0.163078,0.0955465,0.0340853,15
1429008815282,92,0.0420174,-0.114673,-0.179458,53
1429008815323,91,-0.159986,-0.281506,-0.334797,84
1429008815365,91,-0.317048,-0.288722,-0.33612,57
1429008815410,91,-0.40288,-0.18588,-0.219117,49
1429008815424,91,-0.319461,0.00402701,0.00881163,45
1429008815435,91,-0.211743,0.146742,0.181734,36
1429008815477,91,-0.0607617,0.190966,0.243652,21
1429008815519,91,0.00428575,0.0730429,0.102136,13
1429008815560,91,0.0129032,-0.149935,-0.178662,45
1429008815602,91,-0.0511973,-0.385595,-0.466254,88
1429008815643,90,-0.110555,-0.508472,-0.62888,63
1429008815685,90,-0.169111,-0.489841,-0.618772,52
1429008815726,90,-0.127599,-0.312453,-0.437735,39
1429008815768,90,0.051972,-0.0160245,-0.0852011,22
1429008815809,90,0.20313,0.237055,0.228665,13
1429008815851,90,0.290358,0.380117,0.439987,8
1429008815892,90,0.238258,0.37441,0.476175,46
1429008815934,90,0.161886,0.3049,0.438377,82
1429008815946,90,0.142575,0.249287,0.404466,73
1429008815987,90,0.178014,0.225821,0.377939,53
1429008816030,90,0.234892,0.216305,0.341758,48
1429008816071,90,0.227438,0.191428,0.258404,29
1429008816113,90,0.151098,0.124922,0.122304,18
1429008816155,90,-0.108789,-0.0459045,-0.135529,11
1429008816196,90,-0.347018,-0.195881,-0.326378,30
1429008816238,90,-0.503637,-0.298132,-0.420538,87
1429008816279,90,-0.480338,-0.305077,-0.375009,64
1429008816321,90,-0.315345,-0.254293,-0.276855,51
1429008816364,90,-0.085582,-0.162434,-0.145086,40
1429008816376,90,0.077401,-0.085075,-0.0622244,35
1429008816418,90,0.146209,-0.0319123,-0.00961335,20
1429008816429,90,0.0858611,-0.0155587,-0.00885186,16
1429008816471,90,0.0750828,0.0482503,0.0673209,9
1429008816489,90,0.0730514,0.105017,0.132686,23
1429008816501,90,0.0162829,0.104879,0.117079,46
1429008816542,90,0.0281657,0.105575,0.0860056,87
1429008816556,90,0.0268332,0.0789309,0.0411172,76
1429008816598,90,0.0922473,0.0781774,0.046079,53
1429008816625,90,0.116663,0.049026,0.0402816,51
1429008816667,90,0.0984737,0.00901611,0.0100804,35
1429008816694,90,0.0730345,-0.0315726,-0.0337581,24
1429008816725,90,0.0903473,-0.0119681,-0.0080415,16
1429008816757,90,0.181111,0.072022,0.116892,10
1429008816794,90,0.225338,0.146103,0.234344,26
1429008816825,90,0.145954,0.124886,0.213231,85
1429008816860,90,-0.0448197,0.00596791,0.0420128,82
1429008816893,90,-0.230404,-0.15283,-0.192636,60
1429008816925,90,-0.4037,-0.302718,-0.414415,52
1429008816957,90,-0.435725,-0.351657,-0.481688,40
1429008816993,90,-0.340182,-0.276114,-0.382637,25
1429008817025,90,-0.208774,-0.147068,-0.219932,15
1429008817057,90,-0.0545503,-0.00350466,-0.0276758,9
1429008817093,90,0.0362325,0.0925435,0.107811,12
1429008817125,90,0.146841,0.175389,0.238152,72
1429008817157,90,0.218155,0.213421,0.312145,87
1429008817193,90,0.330388,0.259522,0.392764,63
1429008817225,90,0.378157,0.254055,0.36779,52
1429008817258,90,0.308463,0.202208,0.273553,43
1429008817293,90,0.192377,0.14691,0.172693,27
1429008817325,90,0.060551,0.0920583,0.0770082,18
1429008817357,90,-0.0342816,0.0413726,0.0051575,11
1429008817396,90,-0.0756574,-0.0138452,-0.0738526,5
1429008817425,90,-0.0290169,-0.0452413,-0.0966403,23
1429008817457,90,-0.028663,-0.0973819,-0.160163,82
1429008817493,90,-0.0252469,-0.110645,-0.164759,72
1429008817525,90,-0.0523077,-0.104466,-0.14078,56
1429008817558,90,-0.164888,-0.140996,-0.161469,50
1429008817593,90,-0.226682,-0.152225,-0.143384,39
1429008817627,90,-0.248279,-0.173723,-0.141377,23
1429008817659,90,-0.204639,-0.163094,-0.105905,15
1429008817693,90,-0.107777,-0.112467,-0.04017,9
1429008817736,90,-0.0250898,-0.0507882,0.0261401,7
1429008817760,90,0.0839847,0.0477873,0.126836,48
1429008817794,90,0.128813,0.112774,0.161529,82
1429008817825,90,0.1392,0.144036,0.149597,62
1429008817857,90,0.100659,0.12052,0.086645,50
1429008817893,90,0.0033162,0.0541896,-0.0140347,47
1429008817930,90,-0.079131,-0.0171887,-0.103998,29
1429008817959,90,-0.151244,-0.0730535,-0.16889,19
1429008817993,90,-0.101772,-0.0594342,-0.155017,12
1429008818027,90,-0.0318662,0.00463166,-0.0787983,7
1429008818059,90,0.0479872,0.0716066,0.00840091,44
1429008818094,90,0.0680168,0.101624,0.0684143,84
1429008818129,87,0.072377,0.0973778,0.0970324,64
1429008818160,87,0.0728536,0.0441095,0.0629201,49
1429008818194,87,0.0752853,-0.0166345,0.0112796,46
1429008818227,87,0.00580959,-0.0743398,-0.055239,31
1429008818259,87,0.0140751,-0.0236086,0.0382803,18
1429008818293,87,0.0201728,0.0678096,0.198472,12
1429008818327,87,0.0947323,0.173859,0.371974,10
1429008818360,87,0.112689,0.207511,0.409644,63
1429008818392,87,0.119679,0.19766,0.351487,87
1429008818428,84,0.0185072,0.066408,0.10862,66
1429008818460,84,-0.0537237,-0.117444,-0.189708,52
1429008818495,84,-0.177759,-0.320432,-0.484468,45
1429008818528,84,-0.198872,-0.393536,-0.574563,29
1429008818560,84,-0.146339,-0.357002,-0.507905,17
1429008818593,84,-0.0399045,-0.200715,-0.284092,9
1429008818628,84,-0.000893308,-0.096336,-0.151225,8
1429008818659,84,-0.0321514,-0.0589836,-0.126008,51
1429008818695,84,-0.0883847,-0.0774183,-0.178477,86
1429008818728,83,-0.0943048,-0.0724687,-0.173276,65
1429008818759,83,0.0188105,0.0202104,-0.0331165,52
1429008818796,83,0.146294,0.155344,0.174424,44
1429008818826,83,0.281211,0.306379,0.418562,24
1429008818857,83,0.27931,0.346234,0.480772,13
1429008818899,83,0.228973,0.323979,0.433721,5
1429008818941,83,0.0887642,0.1762,0.209004,3
1429008818983,83,-0.0105858,0.0650476,0.0353162,77
1429008819025,83,-0.0488715,0.0636069,0.0521152,79
1429008819067,83,-0.0642041,0.0837081,0.112532,53
1429008819109,83,-0.133845,0.0672588,0.136099,46
1429008819151,83,-0.186775,0.0145237,0.0909659,27
1429008819193,83,-0.254517,-0.0852307,-0.0324098,13
1429008819235,83,-0.221076,-0.14253,-0.102722,4
1429008819276,83,-0.0501213,-0.0925356,-0.0281632,10
1429008819318,83,0.177381,0.0441381,0.176189,84
1429008819359,82,0.385302,0.18711,0.370096,70
1429008819401,82,0.386917,0.149959,0.285799,49
1429008819443,82,0.207116,-0.0508927,-0.0295671,44
1429008819485,82,-0.0585726,-0.269662,-0.394876,24
1429008819527,82,-0.257573,-0.402356,-0.642955,11
1429008819569,82,-0.383009,-0.431172,-0.748274,6
1429008819581,82,-0.347097,-0.325329,-0.625949,15
1429008819592,82,-0.255337,-0.199504,-0.424607,51
1429008819633,82,-0.0942775,-0.0550106,-0.170953,86
1429008819675,82,0.0789427,0.0621737,0.049797,57
1429008819717,82,0.270392,0.184682,0.254484,52
1429008819759,82,0.329772,0.233019,0.311585,36
1429008819801,82,0.347263,0.280257,0.357809,20
1429008819842,82,0.203661,0.237657,0.270381,12
1429008819884,82,0.049311,0.190651,0.213415,44
1429008819897,82,-0.0967404,0.118345,0.149868,83
1429008819939,83,-0.17789,0.0556464,0.138557,83
1429008819981,83,-0.140588,0.0107146,0.144675,59
1429008819992,83,-0.11632,-0.0330056,0.142761,57
1429008820034,83,-0.106308,-0.0582591,0.117464,45
1429008820076,83,-0.163166,-0.104771,0.0282881,24
1429008820091,83,-0.214419,-0.145279,-0.0852395,20
1429008820102,83,-0.237578,-0.188353,-0.200541,15
1429008820144,83,-0.159294,-0.177003,-0.235619,23
1429008820156,83,-0.0317504,-0.123288,-0.208808,46
1429008820198,83,0.0664154,-0.0539939,-0.157981,92
1429008820210,82,0.101313,-0.00073782,-0.109365,83
1429008820251,82,0.0684584,0.0199697,-0.0813321,62
1429008820294,82,0.0290368,0.0195973,-0.0362501,49
1429008820306,82,0.0196153,0.0244097,0.0334418,42
1429008820348,82,0.0603666,0.0628901,0.136724,24
1429008820389,82,0.140644,0.130104,0.240046,13
1429008820430,82,0.187402,0.182197,0.280584,4
1429008820443,82,0.128134,0.140226,0.154256,2
1429008820485,82,-0.00671696,0.0525235,-0.0104869,55
1429008820497,82,-0.141741,-0.0516692,-0.174054,88
1429008820539,82,-0.205107,-0.0966827,-0.213888,58
1429008820581,82,-0.159374,-0.0605421,-0.129396,47
1429008820594,82,-0.0404181,0.0246998,0.0227838,46
1429008820636,82,0.132871,0.126403,0.195327,40
1429008820657,82,0.233158,0.152441,0.253164,33
1429008820700,82,0.208553,0.0639194,0.146667,26
1429008820725,82,0.124563,-0.0585314,-0.0366871,24
1429008820767,82,-0.0161873,-0.189002,-0.218855,21
1429008820793,82,-0.121718,-0.244863,-0.303422,40
1429008820825,82,-0.116598,-0.176238,-0.208827,64
1429008820857,82,-0.0703509,-0.0747045,-0.0809244,55
1429008820893,82,-0.0184197,0.0117439,0.00892786,46
1429008820925,82,0.0198073,0.0315662,0.00247196,44
1429008820957,82,-0.0266076,-0.0055518,-0.0715178,36
1429008820993,82,-0.0461138,-0.0106861,-0.0786669,29
1429008821025,82,-0.0206762,0.06717,0.0480753,25
1429008821058,82,0.032742,0.190983,0.246506,22
1429008821100,82,0.0860144,0.304919,0.424065,44
1429008821125,82,0.0994857,0.341622,0.481893,64
1429008821157,82,0.0628102,0.284497,0.390687,56
1429008821195,82,0.0284923,0.172352,0.225508,46
1429008821225,82,-0.00345249,0.0348081,0.0383485,44
1429008821257,82,-0.0456584,-0.0995677,-0.129966,37
1429008821295,82,-0.0440698,-0.178333,-0.219469,30
1429008821325,82,-0.0138477,-0.184429,-0.200844,26
1429008821357,82,0.051699,-0.169968,-0.171851,23
1429008821393,82,0.0958176,-0.13905,-0.122049,48
1429008821426,82,0.0644969,-0.189592,-0.201218,66
1429008821457,82,-0.00650394,-0.246585,-0.307679,56
1429008821493,82,-0.0852975,-0.253193,-0.343621,48
1429008821525,82,-0.105452,-0.189686,-0.280632,46
1429008821557,82,-0.0574304,-0.0183968,-0.0535598,45
1429008821593,82,0.012452,0.116648,0.124277,42
1429008821625,82,0.0165454,0.15605,0.169276,39
1429008821657,82,-0.0236412,0.111663,0.0945466,35
1429008821693,82,-0.0719184,0.0602508,0.00736144,32
1429008821726,82,-0.0869561,0.0733113,0.0281002,29
1429008821757,82,-0.0249935,0.156109,0.161194,28
1429008821793,82,0.0920115,0.224467,0.283302,25
1429008821825,82,0.18284,0.214764,0.291597,23
1429008821856,82,0.211728,0.142208,0.196678,22
1429008821893,82,0.151451,0.035093,0.0550538,21
1429008821925,82,0.0601073,-0.0123433,-0.0113899,28
1429008821956,82,-0.0113627,-0.0226804,-0.0234822,33
1429008821992,82,-0.0263764,0.000180878,0.016912,47
1429008822025,82,-0.0011615,0.0429218,0.0932891,64
1429008822058,82,-0.0135099,0.00616132,0.0629344,66
1429008822093,82,-0.0341809,-0.0539501,-0.00549239,63
1429008822125,81,-0.0738916,-0.14357,-0.135549,61
1429008822156,81,-0.09143,-0.218711,-0.260567,56
1429008822193,81,-0.118562,-0.28084,-0.383928,51
1429008822230,81,-0.156028,-0.325543,-0.465423,47
1429008822258,81,-0.160906,-0.291299,-0.417784,45
1429008822293,81,-0.12851,-0.186492,-0.255861,45
1429008822324,81,-0.0725779,-0.0610038,-0.0591091,43
1429008822358,81,-0.033483,0.0342265,0.0847001,40
1429008822393,81,0.000307108,0.0897707,0.164452,36
1429008822425,81,0.0428535,0.139669,0.216862,32
1429008822459,81,0.140481,0.25194,0.338173,29
1429008822492,81,0.214753,0.347277,0.417291,27
1429008822524,81,0.226686,0.373872,0.424832,25
1429008822559,81,0.152221,0.291864,0.302557,23
1429008822592,81,0.0467103,0.153837,0.13067,22
1429008822626,81,-0.0574386,-0.00565731,-0.0576074,21
1429008822659,81,-0.0889124,-0.100877,-0.151946,20
1429008822692,81,-0.0842075,-0.153809,-0.207726,25
1429008822727,81,-0.0733793,-0.173568,-0.227292,37
1429008822759,81,-0.0540011,-0.151792,-0.180199,52
1429008822794,81,-0.0755118,-0.152144,-0.152436,63
1429008822827,81,-0.0777886,-0.127872,-0.0881386,65
1429008822856,81,-0.0765704,-0.129099,-0.0902541,63
1429008822892,81,-0.0564455,-0.118494,-0.0858869,58
1429008822926,81,-0.0160632,-0.0635408,-0.0357465,53
1429008822959,81,-0.00781979,-0.035694,-0.0184033,49
1429008822992,81,0.0138841,0.0259436,0.0446662,46
1429008823025,81,0.00555143,0.036159,0.0364406,45
1429008823067,81,0.00782524,0.0306056,0.000730475,43
1429008823108,81,0.020499,0.0170672,-0.0307943,39
1429008823149,81,0.0632314,0.0163431,-0.0356059,35
1429008823191,81,0.11906,0.0630462,0.0455325,30
1429008823232,81,0.144838,0.122481,0.165371,28
1429008823273,81,0.090959,0.123188,0.198442,26
1429008823315,81,-0.0250386,0.0510979,0.0948667,23
1429008823356,81,-0.15902,-0.068518,-0.0857669,22
1429008823398,81,-0.227509,-0.156379,-0.241825,20
1429008823439,81,-0.197122,-0.157065,-0.264747,19
1429008823481,81,-0.0846211,-0.0746225,-0.15924,27
1429008823527,81,0.0666537,0.047493,0.0120036,49
1429008823538,81,0.17384,0.145659,0.160444,49
1429008823579,81,0.185644,0.162209,0.202489,65
1429008823620,81,0.134504,0.139468,0.199638,65
1429008823665,81,0.0499739,0.0771103,0.127748,59
1429008823676,81,-0.0511447,-0.0228917,-0.00276722,56
1429008823720,81,-0.114936,-0.100375,-0.101743,51
1429008823734,81,-0.126201,-0.141068,-0.145671,49
1429008823777,81,-0.100133,-0.140426,-0.135369,46
1429008823818,81,-0.071758,-0.123905,-0.106191,46
1429008823860,81,-0.0277254,-0.0788207,-0.0534183,43
1429008823901,81,0.0188821,-0.0381695,-0.0124261,40
1429008823942,81,0.0516021,0.00241428,0.017516,35
1429008823984,81,0.0685227,0.0488712,0.0565676,31
1429008824026,81,0.081157,0.101907,0.103255,27
1429008824067,81,0.0837719,0.13612,0.128183,25
1429008824108,81,0.07294,0.13099,0.10325,24
1429008824150,81,0.0578353,0.100542,0.0564996,22
1429008824191,81,0.0353011,0.0513444,-0.00143388,21
1429008824233,81,0.0281895,0.0238668,-0.0142171,29
1429008824274,81,0.0035345,-0.0153059,-0.0403527,43
1429008824316,81,0.014667,-0.0125367,-0.0237038,63
1429008824357,81,0.0140389,-0.00776383,-0.0135524,65
1429008824398,81,0.00284433,0.00156218,-0.00897424,60
1429008824439,81,-0.0298492,-0.00057963,-0.00819757,55
1429008824481,81,-0.0444669,0.00225999,0.00751904,48
1429008824523,81,-0.0473245,-0.003368,0.026458,46
1429008824565,81,-0.0274512,-0.00881114,0.0470646,44
1429008824607,81,-0.0115064,-0.0264826,0.0435507,43
1429008824648,81,0.0111483,-0.0327437,0.0320803,38
1429008824659,81,0.0176651,-0.0340383,0.0107588,38
1429008824670,81,-0.00499961,-0.0444968,-0.0207802,36
1429008824712,81,-0.0379934,-0.0529523,-0.0546705,30
1429008824753,81,-0.0889854,-0.0751072,-0.0880538,28
1429008824795,81,-0.113083,-0.0766583,-0.100494,24
1429008824836,81,-0.0984706,-0.052313,-0.0798399,23
1429008824878,81,-0.0415657,-0.00232242,-0.0298182,21
1429008824919,81,0.0435234,0.0564968,0.0349409,23
1429008824961,81,0.122115,0.101922,0.0893601,39
1429008825004,81,0.143687,0.106574,0.10137,54
1429008825046,81,0.0986285,0.0663728,0.0628755,67
1429008825087,81,0.00498524,0.000195182,-0.00553158,66
1429008825129,82,-0.0891935,-0.0633423,-0.0788186,59
1429008825171,82,-0.142862,-0.105587,-0.127978,54
1429008825213,82,-0.121907,-0.103068,-0.121914,48
1429008825224,82,-0.0624133,-0.0718749,-0.0760684,48
1429008825266,82,0.033107,3.45836e-05,0.0221512,46
1429008825307,82,0.0901204,0.0547372,0.0962849,44
1429008825349,82,0.0938279,0.0683336,0.113222,40
1429008825390,82,0.0664351,0.0541943,0.086919,37
1429008825432,82,0.0414937,0.0332226,0.0471837,31
1429008825444,82,0.0388099,0.0306327,0.0291017,31
1429008825486,82,0.0323788,0.0246309,0.0166012,27
1429008825499,82,0.0173047,0.0136771,0.00756372,26
1429008825541,82,-0.00425876,0.00049392,-0.00111289,24
1429008825584,82,-0.0320244,-0.0126692,-0.014368,22
1429008825596,82,-0.0422191,-0.00895263,-0.0177166,21
1429008825638,82,-0.0155283,0.0208458,0.00114483,25
1429008825680,82,0.0163342,0.0477093,0.0191422,44
1429008825721,82,0.0283361,0.0499441,0.0171411,59
1429008825763,82,0.0370902,0.0440316,0.0174496,68
1429008825775,82,0.0190763,0.015826,-0.00447918,68
1429008825817,82,-0.0111384,-0.0231532,-0.03693,63
1429008825858,82,-0.0397886,-0.0591067,-0.0669357,58
1429008825899,82,-0.0492432,-0.0743231,-0.0699129,51
1429008825940,82,-0.0490069,-0.0704435,-0.0512583,48
1429008825983,82,-0.0337748,-0.0568858,-0.0243686,45
1429008825994,82,-0.00347949,-0.0150663,0.0192756,45
1429008826036,82,0.0129109,0.0197613,0.0437931,42
1429008826077,82,0.0334533,0.0470414,0.0609872,40
1429008826119,82,0.0556784,0.0755352,0.0788888,34
1429008826160,82,0.0702091,0.0894096,0.0881477,30
1429008826201,82,0.0646928,0.0822178,0.0795973,26
1429008826243,82,0.0633119,0.0610875,0.0592426,24
1429008826285,82,0.0458592,0.0245231,0.0262398,22
1429008826297,82,0.0369826,0.00606441,0.00619269,22
1429008826339,82,0.0221934,0.00641638,0.000206424,20
1429008826351,82,0.00287042,0.0245467,0.011465,22
1429008826393,82,-0.00853547,0.0590447,0.0391595,33
1429008826404,82,-0.00184587,0.0863776,0.0658575,40
1429008826446,82,0.0349483,0.100305,0.0845723,55
1429008826457,82,0.0661514,0.0753061,0.0675879,61
1429008826499,82,0.0763987,0.0195485,0.0220314,66
1429008826511,82,0.0301401,-0.0786062,-0.0718974,66
1429008826552,82,-0.0354746,-0.146806,-0.13381,61
1429008826564,82,-0.114701,-0.187919,-0.169852,61
1429008826608,82,-0.146375,-0.168931,-0.149231,53
1429008826625,82,-0.128158,-0.116144,-0.0988869,50
1429008826667,82,-0.0960412,-0.0729263,-0.0643347,46
1429008826694,82,-0.0521231,-0.0359046,-0.0393257,45
1429008826737,82,-0.028027,-0.0241366,-0.0338923,43
1429008826757,82,-0.000504697,-0.0027898,-0.0076846,42
1429008826799,82,0.00937223,0.00678853,0.0110321,37
1429008826825,82,0.0228026,0.0265486,0.040346,35
1429008826866,82,0.0370137,0.0484781,0.0631959,30
1429008826893,82,0.0605133,0.0768623,0.0873219,28
1429008826934,82,0.0557105,0.0806013,0.0774606,24
1429008826958,82,0.0525918,0.0852045,0.0715454,23
1429008827001,82,0.0297848,0.0591846,0.0348132,21
1429008827025,82,0.0174333,0.046188,0.0220753,20
1429008827066,82,-0.00733112,0.0199495,0.000817403,19
1429008827093,82,-0.0330849,-0.00165363,-0.0172843,18
1429008827134,82,-0.0470856,-0.0159753,-0.0294841,28
1429008827159,82,-0.0312488,-0.00780113,-0.0193502,36
1429008827193,82,-0.0104871,-0.00466333,-0.00779563,52
1429008827225,82,0.000945446,-0.0121026,-0.00513492,64
1429008827266,82,-0.00273968,-0.0298675,-0.0149696,66
1429008827309,82,-0.0173008,-0.050684,-0.0305718,61
1429008827350,82,-0.0142304,-0.0500508,-0.0290112,52
1429008827391,82,-0.0222466,-0.0509691,-0.0303704,48
1429008827434,82,-0.0315358,-0.0571331,-0.0392041,45
1429008827446,82,-0.0233829,-0.0457151,-0.0359024,45
1429008827487,82,-0.030844,-0.0459227,-0.0481926,44
1429008827529,82,-0.00953227,-0.022315,-0.0336446,42
1429008827573,82,0.00287202,-0.00142754,-0.0133707,37
1429008827584,82,0.0264275,0.0306572,0.0262438,35
1429008827626,82,0.0422368,0.0513579,0.0556926,31
1429008827667,82,0.0383709,0.0573198,0.0678354,27
1429008827709,82,0.0370636,0.0585826,0.06773,25
1429008827751,82,0.0127042,0.0373719,0.0410321,23
1429008827792,82,-0.0314779,-0.0087041,-0.0134194,22
1429008827834,82,-0.0509594,-0.0396059,-0.0502435,24
1429008827876,82,-0.0598923,-0.0579157,-0.0713564,33
1429008827917,82,-0.029587,-0.0391858,-0.0557421,55
1429008827958,82,0.0188761,0.00402201,-0.0175606,65
1429008828000,82,0.057678,0.0398851,0.0123233,63
1429008828042,82,0.0750675,0.0581984,0.0352781,57
1429008828084,82,0.0545462,0.0440783,0.0308493,49
1429008828126,82,0.0260603,0.0179768,0.02306,46
1429008828168,82,-0.00975627,-0.0138422,0.00146661,45
1429008828209,82,-0.0353758,-0.0332236,-0.0135495,44
1429008828250,82,-0.0478432,-0.0441359,-0.0272258,42
1429008828292,82,-0.050374,-0.046223,-0.0354643,37
1429008828333,82,-0.0377431,-0.0380805,-0.0305927,33
1429008828374,82,-0.0143723,-0.0193878,-0.0111493,28
1429008828416,82,0.0161887,0.00728483,0.0215461,26
1429008828457,82,0.0237398,0.0267847,0.043319,24
1429008828502,82,0.017444,0.0367831,0.0509686,24
1429008828514,82,0.0160397,0.0475961,0.0551102,24
1429008828555,82,0.0316672,0.0547226,0.0558754,38
1429008828601,82,0.0343111,0.0424931,0.039576,53
1429008828613,82,0.0326688,0.0223079,0.017009,60
1429008828655,82,0.00610154,-0.0242399,-0.0353062,67
1429008828697,83,-0.0250257,-0.0634117,-0.0800563,63
1429008828738,83,-0.0486684,-0.0778701,-0.0960737,54
1429008828779,83,-0.0399015,-0.0361991,-0.0435456,49
1429008828820,83,-0.00206666,0.0358596,0.0427596,45
1429008828862,83,0.0291256,0.0846095,0.100324,45
1429008828903,83,0.0303287,0.0765168,0.0871235,43
1429008828945,83,0.00813039,0.0190587,0.0162425,40
1429008828986,83,-0.033335,-0.0643901,-0.0822435,34
1429008829028,83,-0.0673151,-0.126669,-0.150474,30
1429008829075,83,-0.0868343,-0.144753,-0.163811,26
1429008829087,83,-0.0833271,-0.117424,-0.123998,25
1429008829128,83,-0.04929,-0.0508889,-0.0462086,24
1429008829169,83,0.0106846,0.0343762,0.0472498,22
1429008829210,83,0.0899539,0.116058,0.130028,29
1429008829252,83,0.12473,0.152006,0.161812,42
1429008829294,83,0.122849,0.146632,0.149763,64
1429008829336,83,0.0759337,0.101473,0.0985234,69
1429008829377,83,0.0144126,0.0380548,0.0327055,65
1429008829418,83,-0.0381738,-0.0285586,-0.032855,59
1429008829430,83,-0.072072,-0.0778862,-0.0780044,56
1429008829471,83,-0.0752911,-0.0964467,-0.0917899,49
1429008829513,83,-0.0502052,-0.0781589,-0.0695692,47
1429008829524,83,-0.0137116,-0.0405214,-0.0298625,46
1429008829566,83,0.0120802,-0.00745368,0.00202998,45
1429008829608,83,0.0194528,0.00614323,0.0137594,41
1429008829649,83,0.0198613,0.00926916,0.015083,38
1429008829691,83,0.0176649,0.00787174,0.0123488,32
1429008829732,83,0.00883225,0.00115121,0.00381059,28
1429008829774,83,0.00688991,0.00161711,0.00327332,25
1429008829815,83,0.00206931,0.00348545,0.00295915,23
1429008829857,83,-0.00887224,-0.000856046,-0.00613995,20
1429008829899,83,-0.0271109,-0.00791824,-0.0157461,25
1429008829910,83,-0.0419298,-0.012279,-0.0230704,30
1429008829952,83,-0.0196914,0.0145028,-0.000995471,45
1429008829965,83,0.0157462,0.047465,0.0286277,53
1429008830006,83,0.0544313,0.0778345,0.0569128,69
1429008830048,83,0.0648121,0.0777583,0.0615168,69
1429008830089,84,0.0454256,0.0395325,0.0317323,63
1429008830131,84,0.00335818,-0.0112992,-0.00660466,57
1429008830143,84,-0.0336584,-0.055092,-0.0390522,55
1429008830185,84,-0.0479412,-0.0637447,-0.0406449,50
1429008830197,84,-0.0477216,-0.057252,-0.0303035,48
1429008830239,84,-0.0255138,-0.0310157,-0.00817204,46
1429008830251,84,-0.00118349,-0.00858441,0.00547524,46
1429008830293,84,0.0127977,-0.00106547,0.00338163,42
1429008830305,84,0.0332395,0.00805212,0.00568989,42
1429008830347,84,0.0287432,0.000116081,-0.00614084,37
1429008830359,84,0.00668464,-0.00979662,-0.0158613,35
1429008830401,84,-0.0253788,-0.0185254,-0.0241214,31
1429008830425,84,-0.0420558,-0.0126333,-0.0174365,27
1429008830467,84,-0.0370968,0.00333046,-0.00127595,25
1429008830493,84,-0.0096425,0.0226005,0.0171681,22
1429008830535,84,0.0148401,0.0304894,0.0231979,21
1429008830557,84,0.021812,0.0199976,0.0100358,19
1429008830599,84,0.0135252,0.00143091,-0.0084939,18
1429008830625,84,-0.00558555,-0.0194674,-0.0305557,19
1429008830667,84,-0.0302591,-0.0388762,-0.0512107,29
1429008830693,84,-0.0294046,-0.0356094,-0.0451504,44
1429008830735,84,-0.00552575,-0.011637,-0.0158819,61
1429008830756,84,0.0202401,0.013743,0.016389,66
1429008830799,84,0.043759,0.0338761,0.0421874,68
1429008830825,84,0.0528032,0.0461514,0.0579889,64
1429008830866,84,0.0611178,0.0570464,0.0724472,58
1429008830893,84,0.0501306,0.051577,0.0707285,53
1429008830925,84,0.0289163,0.0334675,0.0533217,48
1429008830958,84,-0.00203901,0.0011669,0.0197896,46
1429008830993,84,-0.0441148,-0.0455818,-0.031053,45
1429008831025,84,-0.0590963,-0.0660149,-0.0544047,42
1429008831058,84,-0.0526582,-0.0611716,-0.0543268,41
1429008831094,84,-0.0372457,-0.0380188,-0.0388795,36
1429008831125,84,-0.0121782,-0.00307257,-0.0122455,31
1429008831157,84,-7.02196e-06,0.0174106,-0.00142262,29
1429008831195,84,0.00250257,0.0243415,0.000862729,25
1429008831225,84,-0.00281637,0.0167106,-0.00685769,22
1429008831259,84,-0.00860664,0.00436865,-0.0137161,20
1429008831293,84,-0.00861927,-0.00729871,-0.0159308,18
1429008831325,84,0.00243579,-0.00314026,-0.00513887,18
1429008831358,84,0.0262756,0.0154468,0.0171751,15
1429008831394,84,0.0413649,0.0330221,0.0354773,15
1429008831426,84,0.0436152,0.0395405,0.0391246,21
1429008831457,84,0.0206732,0.0211315,0.018749,37
1429008831500,84,-0.002955,-0.000393601,-0.00444621,55
1429008831541,84,-0.0130932,-0.0166726,-0.0187971,69
1429008831583,84,-0.029974,-0.0380507,-0.0352187,67
1429008831624,84,-0.0393411,-0.0501233,-0.0429858,58
1429008831666,84,-0.0428245,-0.0502881,-0.0404912,52
1429008831708,84,-0.0340051,-0.0368957,-0.027022,45
1429008831750,84,-0.0134447,-0.0130402,-0.00442436,44
1429008831792,84,0.0147329,0.0159913,0.0229226,42
1429008831834,84,0.0364765,0.0361818,0.0417276,40
1429008831876,84,0.0475142,0.0429269,0.0484555,34
1429008831918,84,0.0450496,0.0383163,0.0443183,29
1429008831961,84,0.0272308,0.0199644,0.0281121,24
1429008832003,84,-0.00387919,-0.00608402,0.0021114,21
1429008832045,84,-0.0241409,-0.018082,-0.0126526,19
1429008832087,84,-0.0278809,-0.0140089,-0.0161986,18
1429008832130,84,-0.0135967,0.00430322,-0.00549461,16
1429008832171,84,0.00701625,0.0231284,0.00935163,15
1429008832213,84,0.0137385,0.0250868,0.00746506,27
1429008832255,84,0.00434782,0.00548117,-0.0148115,44
1429008832297,84,-0.0207148,-0.0226786,-0.0412671,66
1429008832339,84,-0.0219147,-0.0281308,-0.0408463,68
1429008832381,84,-0.00610388,-0.00858722,-0.0122014,60
1429008832423,84,0.00707501,0.0116766,0.0161088,52
1429008832465,84,0.0206976,0.0293077,0.0400981,45
1429008832507,84,0.00388632,0.0126844,0.0256224,43
1429008832549,84,-0.00957982,-0.0106134,0.00559846,44
1429008832591,84,-0.0250389,-0.0378056,-0.0239757,42
1429008832633,84,-0.0237883,-0.0472132,-0.0368772,36
1429008832675,84,-0.0209782,-0.0452822,-0.0428889,32
1429008832717,84,-0.00610625,-0.0250706,-0.028492,25
1429008832759,84,0.0154342,0.00527714,-0.0010461,22
1429008832801,84,0.0385186,0.0325701,0.0293716,19
1429008832843,84,0.0430645,0.0378647,0.0395948,17
1429008832886,84,0.0241374,0.0241003,0.0296055,15
1429008832929,84,-0.0095019,-0.00116259,0.00505397,22
1429008832970,84,-0.0298547,-0.010454,-0.00754063,39
1429008833013,84,-0.0340355,-0.00843304,-0.0110136,64
1429008833054,84,0.00176136,0.0223581,0.0157005,70
1429008833096,84,0.0304088,0.0413063,0.0305976,65
1429008833137,84,0.0550126,0.0561233,0.0453345,58
1429008833179,84,0.0558958,0.0491636,0.0409955,48
1429008833220,84,0.0261885,0.0179412,0.0157815,45
1429008833262,84,-0.01323,-0.0185996,-0.0154147,44
1429008833304,84,-0.0479031,-0.0504421,-0.0451157,43
1429008833345,84,-0.0637442,-0.0628685,-0.0572509,39
1429008833386,84,-0.0592116,-0.0591485,-0.0516493,34
1429008833428,84,-0.034524,-0.0366805,-0.0315824,27
1429008833439,84,-0.00760713,-0.0130386,-0.00962757,27
1429008833481,84,0.0176924,0.0139389,0.0157749,22
1429008833523,84,0.0327356,0.03214,0.0285769,20
1429008833565,84,0.0398433,0.0434282,0.0358396,17
1429008833606,84,0.0417118,0.0439261,0.0351883,16
1429008833648,84,0.0369485,0.0380183,0.0352262,25
1429008833659,84,0.0232085,0.0231725,0.0281106,25
1429008833700,84,-0.00364251,0.000254403,0.0100113,52
1429008833712,84,-0.0262197,-0.0178206,-0.00845528,61
1429008833754,84,-0.042403,-0.0339282,-0.0299077,71
1429008833795,84,-0.03214,-0.0306268,-0.0366077,71
1429008833837,85,-0.0203994,-0.0261305,-0.0405927,63
1429008833879,85,0.00599217,-0.00724288,-0.0227561,56
1429008833890,85,0.0154566,0.0014178,-0.00736653,53
1429008833933,85,0.0065601,-0.0040253,-0.00262589,47
1429008833945,85,-0.0178686,-0.0194915,-0.00898342,47
1429008833989,85,-0.0351885,-0.0324474,-0.019045,45
1429008834002,85,-0.0524986,-0.0441788,-0.0335146,45
1429008834043,85,-0.0472133,-0.0401344,-0.0306634,42
1429008834086,85,-0.0221406,-0.0188591,-0.0102237,37
1429008834134,85,0.0170682,0.0117504,0.0246876,30
1429008834146,85,0.0458409,0.0326722,0.0435391,30
1429008834187,85,0.0602324,0.0524753,0.0597066,25
1429008834229,85,0.0536499,0.0589928,0.0557913,22
1429008834271,85,0.0341746,0.0549448,0.0435679,20
1429008834282,85,0.0151731,0.0425485,0.024307,19
1429008834324,85,-0.00229764,0.0213522,-0.00300231,18
1429008834365,85,-0.0190565,-0.00678527,-0.0339371,30
1429008834406,85,-0.0295268,-0.0284282,-0.0567665,47
1429008834448,85,-0.0248256,-0.0324949,-0.0552301,69
1429008834459,85,-0.0126326,-0.0253011,-0.0366231,69
1429008834500,85,-0.00335448,-0.0175652,-0.0151318,70
1429008834512,85,0.0150649,0.000411417,0.0176876,70
1429008834554,85,0.0233711,0.00625549,0.0335442,61
1429008834565,85,0.0243635,0.00792936,0.0392431,58
1429008834607,85,0.0280385,0.00957725,0.0345159,52
1429008834618,85,0.0238638,0.010671,0.0233267,49
1429008834660,85,0.0198136,0.0143475,0.0173551,47
1429008834672,85,-0.000991634,0.0069185,0.00347657,46
1429008834713,85,-0.0267404,-0.00911283,-0.013735,45
1429008834724,85,-0.0331645,-0.0139949,-0.0146347,45
1429008834766,85,-0.028846,-0.0135109,-0.0089854,40
1429008834793,85,-0.00456817,0.00146971,0.0100706,39
1429008834834,85,0.00837527,0.00672793,0.0133253,32
1429008834857,85,0.0191283,0.0102368,0.0108048,30
1429008834899,85,0.0254799,0.0127262,0.00611843,25
1429008834924,85,0.0204171,0.0038309,-0.0113863,24
1429008834966,85,0.0143985,0.00165549,-0.0144017,21
1429008834994,85,0.00187331,-0.000695346,-0.0143111,20
1429008835025,85,-0.00320408,0.00828734,-0.00115382,19
1429008835058,85,-0.00127237,0.0221827,0.0190859,23
1429008835094,85,0.00724895,0.0289238,0.0290404,37
1429008835125,85,0.00430062,0.0189914,0.0199352,54
1429008835161,85,-0.0225532,-0.0142861,-0.0173746,67
1429008835192,85,-0.0623723,-0.0556527,-0.0650636,69
1429008835234,86,-0.0965288,-0.0879952,-0.0985641,62
1429008835258,86,-0.10345,-0.097007,-0.101313,59
1429008835292,86,-0.0763634,-0.0749413,-0.0693083,52
1429008835328,86,-0.0162981,-0.0256638,-0.00955881,48
1429008835361,86,0.037425,0.0184773,0.0364127,46
1429008835392,86,0.0739282,0.0522684,0.0681917,46
1429008835427,86,0.0723802,0.055235,0.0652002,45
1429008835456,86,0.0543879,0.0461424,0.049396,43
1429008835494,86,0.0204959,0.0235375,0.0198213,39
1429008835527,86,0.0128143,0.0230509,0.0212205,35
1429008835562,86,0.00662528,0.0228026,0.0273054,31
1429008835595,86,0.0219788,0.0402194,0.0488581,28
1429008835627,86,0.0458884,0.0606192,0.0694879,25
1429008835656,86,0.0696339,0.0721796,0.0724094,24
1429008835699,86,0.083739,0.071705,0.0657395,21
1429008835741,86,0.0610882,0.0418483,0.0307437,22
1429008835782,86,0.00302774,-0.011361,-0.028479,40
1429008835824,86,-0.0576848,-0.0627166,-0.0831805,57
1429008835867,86,-0.0924014,-0.0911228,-0.111125,67
1429008835908,86,-0.0919434,-0.0944363,-0.105565,64
1429008835950,86,-0.0516575,-0.0666312,-0.0581796,54
1429008835991,86,-0.0182607,-0.040212,-0.0142642,48
1429008836033,86,0.014847,-0.00637032,0.0279879,45
1429008836074,86,0.0234322,0.00972908,0.0315659,45
1429008836115,86,0.0073197,0.00673161,0.00975689,45
1429008836157,86,-0.0308024,-0.0184696,-0.0356785,41
1429008836199,86,-0.050908,-0.0319696,-0.0580193,37
1429008836240,86,-0.0557537,-0.0358404,-0.0619847,31
1429008836282,86,-0.0400423,-0.0209561,-0.0433365,28
1429008836324,86,-0.0253451,-0.00787449,-0.0200457,25
1429008836365,86,-0.0201884,0.00208084,-0.00578429,24
1429008836407,86,-0.0132509,0.0129034,0.0159254,25
1429008836449,86,0.00989195,0.0362297,0.0505161,35
1429008836491,86,0.0382129,0.0563267,0.0754277,57
1429008836533,86,0.0737353,0.0764475,0.0946436,67
1429008836575,87,0.105344,0.0933638,0.107774,66
1429008836617,87,0.119218,0.0984502,0.117902,60
1429008836659,87,0.114275,0.0904724,0.116324,51
1429008836701,87,0.0863854,0.0655411,0.0944044,46
1429008836743,87,0.0525678,0.0409501,0.0638285,46
1429008836785,87,0.0133891,0.0116678,0.0192884,45
1429008836832,87,-0.0130459,-0.00832904,-0.019322,41
1429008836844,87,-0.0285101,-0.0239041,-0.0507074,40
1429008836887,87,-0.0440839,-0.04011,-0.068922,34
1429008836929,87,-0.0705496,-0.0650395,-0.0840909,30
1429008836974,87,-0.0808096,-0.0762596,-0.0786158,27
1429008836985,87,-0.0779709,-0.0901005,-0.0775889,26
1429008837027,87,-0.0696456,-0.106134,-0.100128,24
1429008837069,87,-0.0408068,-0.108157,-0.118432,26
1429008837111,87,-0.0304533,-0.0814339,-0.114759,38
1429008837153,87,-0.0188755,-0.0143054,-0.0599007,61
1429008837196,87,-0.0143417,0.064736,0.0190007,70
1429008837238,87,0.00577201,0.131529,0.103097,68
1429008837280,87,0.0134432,0.134806,0.131323,63
1429008837321,87,0.035328,0.0948614,0.107976,54
1429008837364,87,0.0467571,0.0197939,0.0455568,49
1429008837375,87,0.0420081,-0.0587901,-0.0297238,48
1429008837418,87,-0.0397717,-0.153169,-0.131262,47
1429008837431,87,-0.119258,-0.199975,-0.185895,47
1429008837473,87,-0.15061,-0.186507,-0.17546,43
1429008837515,87,-0.14899,-0.152296,-0.138439,40
1429008837527,87,-0.0641051,-0.0695132,-0.0491002,38
1429008837569,87,0.014578,-0.000373463,0.0189557,33
1429008837611,87,0.0836512,0.0648597,0.0701244,28
1429008837653,87,0.128569,0.109846,0.0969261,25
1429008837695,87,0.164292,0.151917,0.125983,23
1429008837708,87,0.143564,0.150611,0.119099,22
1429008837750,87,0.0897951,0.12184,0.0956629,21
1429008837792,87,0.0430726,0.0901761,0.0765164,32
1429008837833,87,-0.00108553,0.0434125,0.0428336,47
1429008837875,87,-0.0110773,0.0258344,0.034299,68
1429008837916,87,-0.0207911,0.00510713,0.0139871,71
1429008837957,87,-0.00902212,0.00521842,0.00649609,65
1429008837998,87,-0.0209212,-0.00900845,-0.0158196,59
1429008838040,87,-0.0555437,-0.0443027,-0.0521172,51
1429008838081,87,-0.0869692,-0.0775189,-0.0789156,48
1429008838123,87,-0.114834,-0.114529,-0.105465,46
1429008838164,87,-0.0916086,-0.112025,-0.0919811,44
1429008838206,87,-0.0345663,-0.0744443,-0.0497119,39
1429008838247,87,0.0335847,-0.010156,0.0138085,34
1429008838288,87,0.0791942,0.0482721,0.0627571,30
1429008838330,87,0.104038,0.0893335,0.0915098,26
1429008838341,87,0.0699938,0.0814791,0.0718537,25
1429008838382,87,0.0231775,0.0432153,0.0296384,23
1429008838424,87,-0.0619304,-0.0286207,-0.0427137,20
1429008838435,87,-0.107265,-0.0743755,-0.0853815,20
1429008838478,87,-0.11092,-0.078979,-0.0934771,19
1429008838489,87,-0.0750975,-0.0466734,-0.0649033,21
1429008838531,87,-0.00787504,0.0115221,-0.0110463,33
1429008838542,87,0.0316414,0.042633,0.0200948,40
1429008838584,87,0.0580765,0.0558384,0.0399316,58
1429008838625,87,0.0622196,0.0427651,0.0381928,69
1429008838667,86,0.0628503,0.0226772,0.0305661,67
1429008838679,86,0.040246,-0.00219661,0.0130175,64
1429008838720,86,0.0221776,-0.00573049,0.0192794,58
1429008838762,86,0.00312181,0.00371125,0.0363034,49
1429008838773,86,0.0138978,0.0292777,0.0672495,47
1429008838815,86,0.0409524,0.0493777,0.0848682,45
1429008838827,86,0.0746122,0.0586614,0.0825443,44
1429008838870,86,0.0474417,0.0192359,0.0234844,43
1429008838892,86,-0.0011641,-0.026322,-0.0415519,41
1429008838934,86,-0.0727843,-0.0772246,-0.106447,38
1429008838961,86,-0.12086,-0.112251,-0.14898,34
1429008839003,86,-0.140307,-0.116261,-0.144875,30
1429008839024,86,-0.10741,-0.0828838,-0.095426,26
1429008839066,86,-0.046616,-0.0245028,-0.0189775,24
1429008839092,86,0.0198838,0.0303648,0.0447811,22
1429008839134,86,0.0359464,0.0411507,0.0508999,20
1429008839161,86,0.0311783,0.0270103,0.021456,19
1429008839202,86,0.0124834,0.0044571,-0.0136407,18
1429008839224,86,0.0240703,0.0147022,-0.00424846,19
1429008839266,86,0.0358132,0.0312775,0.0228834,30
1429008839293,86,0.0765272,0.0721767,0.0791377,46
1429008839334,86,0.0948291,0.0897363,0.104266,62
1429008839360,86,0.0820233,0.0764311,0.0891744,68
1429008839402,86,0.0422941,0.0363056,0.0404635,66
1429008839424,86,-0.00900388,-0.0151159,-0.0169123,63
1429008839465,86,-0.0572533,-0.0586639,-0.0618677,53
1429008839492,86,-0.0834396,-0.078246,-0.0753263,48
1429008839534,86,-0.0521387,-0.0519761,-0.0401008,46
1429008839560,86,-0.022934,-0.0173109,0.000760588,46
1429008839603,86,0.0171352,0.0266887,0.0452312,45
1429008839625,86,0.0258638,0.0439709,0.058467,43
1429008839659,86,0.0106658,0.0306402,0.0376962,41
1429008839693,86,-0.0343963,-0.0177873,-0.0193776,36
1429008839726,86,-0.0445428,-0.0484613,-0.0573513,31
1429008839760,86,-0.0441973,-0.0607519,-0.0733967,28
1429008839792,86,-0.00546495,-0.0331327,-0.0452029,25
1429008839826,86,0.0104249,-0.00812752,-0.0205065,24
1429008839856,86,0.0165599,0.0167799,0.00448242,23
1429008839897,86,-0.00728938,0.0139801,0.00274895,21
1429008839938,86,-0.0259333,0.00422488,-0.00814217,22
1429008839980,86,-0.0189576,-0.000288731,-0.0114201,40
1429008840021,86,0.0180015,0.013901,0.00281924,56
1429008840064,86,0.0689518,0.0386075,0.0310375,69
1429008840105,86,0.112431,0.0654779,0.0652987,66
1429008840146,86,0.111081,0.0665733,0.0775938,57
1429008840187,86,0.0753629,0.0479669,0.0677859,51
1429008840229,86,0.00958513,0.00525416,0.0277234,46
1429008840270,86,-0.0537525,-0.0388898,-0.025247,45
1429008840312,86,-0.0791796,-0.0583787,-0.0543508,44
1429008840353,86,-0.0667015,-0.0481165,-0.0437743,41
1429008840395,86,-0.0333767,-0.0225587,-0.0107935,35
1429008840436,86,-0.00174748,0.00364471,0.0234906,31
1429008840478,86,-0.0059484,-0.00182927,0.0169545,26
1429008840519,86,-0.0149685,-0.0109923,-0.0048668,24
1429008840561,86,-0.0361369,-0.0304684,-0.0421047,22
1429008840603,86,-0.0520963,-0.0389308,-0.0657063,24
1429008840645,86,-0.0740916,-0.0506319,-0.0842464,42
1429008840686,86,-0.0635765,-0.0354067,-0.0660578,59
1429008840729,86,-0.0554511,-0.0283419,-0.0519061,70
1429008840770,87,-0.0225134,-0.0056334,-0.0199304,68
1429008840812,87,0.0272988,0.0293723,0.0236206,59
1429008840853,87,0.0867033,0.075923,0.080456,53
1429008840895,87,0.11358,0.0998537,0.114786,47
1429008840936,87,0.0939364,0.0842599,0.107032,46
1429008840979,87,0.0348731,0.0267716,0.0507613,43
1429008841020,87,-0.0415249,-0.0519753,-0.0327509,40
1429008841062,87,-0.0925787,-0.113701,-0.102059,34
1429008841104,87,-0.109311,-0.134368,-0.131462,30
1429008841145,87,-0.0790748,-0.103833,-0.103933,25
1429008841187,87,-0.015969,-0.0371581,-0.0358369,23
1429008841230,87,0.0373166,0.0281943,0.0332888,21
1429008841271,87,0.0683386,0.0718948,0.0794546,20
1429008841314,87,0.0493911,0.070444,0.0732626,35
1429008841355,87,0.0410501,0.0644441,0.0604635,52
1429008841397,87,0.0417276,0.0586656,0.04815,69
1429008841440,87,0.0491936,0.0553902,0.0427516,69
1429008841481,87,0.0604162,0.0548442,0.0444633,62
1429008841522,87,0.0453429,0.0380066,0.0306267,56
1429008841565,87,0.0301596,0.0211602,0.0175339,48
1429008841606,87,-0.000493242,-0.0033244,-0.00337802,46
1429008841648,87,-0.0130091,-0.0122114,-0.00741595,43
1429008841689,87,-0.0310671,-0.0245977,-0.0163248,41
1429008841731,87,-0.0173225,-0.0204788,-0.00772517,36
1429008841774,87,0.00155109,-0.016265,-0.00158567,32
1429008841785,87,0.0138662,-0.0165225,-0.00540527,30
1429008841828,87,0.00650457,-0.0247432,-0.023588,27
1429008841840,87,-0.0137851,-0.0339035,-0.0431966,25
1429008841882,87,-0.0459754,-0.0442439,-0.0617788,22
1429008841924,87,-0.0672036,-0.0443577,-0.0643643,21
1429008841967,87,-0.0734871,-0.0389506,-0.0566467,18
1429008841979,87,-0.0487352,-0.0248644,-0.0363658,18
1429008842020,87,-0.016679,-0.01137,-0.0155634,24
1429008842061,87,0.0379592,0.026876,0.0300144,39
1429008842103,86,0.0605197,0.0563595,0.0632494,65
1429008842198,86,0.068473,0.0865827,0.0953811,62
1429008842239,86,0.0165056,0.0713164,0.0768336,44
1429008842345,86,-0.0312546,0.040421,0.0442842,44
1429008842387,86,-0.0743402,-0.00574866,-0.000850024,42
1429008842429,86,-0.0536675,-0.0230775,-0.0134732,40
1429008842440,86,-0.0213746,-0.0292477,-0.0165972,38
1429008842482,86,0.0157088,-0.0234827,-0.0109899,32
1429008842524,86,0.0299424,-0.0196057,-0.0107069,28
1429008842535,86,0.0315558,-0.0116485,-0.00776175,27
1429008842577,86,0.0132122,-0.0139921,-0.0120533,24
1429008842619,86,0.0108644,-0.00681544,-0.00616648,21
1429008842631,86,0.0221123,0.00133885,0.00140212,21
1429008842672,86,0.0342119,0.00514551,0.00282055,19
1429008842714,86,0.0462033,0.00887216,0.00298941,17
1429008842755,86,0.0321348,-0.000310436,-0.0103562,18
1429008842767,86,-0.00152641,-0.0185299,-0.0305812,21
1429008842808,86,-0.0265498,-0.0266107,-0.0394238,34
1429008842850,86,-0.0328982,-0.0198493,-0.0327204,59
1429008842862,86,-0.014402,0.00239926,-0.0106551,59
1429008842903,86,0.0173164,0.0342178,0.0222177,67
1429008842945,85,0.0170402,0.0400467,0.0293865,63
1429008842957,85,0.0059681,0.0317517,0.0264293,59
1429008842998,85,-0.0252191,0.00606042,0.00867349,50
1429008843009,85,-0.0531224,-0.0196754,-0.00938042,50
1429008843050,85,-0.0709442,-0.0400408,-0.0237607,44
1429008843062,85,-0.0821129,-0.0598881,-0.0436395,44
1429008843103,85,-0.0560158,-0.0509384,-0.0380169,43
1429008843124,85,-0.0170218,-0.0335419,-0.0265671,43
1429008843165,85,0.0265516,-0.00693408,-0.00466291,40
1429008843192,85,0.0578551,0.0182248,0.0207461,38
1429008843235,85,0.0989646,0.0556099,0.0630338,32
1429008843261,85,0.11801,0.0784547,0.0889666,30
1429008843303,85,0.080962,0.0622354,0.0689031,25
1429008843324,85,0.0191957,0.0282554,0.0247104,24
1429008843366,85,-0.0489318,-0.0133149,-0.0276756,22
1429008843392,85,-0.095342,-0.0412863,-0.0633948,21
1429008843434,85,-0.0908149,-0.0411191,-0.0627637,19
1429008843461,85,-0.0371005,-0.0120041,-0.0259815,18
1429008843502,85,0.0304097,0.0246999,0.0239916,22
1429008843525,85,0.0842178,0.0516658,0.0586989,27
1429008843561,85,0.0975554,0.0572662,0.0640469,41
1429008843593,85,0.0790731,0.0426199,0.0444173,57
1429008843634,85,0.0306485,0.00918751,0.00337476,65
1429008843661,85,-0.0228375,-0.0295554,-0.0384967,63
1429008843703,85,-0.0594079,-0.056904,-0.0596756,55
1429008843744,85,-0.0512185,-0.052448,-0.0451087,49
1429008843762,85,-0.0269798,-0.0320195,-0.0152274,46
1429008843803,85,-0.020819,-0.0212131,-0.000646845,43
1429008843824,85,-0.0343687,-0.0214933,-0.00546112,43
1429008843865,85,-0.0588626,-0.0295408,-0.0224927,43
1429008843894,85,-0.0546031,-0.0216582,-0.0209138,41
1429008843927,85,-0.0301826,-0.00627646,-0.00870456,39
1429008843961,85,-0.00903192,0.00329297,0.000127139,34
1429008843995,85,0.00315071,0.00579263,0.00352247,30
1429008844028,85,-0.0170972,-0.0115025,-0.0139532,27
1429008844061,85,-0.0194447,-0.0166973,-0.0189598,25
1429008844095,85,-0.0261195,-0.0204427,-0.0265896,23
1429008844124,85,0.00110892,0.00356588,-0.00622996,22
1429008844161,85,0.0304562,0.02674,0.0150504,21
1429008844202,85,0.0658873,0.0480473,0.0342599,27
1429008844244,85,0.0988146,0.0630707,0.0486629,40
1429008844286,85,0.123509,0.0745514,0.0608574,61
1429008844328,85,0.120226,0.0724514,0.0616555,66
1429008844369,85,0.063221,0.039371,0.0324523,61
1429008844410,85,0.000369132,0.00239826,0.00355718,55
1429008844452,85,-0.0478662,-0.0277469,-0.0168023,47
1429008844493,85,-0.0813252,-0.0519194,-0.0327328,44
1429008844535,85,-0.0818988,-0.0575837,-0.0334574,43
1429008844577,85,-0.0726549,-0.0534769,-0.0294918,42
1429008844618,85,-0.041077,-0.03181,-0.0119522,38
1429008844659,85,-0.0102503,-0.00799511,0.00682775,34
1429008844701,85,0.0166553,0.0114306,0.0208282,29
1429008844742,85,0.0263516,0.0202883,0.0257715,26
1429008844783,85,0.0328847,0.0192262,0.0214412,23
1429008844825,85,0.028102,0.01396,0.013776,22
1429008844866,85,0.0159926,0.0060239,0.00225571,20
1429008844910,85,-0.00700224,-0.0035415,-0.0124604,21
1429008844958,85,-0.0170411,-0.00213421,-0.0189405,40
1429008844972,85,-0.0227928,0.00220531,-0.0222793,48
1429008845013,85,-0.042919,-0.00807325,-0.0368262,62
1429008845054,85,-0.0451372,-0.0114015,-0.038562,67
1429008845096,85,-0.0436338,-0.0171719,-0.0416367,63
1429008845141,85,-0.0193998,-0.0124798,-0.0294358,55
1429008845152,85,0.00427752,-0.00638362,-0.0147995,52
1429008845195,85,0.0255659,0.0011743,0.00591981,47
1429008845236,85,0.0262332,0.000691513,0.0174111,44
1429008845280,85,0.0209415,0.000976736,0.0281626,43
1429008845291,85,0.000439281,-0.00835137,0.0241117,42
1429008845333,85,0.00102344,-0.00424855,0.0271411,40
1429008845375,85,0.00830128,-0.00140258,0.0270946,34
1429008845418,85,0.0107305,-0.00453017,0.0171476,30
1429008845431,85,0.00233806,-0.0123857,-0.000629354,29
1429008845444,85,0.0234426,0.00272159,0.00320076,27
1429008845487,85,0.0517605,0.0274526,0.0171144,24
1429008845500,85,0.0715296,0.0469394,0.0262951,24
1429008845542,85,0.0484361,0.0429755,0.0139325,21
1429008845584,85,0.002228,0.0234167,-0.00990072,20
1429008845625,85,-0.0487205,-0.00397869,-0.0373698,18
1429008845667,85,-0.0936611,-0.0339178,-0.0621921,18
1429008845710,85,-0.1032,-0.0482013,-0.0660154,35
1429008845753,85,-0.0680425,-0.0355981,-0.0428897,59
1429008845795,85,0.0162769,0.0128505,0.0165697,66
1429008845837,84,0.117557,0.0778599,0.0890428,63
1429008845879,84,0.187241,0.124742,0.138401,58
1429008845920,84,0.143725,0.0941675,0.107108,49
1429008845962,84,0.0370911,0.017133,0.0287646,45
1429008845974,84,-0.0835324,-0.0699111,-0.0552949,44
1429008846015,84,-0.142391,-0.111009,-0.0892775,43
1429008846057,84,-0.1214,-0.101406,-0.0681165,41
1429008846099,84,-0.071993,-0.0677012,-0.0301165,38
1429008846140,84,-0.0429516,-0.0496407,-0.0200582,32
1429008846182,84,-0.054996,-0.0516111,-0.0434747,28
1429008846223,84,-0.0572425,-0.0469186,-0.0590799,24
1429008846265,84,-0.0610547,-0.0417064,-0.0683462,22
1429008846278,84,-0.0314019,-0.0163698,-0.0406155,21
1429008846290,84,0.0230136,0.0247823,0.00818798,20
1429008846331,84,0.0817185,0.0684776,0.0653399,18
1429008846373,84,0.0890554,0.077602,0.0791033,16
1429008846414,84,0.0778447,0.0726989,0.0707948,15
1429008846425,84,0.060095,0.0601242,0.0458572,17
1429008846467,84,0.0897513,0.06368,0.0331669,27
1429008846509,84,0.0978972,0.0673704,0.0294692,53
1429008846520,84,0.0896348,0.0754438,0.0406618,53
1429008846562,84,0.0546338,0.0728832,0.049996,67
1429008846602,83,0.0077693,0.0547489,0.0487334,64
1429008846644,83,-0.00785979,0.0291474,0.0438349,55
1429008846657,83,-0.0347086,-0.0164388,0.0142311,52
1429008846698,83,-0.0659964,-0.0672553,-0.0321968,47
1429008846710,83,-0.0940629,-0.105619,-0.0694404,45
1429008846752,83,-0.117886,-0.124815,-0.093814,43
1429008846793,83,-0.105195,-0.116536,-0.0904195,43
1429008846834,83,-0.0758829,-0.0881204,-0.0685131,41
1429008846875,83,-0.0725877,-0.0764198,-0.066142,36
1429008846917,83,-0.0668102,-0.0642684,-0.0697988,32
1429008846958,83,-0.0690638,-0.069456,-0.0885649,27
1429008847000,83,-0.0335968,-0.0438247,-0.0762719,24
1429008847041,83,0.00672092,-0.024509,-0.0643718,21
1429008847084,83,0.0514103,0.0190547,-0.0180692,20
1429008847127,83,0.092456,0.0722984,0.0506344,18
1429008847139,83,0.102306,0.111764,0.110018,18
1429008847181,83,0.118403,0.152116,0.161151,22
1429008847222,83,0.167955,0.185076,0.195567,34
1429008847234,83,0.171902,0.16929,0.16908,42
1429008847275,83,0.12421,0.114083,0.102757,63
1429008847318,83,-0.00865069,0.0152281,0.00201243,65
1429008847330,83,-0.0926956,-0.0328109,-0.0307175,63
1429008847371,83,-0.157141,-0.0594183,-0.0363748,57
1429008847413,83,-0.121425,-0.0285554,0.0131013,47
1429008847425,83,-0.0692064,-0.00705876,0.0366445,44
1429008847467,83,-0.0454816,-0.032064,0.0167413,42
1429008847508,83,0.0354916,-0.0277801,0.0254221,42
1429008847519,83,0.0445531,-0.0605089,-0.00873943,42
1429008847561,83,0.0240002,-0.112081,-0.0768454,41
1429008847603,83,-0.0171293,-0.149318,-0.15185,38
1429008847614,83,-0.0400394,-0.14768,-0.184626,36
1429008847656,83,-0.113459,-0.150248,-0.219631,32
1429008847698,83,-0.169803,-0.131342,-0.212942,26
1429008847710,83,-0.160822,-0.0711098,-0.138819,25
1429008847752,83,0.0055,0.0722461,0.0402303,23
1429008847763,83,0.166507,0.174315,0.172104,22
1429008847805,83,0.285882,0.235155,0.241891,20
1429008847846,83,0.244672,0.191887,0.182603,30
1429008847858,83,0.116779,0.109626,0.0720891,30
1429008847899,83,-0.0468442,0.00916212,-0.0421798,53
1429008847911,83,-0.0930156,-0.000424453,-0.0364589,60
1429008847953,83,-0.0401226,0.0357587,0.0398556,66
1429008847965,83,0.00428794,0.0385658,0.0827061,66
1429008848008,83,0.0315149,0.0105605,0.0802948,61
1429008848025,83,-0.0541207,-0.0857801,-0.0180287,55
1429008848069,83,-0.154683,-0.17254,-0.116281,48
1429008848092,83,-0.262338,-0.252261,-0.227405,44
1429008848134,83,-0.291753,-0.25566,-0.259431,43
1429008848161,83,-0.25874,-0.208457,-0.236278,43
1429008848192,83,-0.168955,-0.12598,-0.165435,43
1429008848234,83,0.0258973,0.0272122,0.000312699,40
1429008848261,83,0.239137,0.194935,0.201317,36
1429008848302,83,0.37549,0.297925,0.323672,32
1429008848327,83,0.410774,0.332984,0.371069,28
1429008848361,83,0.296752,0.244928,0.277138,26
1429008848402,83,0.200168,0.168651,0.200156,23
1429008848444,83,0.0812439,0.0691473,0.0850459,26
1429008848485,83,-0.0138692,-0.00226659,-0.0203667,39
1429008848527,83,-0.110508,-0.0851226,-0.147399,62
1429008848568,83,-0.219549,-0.176348,-0.293977,69
1429008848611,83,-0.296525,-0.252166,-0.397347,67
1429008848652,83,-0.265963,-0.231108,-0.355192,61
1429008848694,83,-0.164927,-0.15082,-0.187712,52
1429008848735,83,-0.0527158,-0.0519656,0.0120587,48
1429008848777,83,0.0802917,0.0583414,0.213973,45
1429008848819,83,0.153677,0.13354,0.321764,44
1429008848861,83,0.176366,0.152758,0.328377,40
1429008848902,83,0.0923628,0.0805372,0.197264,36
1429008848950,83,-0.0471455,-0.0454202,0.00274959,31
1429008848962,83,-0.135311,-0.118107,-0.128997,29
1429008849004,83,-0.0724322,-0.0533513,-0.0826429,27
1429008849046,83,0.0625706,0.064588,0.0389912,24
1429008849088,83,0.197813,0.184415,0.170363,32
1429008849130,83,0.233267,0.210448,0.190681,54
1429008849171,83,0.200341,0.184027,0.143523,67
1429008849212,83,0.0540085,0.047225,-0.040963,70
1429008849253,83,-0.098364,-0.0933417,-0.20913,66
1429008849295,83,-0.222604,-0.21326,-0.339593,57
1429008849336,83,-0.24437,-0.235865,-0.342722,51
1429008849378,83,-0.136843,-0.153282,-0.191807,47
1429008849420,83,0.0573118,0.0213801,0.0673306,45
1429008849462,83,0.142643,0.109018,0.208619,42
1429008849503,83,0.0925563,0.0917355,0.195527,39
1429008849545,83,-0.0502796,-0.012495,0.0612467,33
1429008849587,83,-0.193814,-0.129997,-0.0928538,29
1429008849628,83,-0.219087,-0.164498,-0.143169,25
1429008849669,83,-0.218108,-0.172955,-0.174884,23
1429008849711,83,-0.188899,-0.167756,-0.19488,21
1429008849753,83,-0.121618,-0.108686,-0.158383,24
1429008849797,83,-0.0522613,-0.0430401,-0.108129,44
1429008849808,83,0.0335055,0.034407,-0.0320113,44
1429008849853,83,0.1128,0.106011,0.0508216,66
1429008849865,83,0.154152,0.137517,0.099751,69
1429008849911,83,0.161233,0.124163,0.104724,67
1429008849922,83,0.210164,0.146442,0.166363,67
1429008849964,83,0.225391,0.151238,0.206024,58
1429008850006,83,0.244182,0.179294,0.280753,52
1429008850048,83,0.213258,0.158436,0.278485,46
1429008850089,83,0.139152,0.110669,0.214067,45
1429008850132,83,0.0602543,0.0402197,0.111734,42
1429008850173,83,-0.062987,-0.0556952,-0.0393412,40
1429008850216,83,-0.205636,-0.155486,-0.205983,33
1429008850258,83,-0.27348,-0.190079,-0.277255,29
1429008850299,83,-0.299055,-0.203447,-0.301359,25
1429008850341,83,-0.162017,-0.0801577,-0.132714,23
1429008850384,83,-0.0618739,0.00251719,-0.00934422,20
1429008850425,83,0.04501,0.084098,0.105284,18
1429008850466,83,0.114526,0.104991,0.146737,16
1429008850508,83,0.223562,0.171316,0.239808,14
1429008850551,83,0.276599,0.19569,0.27104,27
1429008850563,83,0.268688,0.172207,0.219033,35
1429008850605,83,0.226599,0.179096,0.190018,54
1429008850647,83,0.109482,0.15319,0.113175,69
1429008850688,83,-0.0500625,0.0924708,0.0191858,68
1429008850730,83,-0.215946,-0.0269842,-0.13238,59
1429008850772,83,-0.323528,-0.203047,-0.323618,52
1429008850813,83,-0.338105,-0.328207,-0.420851,46
1429008850825,83,-0.23665,-0.343385,-0.359864,46
1429008850867,83,-0.0738887,-0.235236,-0.157154,45
1429008850910,83,0.0173186,-0.128296,-0.00569916,44
1429008850922,83,-0.0166507,-0.105613,-0.0133731,43
1429008850964,83,-0.121481,-0.146534,-0.156897,37
1429008850976,83,-0.154792,-0.167148,-0.262658,37
1429008851019,83,-0.17608,-0.175761,-0.315218,31
1429008851060,83,-0.12136,-0.120183,-0.23593,27
1429008851103,83,-0.0956137,-0.0782796,-0.140742,23
1429008851145,83,-0.0456932,-0.0148699,-0.00512129,21
1429008851157,83,0.128436,0.140218,0.238576,20
1429008851198,83,0.315544,0.293099,0.449232,17
1429008851239,83,0.532011,0.465419,0.637643,16
1429008851281,83,0.508091,0.459612,0.563164,24
1429008851294,83,0.345661,0.352583,0.354609,24
1429008851335,83,0.0255056,0.130857,0.0117409,48
1429008851377,83,-0.127279,0.0229169,-0.145766,63
1429008851390,83,-0.148788,-0.00232582,-0.151146,66
1429008851432,82,-0.0690184,0.0184868,-0.0698853,63
1429008851444,82,0.0197077,0.019689,0.00749876,63
1429008851485,82,0.0324936,-0.0271329,0.00502766,52
1429008851527,82,0.0443613,-0.0632643,0.0136823,47
1429008851538,82,0.0476667,-0.0692046,0.0443145,45
1429008851580,82,0.0214158,-0.0787252,0.0537473,44
1429008851591,82,0.0201731,-0.0465483,0.096126,44
1429008851634,82,-0.0122648,-0.0254445,0.096678,44
1429008851646,82,-0.0496016,-0.0142975,0.0571897,44
1429008851687,82,-0.13512,-0.0752084,-0.0924029,40
1429008851729,82,-0.293886,-0.216901,-0.29368,35
1429008851741,82,-0.349078,-0.292702,-0.39323,33
1429008851783,82,-0.323148,-0.274885,-0.319898,27
1429008851795,82,-0.175768,-0.131219,-0.0869553,27
1429008851837,82,-0.0201688,0.0337766,0.134147,24
1429008851860,82,0.155156,0.201581,0.276164,23
1429008851902,82,0.234899,0.256226,0.235776,20
1429008851926,82,0.166365,0.172814,0.0173749,20
1429008851967,82,0.0832659,0.0642043,-0.186198,32
1429008851992,82,0.00118667,-0.0414062,-0.323346,40
1429008852034,82,0.0573006,-0.0123225,-0.22033,63
1429008852061,82,0.181444,0.082627,0.0109509,66
1429008852102,82,0.349632,0.2089,0.313474,64
1429008852127,82,0.379854,0.234735,0.469997,61
1429008852160,82,0.337494,0.197545,0.481631,55
1429008852194,82,0.168145,0.0714686,0.312554,49
1429008852226,82,-0.0618247,-0.0851642,0.0552926,46
1429008852261,82,-0.379651,-0.301747,-0.301382,45
1429008852294,82,-0.579819,-0.433273,-0.543342,45
1429008852328,82,-0.609327,-0.426501,-0.597213,44
1429008852361,82,-0.407995,-0.250691,-0.389569,40
1429008852393,82,-0.156326,-0.0551255,-0.131174,37
1429008852424,82,0.0272621,0.0664971,0.0636812,33
1429008852461,82,0.15311,0.132397,0.189561,30
1429008852496,82,0.135915,0.1009,0.170083,28
1429008852524,82,0.138207,0.103608,0.169509,26
1429008852561,82,0.0259642,0.0477882,0.0704963,26
1429008852593,82,0.0168631,0.0666847,0.0679947,35
1429008852634,82,0.00181392,0.0708056,0.0422851,58
1429008852676,82,-0.0432409,0.023641,-0.0466702,69
1429008852718,82,-0.100824,-0.0694613,-0.192516,70
1429008852760,82,-0.0685336,-0.109214,-0.229227,65
1429008852802,82,0.059579,-0.0754746,-0.120367,57
1429008852845,82,0.149336,-0.0320211,0.0121917,52
1429008852886,82,0.148859,0.00593533,0.126696,49
1429008852928,82,0.0315078,-0.0111691,0.120026,48
1429008852970,82,-0.136196,-0.0704733,0.00792283,43
1429008853012,82,-0.123458,-0.0222953,0.0196637,40
1429008853054,82,0.0642529,0.105272,0.140869,35
1429008853096,82,0.24783,0.200392,0.251902,32
1429008853138,82,0.389515,0.284023,0.356657,28
1429008853180,82,0.363003,0.263419,0.32606,31
1429008853222,82,0.215636,0.18298,0.198347,47
1429008853264,82,-0.0397366,0.0119674,-0.0476843,62
1429008853305,82,-0.22806,-0.114979,-0.240371,73
1429008853347,82,-0.247668,-0.162504,-0.314394,71
1429008853388,82,-0.147346,-0.0855878,-0.199699,64
1429008853430,82,-0.0464444,0.00620429,-0.0509316,58
1429008853471,82,0.0827383,0.138007,0.182069,51
1429008853514,82,0.0182982,0.099768,0.18522,49
1429008853555,82,-0.0911862,-0.0173659,0.0697902,46
1429008853597,82,-0.24853,-0.215048,-0.177877,42
1429008853638,82,-0.271062,-0.325881,-0.315064,37
1429008853680,82,-0.198546,-0.340443,-0.343114,33
1429008853721,82,-0.0904146,-0.251298,-0.244516,29
1429008853764,82,0.0105476,-0.122137,-0.125605,27
1429008853806,82,0.0271489,0.00553441,-0.0215,23
1429008853847,82,-0.0763373,0.0287694,-0.0471252,24
1429008853890,82,-0.11294,0.0744025,-0.0281296,40
1429008853931,82,-0.0665659,0.0875591,-0.0137775,56
1429008853972,82,0.133735,0.162486,0.117448,68
1429008854014,82,0.379035,0.278566,0.313821,67
1429008854055,82,0.481156,0.334247,0.418875,60
1429008854097,82,0.450924,0.341764,0.431208,54
1429008854138,82,0.385897,0.322453,0.398163,48
1429008854180,82,0.27377,0.232231,0.300332,46
1429008854221,82,0.213249,0.141,0.226768,43
1429008854263,82,0.130489,0.0202173,0.118596,40
1429008854305,82,0.0197029,-0.104683,-0.0114451,34
1429008854346,82,-0.159735,-0.224274,-0.171413,31
1429008854387,82,-0.368118,-0.328647,-0.357878,26
1429008854429,82,-0.478744,-0.332057,-0.436746,24
1429008854470,82,-0.533648,-0.325081,-0.484248,22
1429008854512,82,-0.43477,-0.246426,-0.402588,19
1429008854524,82,-0.2902,-0.168631,-0.293811,19
1429008854565,82,-0.128377,-0.0934417,-0.158152,18
1429008854607,82,0.0869849,0.0470577,0.0514721,15
1429008854648,82,0.134528,0.100961,0.129765,16
1429008854690,82,0.144878,0.181164,0.225562,35
1429008854731,82,0.112669,0.230412,0.269603,53
1429008854773,82,0.0924588,0.266801,0.295309,68
1429008854814,82,0.102862,0.245074,0.259717,67
1429008854855,82,0.115969,0.166814,0.161889,59
1429008854897,82,0.117076,0.0522821,0.0346316,53
1429008854937,82,0.0742891,-0.0784823,-0.104276,49
1429008854980,82,0.0606534,-0.134633,-0.137604,47
1429008855021,82,0.102901,-0.104622,-0.0538661,46
1429008855063,82,0.0620913,-0.103002,-0.0463675,42
1429008855104,82,-0.0150338,-0.107097,-0.0382036,38
1429008855147,82,-0.159426,-0.153125,-0.10034,33
1429008855188,82,-0.296725,-0.206634,-0.177124,30
1429008855230,82,-0.32252,-0.216729,-0.214658,27
1429008855271,82,-0.244148,-0.158139,-0.185517,25
1429008855313,82,-0.0145117,-0.0181871,-0.0616688,23
1429008855354,82,0.208988,0.122603,0.0784205,22
1429008855396,82,0.335163,0.219994,0.184167,20
1429008855438,82,0.402846,0.29726,0.292849,26
1429008855449,82,0.29704,0.268853,0.280238,32
1429008855490,82,0.193634,0.23546,0.268986,55
1429008855532,82,0.0751005,0.162757,0.188879,64
1429008855544,82,-0.0564485,0.044739,0.0329534,65
1429008855586,82,-0.113846,-0.0458178,-0.0851575,62
1429008855628,82,-0.122913,-0.108393,-0.162827,53
1429008855639,82,-0.14289,-0.159984,-0.226316,53
1429008855683,82,-0.11521,-0.141898,-0.183072,45
1429008855696,82,-0.192814,-0.180849,-0.217836,44
1429008855737,82,-0.232674,-0.189106,-0.205371,43
1429008855779,82,-0.323527,-0.244669,-0.274596,42
1429008855790,82,-0.375529,-0.276712,-0.327753,42
1429008855831,82,-0.319598,-0.223644,-0.283524,39
1429008855872,82,-0.144951,-0.0780812,-0.104745,35
1429008855914,82,0.104009,0.1099,0.15641,29
1429008855955,82,0.402808,0.311566,0.453185,27
1429008855967,82,0.525113,0.367767,0.549906,26
1429008856009,82,0.466307,0.293588,0.457855,23
1429008856020,82,0.302837,0.164531,0.2745,23
1429008856063,82,0.0843703,0.0226903,0.048436,21
1429008856076,82,-0.0412158,-0.0327332,-0.0644524,21
1429008856117,82,-0.0645451,-0.0113737,-0.0522471,20
1429008856129,82,-0.0476448,0.0278377,-0.0153778,22
1429008856170,82,-0.01665,0.0572018,0.0187365,33
1429008856193,82,-0.0877625,-0.0097739,-0.0673843,48
1429008856234,82,-0.142457,-0.0828421,-0.153225,62
1429008856261,82,-0.176343,-0.13984,-0.217255,66
1429008856302,82,-0.068132,-0.0915332,-0.122157,63
1429008856327,82,-0.0162103,-0.0568805,-0.0702017,58
1429008856361,82,-0.0244808,-0.0525601,-0.0708863,52
1429008856394,82,-0.0672931,-0.0647387,-0.0883859,47
1429008856424,82,-0.0531161,-0.050034,-0.0516256,45
1429008856460,82,0.0400344,0.00443106,0.0463152,43
1429008856494,82,0.138622,0.0524224,0.124179,43
1429008856525,82,0.13005,0.0300186,0.0960035,42
1429008856560,82,-0.00591582,-0.0618325,-0.0273757,37
1429008856593,82,-0.164018,-0.146489,-0.136095,33
1429008856627,82,-0.245702,-0.158802,-0.155949,29
1429008856664,82,-0.245988,-0.120968,-0.116207,26
1429008856693,82,-0.127706,-0.0208707,-0.003761,24
1429008856724,82,0.0157193,0.068144,0.0743077,23
1429008856761,82,0.20511,0.176143,0.172481,21
1429008856803,82,0.346495,0.248039,0.234954,19
1429008856825,82,0.441393,0.309624,0.312833,20
1429008856867,82,0.380373,0.268662,0.274293,31
1429008856910,82,0.224723,0.171163,0.163123,54
1429008856951,82,0.0465509,0.0480102,0.0208253,65
1429008856995,82,-0.172367,-0.109068,-0.187503,65
1429008857036,82,-0.286698,-0.198632,-0.289616,61
1429008857078,82,-0.377385,-0.2729,-0.363345,52
1429008857119,82,-0.372015,-0.276615,-0.336421,47
1429008857161,82,-0.311349,-0.243595,-0.255526,43
1429008857202,82,-0.193439,-0.163891,-0.126756,42
1429008857244,82,-0.0236506,-0.0446231,0.0436043,39
1429008857285,82,0.147285,0.084732,0.211742,35
1429008857328,82,0.231123,0.153914,0.273516,29
1429008857369,82,0.153989,0.105331,0.155784,25
1429008857410,82,0.0449828,0.0386846,0.0214785,22
1429008857452,82,-0.0550068,-0.0309432,-0.108903,20
1429008857493,82,-0.0782583,-0.0372689,-0.131083,17
1429008857535,82,-0.00846478,0.0172069,-0.0399291,17
1429008857577,82,0.0795819,0.0905859,0.107966,33
1429008857619,82,0.156885,0.137189,0.228686,50
1429008857660,82,0.201557,0.166571,0.311951,66
1429008857702,82,0.237307,0.188233,0.345163,65
1429008857743,82,0.229443,0.178211,0.293965,57
1429008857785,82,0.0749692,0.0563285,0.0360682,51
1429008857826,82,-0.080139,-0.0716401,-0.188759,45
1429008857868,82,-0.211447,-0.19919,-0.360198,41
1429008857910,82,-0.313156,-0.288681,-0.438564,40
1429008857952,82,-0.278248,-0.268559,-0.343246,38
1429008857994,82,-0.270135,-0.239243,-0.268996,34
1429008858035,82,-0.163633,-0.139818,-0.122689,27
1429008858077,82,-0.0672846,-0.0477835,-0.017406,23
1429008858118,82,-0.00669145,0.00456175,0.00693968,19
1429008858165,82,0.0583126,0.0559429,0.0425591,16
1429008858176,82,0.140726,0.110395,0.107028,16
1429008858218,82,0.244326,0.1842,0.224352,13
1429008858259,82,0.228496,0.188975,0.23973,14
1429008858300,82,0.14729,0.151426,0.187965,34
1429008858342,82,-0.0391234,0.040551,0.0094723,52
1429008858383,82,-0.146149,-0.0289549,-0.103808,66
1429008858426,82,-0.0785123,-0.00731985,-0.0656893,63
1429008858467,82,0.019686,0.0341253,0.00201983,53
1429008858509,82,0.128183,0.0860187,0.102063,46
1429008858552,82,0.15258,0.0941737,0.137623,41
1429008858593,82,0.0990284,0.0603535,0.120301,40
1429008858634,82,0.0285043,0.01207,0.0810489,40
1429008858677,82,0.0113747,-0.022868,0.0719392,38
1429008858718,82,0.0266168,-0.0423686,0.0770237,31
1429008858759,82,0.0234334,-0.0831777,0.0227191,26
1429008858800,82,-0.0498855,-0.129391,-0.0776574,21
1429008858842,82,-0.208148,-0.188146,-0.229018,19
1429008858884,82,-0.327034,-0.19659,-0.32468,16
1429008858926,82,-0.301636,-0.147585,-0.316152,16
1429008858968,82,-0.181769,-0.0624925,-0.225445,34
1429008859010,82,0.0896116,0.0802461,-0.00065783,52
1429008859051,82,0.254018,0.167368,0.168913,67
1429008859093,83,0.287844,0.184032,0.219175,64
1429008859134,83,0.192371,0.138436,0.1715,52
1429008859175,83,0.0545243,0.0734743,0.0763682,45
1429008859217,83,-0.0242178,0.0384691,0.0432057,40
1429008859229,83,-0.0254331,0.0295352,0.0602564,40
1429008859270,83,0.085278,0.0711257,0.16126,41
1429008859312,83,0.230508,0.138848,0.304868,40
1429008859353,83,0.317284,0.164972,0.374953,36
1429008859395,83,0.225193,0.0924136,0.261186,31
1429008859436,83,-0.0183751,-0.0648309,-0.0246016,25
1429008859478,83,-0.325205,-0.252525,-0.37863,22
1429008859519,83,-0.534053,-0.383805,-0.646726,18
1429008859561,83,-0.576459,-0.386276,-0.695892,23
1429008859602,83,-0.428899,-0.270015,-0.524291,46
1429008859644,83,-0.255305,-0.127537,-0.28722,62
1429008859685,83,-0.0114579,0.0620988,0.0338062,68
1429008859727,83,0.127656,0.169896,0.223158,62
1429008859739,83,0.260607,0.255279,0.360107,59
1429008859780,83,0.324901,0.263042,0.384832,51
1429008859822,83,0.391126,0.264991,0.416923,43
1429008859833,83,0.411772,0.233964,0.411844,42
1429008859875,83,0.330077,0.148916,0.325573,42
1429008859886,83,0.200427,0.047537,0.18705,42
1429008859928,83,0.102196,-0.0177901,0.08868,41
1429008859943,83,0.000986665,-0.0703271,-0.0260226,40
1429008859955,83,-0.159579,-0.138955,-0.182596,39
1429008859996,83,-0.261481,-0.169454,-0.272585,34
1429008860008,83,-0.348098,-0.186315,-0.328947,32
1429008860050,83,-0.360577,-0.171549,-0.345509,26
1429008860091,83,-0.335371,-0.164996,-0.351128,23
1429008860132,83,-0.183829,-0.0961889,-0.242246,22
1429008860174,83,-0.0377736,-0.0256792,-0.120527,39
1429008860185,83,0.0732375,0.0347305,-0.00517553,47
1429008860228,83,0.138782,0.0835296,0.0890339,64
1429008860239,83,0.111412,0.075138,0.0773178,69
1429008860281,83,0.103845,0.0719636,0.0871226,71
1429008860295,83,0.0656901,0.0289744,0.0575553,69
1429008860336,83,0.0597899,0.00348086,0.0744761,60
1429008860361,83,0.105501,0.0176438,0.148824,56
1429008860402,83,0.178095,0.0754581,0.257897,48
1429008860428,83,0.251221,0.139882,0.348533,46
1429008860461,83,0.210456,0.141992,0.317909,45
1429008860495,83,0.0619499,0.0751661,0.16245,44
1429008860537,83,-0.160068,-0.052163,-0.0796049,40
1429008860562,83,-0.348488,-0.16377,-0.285113,39
1429008860593,83,-0.355626,-0.174229,-0.324712,35
1429008860627,83,-0.150602,-0.050823,-0.142956,31
1429008860661,83,0.164139,0.1216,0.126324,27
1429008860693,83,0.43659,0.272135,0.369466,26
1429008860725,83,0.518087,0.303966,0.425596,32
1429008860762,83,0.320828,0.177221,0.211328,45
1429008860796,83,-0.0230343,-0.0290498,-0.131501,61
1429008860825,83,-0.372344,-0.231833,-0.471662,68
1429008860861,83,-0.455653,-0.293496,-0.54668,67
1429008860895,83,-0.423794,-0.266265,-0.452093,62
1429008860925,83,-0.367137,-0.230133,-0.323218,54
1429008860962,83,-0.306875,-0.188225,-0.190048,48
1429008860997,83,-0.188146,-0.112292,-0.0334886,45
1429008861025,83,0.00417411,-0.0011046,0.14757,43
1429008861060,83,0.251292,0.147166,0.353372,43
1429008861093,83,0.416618,0.246105,0.456293,41
1429008861134,83,0.443317,0.253252,0.40737,36
1429008861177,83,0.381302,0.198946,0.275965,32
1429008861219,83,0.242686,0.103031,0.0967182,27
1429008861261,83,0.0763604,0.0086859,-0.048651,25
1429008861302,83,-0.0765145,-0.0612205,-0.158786,36
1429008861344,83,-0.1382,-0.0672833,-0.157495,50
1429008861386,83,-0.12012,-0.035475,-0.11336,66
1429008861428,83,-0.0337125,0.0111318,-0.0502586,65
1429008861470,83,-0.00916408,0.00603955,-0.0683097,56
1429008861513,83,-0.0241906,-0.0218491,-0.106019,49
1429008861554,83,-0.0952561,-0.0587375,-0.126407,44
1429008861596,83,-0.101614,-0.0367849,-0.027901,43
1429008861637,83,-0.0775303,0.00473588,0.0922713,42
1429008861680,83,-0.00828571,0.0576767,0.214374,40
1429008861722,83,0.0197478,0.0444827,0.182734,34
1429008861764,83,-0.0180371,-0.0375899,0.0176704,31
1429008861806,83,-0.0744083,-0.10727,-0.127643,28
1429008861847,83,-0.0746658,-0.0999139,-0.143166,26
1429008861889,83,-0.0649458,-0.0721283,-0.122705,33
1429008861931,83,-0.0206791,0.00212981,-0.0294005,46
1429008861973,83,-0.040263,0.0180953,-0.0394728,66
1429008862015,83,0.00109341,0.0593254,0.00237532,68
1429008862056,83,0.0157428,0.052394,-0.0172448,60
1429008862098,83,0.0855367,0.0715365,0.0367026,53
1429008862139,83,0.105408,0.0471025,0.0210431,47
1429008862181,83,0.0636689,0.000885065,-0.0215729,47
1429008862222,83,0.0417655,-0.015569,-0.00807858,46
1429008862263,83,0.025415,-0.000950787,0.0503101,43
1429008862305,83,-0.0028375,-0.000834764,0.0704947,38
1429008862346,83,-0.0813329,-0.0437486,-0.00792675,35
1429008862388,83,-0.174458,-0.108948,-0.148465,32
1429008862431,83,-0.189845,-0.137392,-0.217573,30
1429008862443,83,-0.0899918,-0.0892542,-0.146918,30
1429008862484,83,0.115135,0.0331602,0.0701057,37
1429008862526,83,0.266477,0.134962,0.258105,57
1429008862567,83,0.304128,0.172784,0.325945,68
1429008862609,83,0.207286,0.125984,0.228508,70
1429008862650,83,0.0550169,0.0471879,0.0621009,65
1429008862692,83,-0.067071,-0.0231901,-0.0866199,55
1429008862733,83,-0.0863156,-0.0193247,-0.0821296,51
1429008862775,83,-0.0596303,0.0153514,0.0114583,49
1429008862816,83,-0.0270944,0.0486108,0.110377,48
1429008862858,83,-0.0161367,0.0516635,0.1357,43
1429008862900,83,-0.0602698,-4.32806e-05,0.0391703,40
1429008862942,83,-0.0946022,-0.0687118,-0.107033,35
1429008862984,83,-0.0972585,-0.107393,-0.192239,32
