example_id                                 | status | run_time        |
------------------------------------------ | ------ | --------------- |
./spec/lss/block_grouper_spec.rb[1:1:1]    | passed | 0.00213 seconds |
./spec/lss/block_grouper_spec.rb[1:2:1]    | passed | 0.00187 seconds |
./spec/lss/directory_reader_spec.rb[1:1:1] | passed | 0.00041 seconds |
./spec/lss/file_group_spec.rb[1:1:1:1]     | passed | 0.00146 seconds |
./spec/lss/file_group_spec.rb[1:1:1:2]     | passed | 0.00031 seconds |
./spec/lss/file_group_spec.rb[1:2:1]       | passed | 0.00011 seconds |
./spec/lss/file_group_spec.rb[1:2:2]       | passed | 0.00016 seconds |
./spec/lss/file_group_spec.rb[1:3:1]       | passed | 0.00022 seconds |
./spec/lss/file_group_spec.rb[1:3:2]       | passed | 0.00024 seconds |
./spec/lss/file_group_spec.rb[1:4:1:1]     | passed | 0.00016 seconds |
./spec/lss/file_group_spec.rb[1:4:1:2]     | passed | 0.00052 seconds |
./spec/lss/file_group_spec.rb[1:4:1:3]     | passed | 0.00022 seconds |
./spec/lss/file_group_spec.rb[1:4:2:1]     | passed | 0.00095 seconds |
./spec/lss/file_group_spec.rb[1:4:2:2]     | passed | 0.00018 seconds |
./spec/lss/file_group_spec.rb[1:4:3:1]     | passed | 0.0005 seconds  |
./spec/lss/file_name_spec.rb[1:1:1]        | passed | 0.0005 seconds  |
./spec/lss/file_name_spec.rb[1:1:2]        | passed | 0.00111 seconds |
./spec/lss/file_name_spec.rb[1:1:3]        | passed | 0.00144 seconds |
./spec/lss/file_name_spec.rb[1:1:4]        | passed | 0.00305 seconds |
./spec/lss/file_name_spec.rb[1:2:1:1]      | passed | 0.00126 seconds |
./spec/lss/file_name_spec.rb[1:2:1:2]      | passed | 0.00036 seconds |
./spec/lss/file_name_spec.rb[1:2:2:1]      | passed | 0.00047 seconds |
./spec/lss/file_name_spec.rb[1:2:2:2]      | passed | 0.0004 seconds  |
./spec/lss/file_name_spec.rb[1:3:1:1]      | passed | 0.0002 seconds  |
./spec/lss/file_name_spec.rb[1:3:1:2]      | passed | 0.00019 seconds |
./spec/lss/file_name_spec.rb[1:3:1:3]      | passed | 0.00127 seconds |
./spec/lss/file_name_spec.rb[1:3:1:4]      | passed | 0.00051 seconds |
./spec/lss/file_name_spec.rb[1:3:1:5]      | passed | 0.00026 seconds |
./spec/lss/file_name_spec.rb[1:3:1:6]      | passed | 0.00014 seconds |
./spec/lss/file_name_spec.rb[1:3:1:7]      | passed | 0.00037 seconds |
./spec/lss/file_name_spec.rb[1:3:1:8]      | passed | 0.00017 seconds |
./spec/lss/file_name_spec.rb[1:3:1:9]      | passed | 0.00079 seconds |
./spec/lss/file_name_spec.rb[1:3:1:10]     | passed | 0.00013 seconds |
./spec/lss/file_name_spec.rb[1:4:1]        | passed | 0.00008 seconds |
./spec/lss/file_name_spec.rb[1:4:2]        | passed | 0.00018 seconds |
./spec/lss/file_name_spec.rb[1:4:3]        | passed | 0.00044 seconds |
./spec/lss/file_name_spec.rb[1:4:4]        | passed | 0.00012 seconds |
./spec/lss/integration_spec.rb[1:1]        | passed | 0.00727 seconds |
./spec/lss/manager_spec.rb[1:1:1]          | passed | 0.00294 seconds |
./spec/lss/manager_spec.rb[1:1:2]          | passed | 0.00141 seconds |
./spec/lss/name_component_spec.rb[1:1:1]   | passed | 0.00017 seconds |
./spec/lss/name_component_spec.rb[1:1:2]   | passed | 0.00024 seconds |
./spec/lss/name_component_spec.rb[1:2:1]   | passed | 0.00025 seconds |
./spec/lss/name_component_spec.rb[1:2:2]   | passed | 0.00011 seconds |
./spec/lss/name_component_spec.rb[1:2:3]   | passed | 0.00033 seconds |
./spec/lss/output_renderer_spec.rb[1:1:1]  | passed | 0.00026 seconds |
./spec/lss/output_renderer_spec.rb[1:2:1]  | passed | 0.00064 seconds |
