{
    "NUM_L2Mu23NoVtx_2Cha_CosmicSeed_DEN_DisplacedID2": {
        "eta_pt": {
            "binning": [
                {
                    "binning": [
                        -2.0,
                        -1.6,
                        -1.2,
                        -0.9,
                        -0.3,
                        -0.2,
                        0.2,
                        0.3,
                        0.9,
                        1.2,
                        1.6,
                        2.0
                    ],
                    "variable": "eta"
                },
                {
                    "binning": [
                        2,
                        20,
                        25,
                        30,
                        40,
                        50,
                        120
                    ],
                    "variable": "pt"
                }
            ],
            "eta:[-0.2,0.2]": {
                "pt:[2,20]": {
                    "stat": 0.0,
                    "syst": 0.0,
                    "value": 0.9860961251
                },
                "pt:[20,25]": {
                    "stat": 0.0,
                    "syst": 0.0,
                    "value": 0.9860961251
                },
                "pt:[25,30]": {
                    "stat": 0.004258295615852299,
                    "syst": 0.0,
                    "value": 1.0193030668677379
                },
                "pt:[30,40]": {
                    "stat": 0.0009949411380145512,
                    "syst": 0.0,
                    "value": 0.972808430616739
                },
                "pt:[40,50]": {
                    "stat": 0.0007128348074592252,
                    "syst": 0.0,
                    "value": 0.9756961855417524
                },
                "pt:[50,120]": {
                    "stat": 0.0014792555595974127,
                    "syst": 0.0,
                    "value": 0.9765768175025842
                }
            },
            "eta:[-0.3,-0.2]": {
                "pt:[2,20]": {
                    "stat": 0.0,
                    "syst": 0.0,
                    "value": 0.9670872957
                },
                "pt:[20,25]": {
                    "stat": 0.0,
                    "syst": 0.0,
                    "value": 0.9670872957
                },
                "pt:[25,30]": {
                    "stat": 0.011378700137163397,
                    "syst": 0.0,
                    "value": 1.02383084987934
                },
                "pt:[30,40]": {
                    "stat": 0.003148714820493197,
                    "syst": 0.0,
                    "value": 0.9532076474385578
                },
                "pt:[40,50]": {
                    "stat": 0.0024686212831122644,
                    "syst": 0.0,
                    "value": 0.9501561580041396
                },
                "pt:[50,120]": {
                    "stat": 0.0055350375455052525,
                    "syst": 0.0,
                    "value": 0.94115452730241
                }
            },
            "eta:[-0.9,-0.3]": {
                "pt:[2,20]": {
                    "stat": 0.0,
                    "syst": 0.0,
                    "value": 0.9879215434
                },
                "pt:[20,25]": {
                    "stat": 0.0,
                    "syst": 0.0,
                    "value": 0.9879215434
                },
                "pt:[25,30]": {
                    "stat": 0.0035206224132166364,
                    "syst": 0.0,
                    "value": 1.0206479739673617
                },
                "pt:[30,40]": {
                    "stat": 0.0008781540533380238,
                    "syst": 0.0,
                    "value": 0.974436633204711
                },
                "pt:[40,50]": {
                    "stat": 0.0006395346892144703,
                    "syst": 0.0,
                    "value": 0.9773110068675381
                },
                "pt:[50,120]": {
                    "stat": 0.0013383674882205202,
                    "syst": 0.0,
                    "value": 0.9792905595364018
                }
            },
            "eta:[-1.2,-0.9]": {
                "pt:[2,20]": {
                    "stat": 0.0,
                    "syst": 0.0,
                    "value": 0.9219194633
                },
                "pt:[20,25]": {
                    "stat": 0.0,
                    "syst": 0.0,
                    "value": 0.9219194633
                },
                "pt:[25,30]": {
                    "stat": 0.006639079981613051,
                    "syst": 0.0,
                    "value": 0.9386086254793179
                },
                "pt:[30,40]": {
                    "stat": 0.0021698037425187775,
                    "syst": 0.0,
                    "value": 0.9050723204796043
                },
                "pt:[40,50]": {
                    "stat": 0.0016554407782285979,
                    "syst": 0.0,
                    "value": 0.9178182397004868
                },
                "pt:[50,120]": {
                    "stat": 0.003614346841200901,
                    "syst": 0.0,
                    "value": 0.9261786676497524
                }
            },
            "eta:[-1.6,-1.2]": {
                "pt:[2,20]": {
                    "stat": 0.0,
                    "syst": 0.0,
                    "value": 0.9292953127
                },
                "pt:[20,25]": {
                    "stat": 0.0,
                    "syst": 0.0,
                    "value": 0.9292953127
                },
                "pt:[25,30]": {
                    "stat": 0.004870345006075833,
                    "syst": 0.0,
                    "value": 0.9280567919364263
                },
                "pt:[30,40]": {
                    "stat": 0.0015635630880036484,
                    "syst": 0.0,
                    "value": 0.9145627379485352
                },
                "pt:[40,50]": {
                    "stat": 0.0011740420309780408,
                    "syst": 0.0,
                    "value": 0.9300017758710003
                },
                "pt:[50,120]": {
                    "stat": 0.0023400975175742636,
                    "syst": 0.0,
                    "value": 0.9445599449853099
                }
            },
            "eta:[-2.0,-1.6]": {
                "pt:[2,20]": {
                    "stat": 0.0,
                    "syst": 0.0,
                    "value": 0.8804407353
                },
                "pt:[20,25]": {
                    "stat": 0.0,
                    "syst": 0.0,
                    "value": 0.8804407353
                },
                "pt:[25,30]": {
                    "stat": 0.005691183578415755,
                    "syst": 0.0,
                    "value": 0.8705120470146824
                },
                "pt:[30,40]": {
                    "stat": 0.0021869793231161427,
                    "syst": 0.0,
                    "value": 0.8668615147551098
                },
                "pt:[40,50]": {
                    "stat": 0.001885042840634592,
                    "syst": 0.0,
                    "value": 0.8883492136712792
                },
                "pt:[50,120]": {
                    "stat": 0.004004546456669062,
                    "syst": 0.0,
                    "value": 0.896040165775064
                }
            },
            "eta:[0.2,0.3]": {
                "pt:[2,20]": {
                    "stat": 0.0,
                    "syst": 0.0,
                    "value": 0.9723117108
                },
                "pt:[20,25]": {
                    "stat": 0.0,
                    "syst": 0.0,
                    "value": 0.9723117108
                },
                "pt:[25,30]": {
                    "stat": 0.011556554168147933,
                    "syst": 0.0,
                    "value": 1.0181274701665946
                },
                "pt:[30,40]": {
                    "stat": 0.002987073865266549,
                    "syst": 0.0,
                    "value": 0.9551246935847494
                },
                "pt:[40,50]": {
                    "stat": 0.0024705172942895244,
                    "syst": 0.0,
                    "value": 0.960089067844617
                },
                "pt:[50,120]": {
                    "stat": 0.0055157925765128395,
                    "syst": 0.0,
                    "value": 0.9559056117636058
                }
            },
            "eta:[0.3,0.9]": {
                "pt:[2,20]": {
                    "stat": 0.0,
                    "syst": 0.0,
                    "value": 0.981252887
                },
                "pt:[20,25]": {
                    "stat": 0.0,
                    "syst": 0.0,
                    "value": 0.981252887
                },
                "pt:[25,30]": {
                    "stat": 0.003684431226354328,
                    "syst": 0.0,
                    "value": 1.0060459424782924
                },
                "pt:[30,40]": {
                    "stat": 0.0008978838250043366,
                    "syst": 0.0,
                    "value": 0.9694137561712824
                },
                "pt:[40,50]": {
                    "stat": 0.0006393490600575989,
                    "syst": 0.0,
                    "value": 0.9744236114525809
                },
                "pt:[50,120]": {
                    "stat": 0.0013619879739473085,
                    "syst": 0.0,
                    "value": 0.9751282380333938
                }
            },
            "eta:[0.9,1.2]": {
                "pt:[2,20]": {
                    "stat": 0.0,
                    "syst": 0.0,
                    "value": 0.9171615204
                },
                "pt:[20,25]": {
                    "stat": 0.0,
                    "syst": 0.0,
                    "value": 0.9171615204
                },
                "pt:[25,30]": {
                    "stat": 0.005981678181858625,
                    "syst": 0.0,
                    "value": 0.9305279367067414
                },
                "pt:[30,40]": {
                    "stat": 0.002197356702952245,
                    "syst": 0.0,
                    "value": 0.901911998704632
                },
                "pt:[40,50]": {
                    "stat": 0.0013192254929756647,
                    "syst": 0.0,
                    "value": 0.9133831813238125
                },
                "pt:[50,120]": {
                    "stat": 0.003567547270964326,
                    "syst": 0.0,
                    "value": 0.9228229649031143
                }
            },
            "eta:[1.2,1.6]": {
                "pt:[2,20]": {
                    "stat": 0.0,
                    "syst": 0.0,
                    "value": 0.9173669327
                },
                "pt:[20,25]": {
                    "stat": 0.0,
                    "syst": 0.0,
                    "value": 0.9173669327
                },
                "pt:[25,30]": {
                    "stat": 0.004856468247549911,
                    "syst": 0.0,
                    "value": 0.913603885078269
                },
                "pt:[30,40]": {
                    "stat": 0.0015883761704543473,
                    "syst": 0.0,
                    "value": 0.9037219435750745
                },
                "pt:[40,50]": {
                    "stat": 0.0009336384976724034,
                    "syst": 0.0,
                    "value": 0.9213289340549748
                },
                "pt:[50,120]": {
                    "stat": 0.002503664579769308,
                    "syst": 0.0,
                    "value": 0.93081296821784
                }
            },
            "eta:[1.6,2.0]": {
                "pt:[2,20]": {
                    "stat": 0.0,
                    "syst": 0.0,
                    "value": 0.8703347073
                },
                "pt:[20,25]": {
                    "stat": 0.0,
                    "syst": 0.0,
                    "value": 0.8703347073
                },
                "pt:[25,30]": {
                    "stat": 0.005600673693727446,
                    "syst": 0.0,
                    "value": 0.8635251859440787
                },
                "pt:[30,40]": {
                    "stat": 0.0019725109882092074,
                    "syst": 0.0,
                    "value": 0.8499665496102162
                },
                "pt:[40,50]": {
                    "stat": 0.0018345994825809512,
                    "syst": 0.0,
                    "value": 0.8750715728068634
                },
                "pt:[50,120]": {
                    "stat": 0.004004386700585413,
                    "syst": 0.0,
                    "value": 0.8927755208291126
                }
            }
        }
    }
}
