-------------------------------------------------------------------------------
Test set: com.mycompany.app.MainTest
-------------------------------------------------------------------------------
Tests run: 1, Failures: 0, Errors: 0, Skipped: 0, Time elapsed: 0.047 s -- in com.mycompany.app.MainTest
