%YAML 1.1
%TAG !u! tag:unity3d.com,2011:
--- !u!114 &11400000
MonoBehaviour:
  m_ObjectHideFlags: 0
  m_CorrespondingSourceObject: {fileID: 0}
  m_PrefabInstance: {fileID: 0}
  m_PrefabAsset: {fileID: 0}
  m_GameObject: {fileID: 0}
  m_Enabled: 1
  m_EditorHideFlags: 0
  m_Script: {fileID: 11500000, guid: 624cc7f4376302c45941bde9ead9264e, type: 3}
  m_Name: Pera
  m_EditorClassIdentifier: 
  id: Pera
  Name: Pera
  Description: 
  Image: {fileID: 21300000, guid: ba51ec6ee1a697a4ca40b9568c327352, type: 3}
  Icon: {fileID: 21300000, guid: ba51ec6ee1a697a4ca40b9568c327352, type: 3}
  IsTool: 1
