758776112364996
527260255624115
681058360388506
150476495102635
304864900421387
455881829030671
528796030882914
872201739148417
303385252520919
456077861335831
786001713619802
121295840315585
662188031842158
717980209057783
875369593636777
117957278034992
518291766208914
434611132997531
240685463135749
158071390991674
913486712852596
213371867294968
596044372915603
673812631293648
803192654587824
566189659020955
201991310277125
721521458357637
793379824120696
320944881871367
496692518350474
739700061701327
464334834459282
909785260575934
323911781976764
397658632935711
805390177352739
650517228538733
261352669960204
345592329412390
637063365068956
974822835202807
413009829287752
492759098119205
660498634069385
877072369973819
206215807862548
580492782582379
431984116833217
358066537054663
243173697072963
881958694789282
932784376750501
668918435305124
537076571961590
703274581591682
264890412629032
889096870472988
897052308114551
326039684203764
860703993873675
981292212283515
268318241486613
582450043563386
964174296454665
923075107943659
867988589047685
906670840814886
319006759968495
483171260978044
483119112506168
140161387747672
970294482496871
891952560193980
996556311251425
868829453317691
171925138512477
829918179065841
878923958299351
623069400644334
373593822272566
776592119507434
328483145095042
822818906400487
229120896236794
253802121316947
457971660013516
939162930688093
513487933434611
944885583620330
364598668852077
681982278015888
655487753812863
933478433052479
915304040339618
846308346804727
157063816049002
499069895696321
703957684923368
707452814390116
288498819589811
254976905828433
148456003017194
493086620203666
471983828486814
933069204180877
363693918153329
569788212362038
590933711698437
861276441714220
893109423774385
705452819366868
988783138233156
361011081883577
470100244668544
957708784121430
661030811175163
767783808058057
337175234984875
671493257184811
372790529630458
665487899993689
765301897450498
449188949375811
850754229398330
621994853226617
374111410343394
641832357023074
990272031393827
598208181958535
505606525196214
712889092060695
258745870206160
889943548895878
168817518365790
694385956971938
371401501683537
763927695381567
849966456622082
736592323286958
621859377845673
395960363045674
488212589466401
249079478720586
821480357537453
191050271736112
199038112480731
320071009564750
341969392263232
816309056367795
671973744875146
750309042810308
763450702428895
493269120962657
183776387067861
449204126524065
692993905043376
132398661486852
963776601290956
177675302397651
731282253161325
195700274421759
741696851153780
193173962479313
310938479027213
522480357416992
400347997352464
168172559371213
453022860643665
337200735106841
469404212318291
937667425028843
870796029152057
124830171568678
200804095548914
201289829601642
698127255171863
438674990705567
824264222367514
218386292889747
263182108454904
518373818590706
188869882459210
336819690527434
317594508451223
293875110579237
752774107338726
241101875858494
839865034651692
697996607766227
316907640450286
691786753179094
130729042137795
342657354843904
131931574410070
502472421417926
490487238467441
385941724607157
365951785631248
841214634587731
656786503647026
689556355669005
599383345266098
578266391491065
264488293321770
898865870779556
443042100266874
272067793029415
340163380992049
124566086812289
794592895337048
504834425904425
169066698154846
363800642799624
892632926114967
932494888485133
594885170955151
561887854104709
991060447921126
998285456486803
318058950529688
294285275687447
136394400140183
406815954064482
399299606008949
867871149624518
823554034810427
510381430368092
967698336561761
702397548324820
374066097212024
868388951635802
348787665629775
821280012001036
828702579346885
631983632577295
661066720402557
820603564849600
140384591432098
434485851613229
321070219201750
211163989952247
210264029069608
340123203239503
380942056121205
818038048549807
302565221085500
134398760796052
708980038661186
354283351443746
741089295308172
159423926447817
136963204504176
700291803685705
153977150235912
132971786973215
219479635290587
150022990824155
979169409881892
341253655392511
372565594889001
463561504277076
385359649614908
456586310414974
159031020770559
717029433337475
924489508910510
221473731169787
249576869370416
933693719627928
989122427729836
488482564948007
422590767475545
839594471517105
461860080474556
473039163464156
596816529151410
281798992910930
840780327199596
732872151633963
888675244115909
715119119909557
538178108158611
128518730442616
184490322298183
787021767234759
709160509446888
417019320795653
254398796285975
273196960031065
204391742253636
237288142990775
295749101855474
304118730099005
258599750566114
196077166555756
423860714359827
991474856774964
202966594724987
308840567377534
876942302103780
623951309083832
394798670994872
941170314263108
173184997738664
518287475185735
240317269313857
295633812204837
162474406764973
404504360680587
419804862944277
314949556942747
173132253623980
257291138686040
691973011507897
819858659926523
523201347554538
861710715890340
482284851027814
254176562462731
614979816801534
229877087696233
927060536854639
788862123141873
367174012685525
408281147231765
678980259027353
605191074858288
338021595802675
265868414066402
179987946582238
771993980290900
281709307690469
129280025875886
712887390949341
218875775263550
180759440367958
394682381525048
498415969414629
838738543535694
215690437196417
438962422035782
404079417014269
178862765285530
899189652177447
451172356200247
842486794895660
210697217437842
693888718753934
384616030070466
174799788586895
274079482225771
351330263103137
186315054734723
763959459902966
568948854253866
319928311060575
367948511347817
462819517499548
841784042450506
846357829151129
760958741781567
767806556828780
284474797527699
493042010094619
