244034001682226
631015871539966
824575653256332
900565981183154
991486749194520
571674192339967
148686103085781
399293764813629
218961235090109
288176665395022
578202386286521
531784999047000
466969078304012
928066915762121
157163512991986
703661115579807
431277727688761
914273615147255
261567292961852
738952763040783
438070721567965
834880151477917
549598295501037
291188753235519
643871602028990
146887384596571
209271853579768
642705852236061
142474511156548
637692756453889
767887755436246
994041370369496
210966564926395
852496223624741
341180766303706
522550119132928
854778674937827
133059141958852
486685116479817
958955059841081
689277758456057
793475079764689
545686715837964
308031305933529
169786113358916
410122276036124
892448462922880
387764372643384
347497821775759
161098716404260
584573355064594
987590522409418
437558257961674
341694116110295
106171250905742
802385655959144
333772943724720
832811879471642
765684105003684
592595757896163
962022610769482
638954091899790
280854932034333
749566824611747
419955877363810
833788962665022
685298628302759
304742708493708
784684964408595
929197727152665
494280252793334
547077279422960
506708518238652
237156633288999
285297362419012
994048171381428
613951888068976
671908768947026
564596663664415
935049875438619
678608360610038
260593775440344
620060384899279
768066585981503
910254320839193
820800070408028
865382830994099
310967451291927
707851545924695
505066181291192
684969222445274
829958831187891
118246548655840
146007039158073
725879058739913
848829694909648
147275542585685
984070104290456
321946504581558
849161545959052
410513464190785
958292828577971
497270545001693
748041269362267
867104828244733
245462012491925
805290008351261
574921706369634
384894985159256
558775091437626
747867888379520
960933439031953
779038972423275
380296933536645
470063511736763
344067185232039
355169904337559
596062330394765
549208137129057
746700881948804
520907858085786
975234050541888
251451081635849
734966475807678
443393061830505
377305929277769
592072850628819
271798665314844
837069399827366
100879122106072
584034845381016
892371596994769
665903702578565
566474484560752
476026080407367
580210829754254
603973576735991
876961000379842
765276566224585
821174828409971
540397371618775
759805926663574
703885276901164
659158025141604
464060227516278
979980430210608
369062674086285
412216786076793
789465064477853
988863417014887
925945035666808
266556107801092
413955826604679
995995833943375
625596026626378
514483546111242
960881470740083
894288215562810
878606288513730
763081749984310
372040759616706
498599433953184
710384160758508
235493725954356
520271684908181
271789867098857
198198536511467
654676265752606
745980783027120
267059361607807
166210165974758
623064200568767
299051301620381
879560348484696
643586357230136
390694125981582
416377426306540
201804746624244
838263327766711
552408924978018
398799723117859
955123273186035
243495326180856
405238250126807
439956486792593
228856170845949
856786505615844
166816230737797
615378012772149
420169812290001
741819314796156
224242592065690
697594090936279
940973601847881
272497091052152
649967435233155
171171049832294
337497916934835
900495022726653
810044852424825
908958694265846
336900449883431
697072404845251
875579946060669
838946953124466
302360617319612
304393692641912
802066882095448
740921293562726
910099869778999
647590306862556
212289858314098
129561213208619
557944809120552
475949312440509
