559950639661735
188908649883271
411898089025959
408298290989565
600199270732756
606485325139948
219385275161219
873505194962466
341703569298653
145860736392127
101977483810725
762052819615897
780991858600547
153187135943504
203000927395531
630888795596563
726884020614675
372634361437268
702931754218664
824945226975033
735178028486869
249601814497820
929508064685281
972665332826817
359593626279517
935875536768521
127972086020428
112604072815522
437685762231356
263135274503532
635270846186836
783464315578779
783767361487960
992857140995281
555881105564269
120852640174344
859167459937091
383873311357222
238941386600401
315068036527068
990601611925701
831071513530378
910876901532642
691767248951261
514155446072324
507420996769804
718881180959156
184586741010148
747457303771202
122583531513113
230162880022772
906189972636628
681147803996146
415557609442313
263041369466634
200486242505586
313705664578101
602866355001487
195765837125546
470227716205587
159051877161101
313803166296776
979812125332394
107020488898148
285347575263199
233280767081926
704931568150263
457973998134127
865812888782282
121881874362152
756899509777647
446386937367057
731564315074525
963812716306279
652697174067085
431920305747354
372752178894648
937949959051646
734870828301984
473193631809098
551983046313937
916809819852587
366947936999476
829753168476858
993150446233146
776984941512532
229427470814083
305880904934941
883282650462076
493917789713018
507352397596699
437855940905144
160683196850642
618132089489633
715819265377903
593521683067773
765381068036341
898809896107090
806560069415960
218490253915445
752815811451416
239960596158616
217987808978352
153283688594250
158889493965931
790018831491110
518802070518176
440758617140915
655694685323909
335689967230529
271869771865952
977987925020607
645683705588182
937880904063451
723841637547380
986911112846798
287443648293714
925781550339151
901274854871424
422160349685544
400283839471677
976963622456111
942168782563757
318619488896352
235949187400507
433607829972927
230456960999102
134281652985912
112884841080694
262296110132990
210062550591469
877419465557417
474809653830102
771035253290926
160785817898437
768062148536158
517976237906601
127698309371764
803997893380893
776878034725785
845379907868598
847392965410854
321952945418724
908592046242375
415691841514455
911773815003884
692008722292273
600010600627460
119073484842768
751682239844822
460589915548754
611692883340141
712827443885676
339849598735157
523394284563711
785496867608906
995965870953956
294798606002900
424920575492899
122595801936607
700751728391016
295265099641351
653872884350303
795456208825618
524027508967627
204040994799284
953780505563005
903776804373698
885497286418808
680907649397739
451484699638006
655752576984339
764085881349505
563116075182665
421032731553817
243177229463870
763179832172160
964181944961918
612789910740527
505871376772848
432486447802117
730008821368890
746783329918869
213605002321432
626165178756737
564870426704251
616172079144415
696479947399777
314815071943799
788768450518907
969185766051394
541032233820472
153127343520240
805919820833192
365019516582223
433592829049443
702162177715553
474904640955164
782827372780621
296487945152549
532032037124877
262881566820168
899809424384827
804831785780232
394162727782915
900139267207345
942057286156827
600061473481707
171764137689346
152010657179464
258181097674772
701495487987384
591796715224707
229689952344458
827855488669139
584464327288864
638928316639507
705187316508905
894698491520953
617109371554693
576050866103832
147044011535290
763916846485822
684318120154615
403179792536941
289521107132095
456558529496872
113616022482068
480102863502492
790960025997337
608956851535673
492893800309738
790195313034008
671778384386805
225889198038128
198153699323111
526383721428325
247909525227996
771130386472895
848396445179732
869896988525059
922570197069104
392298738864509
669059739971986
129972332205766
695957605514607
632000528528616
477052763308329
583116820241741
169813959635095
901067203800539
299094553824167
801363999665734
963048112048475
589375628274759
327767795479942
129919290135285
743339279466888
952811626277200
224992922206299
280133926957389
771168064105713
884742610707895
228044969083651
173892725014593
339057720500792
513141016029177
391905974857853
557963473698747
848007222925238
364100669249304
759002484211670
584793621069370
845211663793868
299606904982869
216942985262626
256394141889681
251100994497979
980159690582711
400862608166578
309822477239277
402261575748926
834076016577125
556909806809959
895950219160738
826020822344487
969987533642189
334163846665585
660000613408673
526416282433807
955873530033548
444167890113159
406595155908080
392489948863773
626558307221104
105079495198504
706382603668489
477143410513052
781851106962997
906806956942630
204400994406663
222910980205536
995186030284833
312383771972871
364817693045454
815461096113472
398519854858830
421167601070813
454169769351066
545067422220622
641187609730116
142940963273745
201591781109250
924175478655709
110387707625964
361474933731679
789697064085710
121274336605227
946864925207636
139504203340305
544110369121544
286050026354645
715203542555518
139095656643863
955598092530401
859878170895421
986310522874206
837347303256612
467263391851146
565064495076945
387744064807657
531687057344994
961943954160460
857591127162687
516939623126711
742356144159813
805601938716823
254182010224968
946609665706466
153399985532423
314788318294119
254406527321884
675496768939755
689236088158586
669297117995407
307092039485350
884993733160398
518787524516235
690859302609936
151494769683730
208401469147835
720509306437437
786827353620362
472956470915912
349429422956147
538052166559598
153448930855945
718286552065126
745008769264631
735510942233993
289875448477495
908576136751707
446557310136167
204978339894324
521675692164235
967798664440916
335883584903440
781856561304475
923182226518081
470057220224222
257878921454637
859925910940558
774588970216348
239562602342331
145859467553203
490099506203051
627830770802756
355184438803010
711399309152169
480303251719113
467682826650599
301793599536322
118390052043610
198702233950889
547690092522706
541399288905267
714397718556074
554875015654695
772573884840109
441306929744091
662685876299594
535663109783823
322701999799915
160026823266376
359626254851871
273617917737485
271591957387234
312366622515433
218920509056479
562123424872369
118969592416794
702694012599037
426038064248157
182750700268767
743113418681080
197736029480100
342174058813156
720039694332127
601926958281786
712181008731827
151226739955817
364796736934845
755942069207675
321179351761660
737166339976565
210980687376121
567397737452390
634399833594511
934149710693395
744998585226724
590888296608584
229022178264891
319308455336682
682951816781659
715382385008481
998789593530243
508063333299641
618869475203972
410586278680794
121174153781387
360188798304628
979153478920371
979895622608328
147974979835868
504501729773750
204008137796954
594977505554949
651846077277212
844380528944927
703756071234057
251992880380054
684819004267704
676470818427486
459822924730653
864255565798604
941644766486175
610300909040752
515240658657640
829950523973344
735127031861555
463680043309113
482939892875388
297303091292739
194383250861235
763732297950766
394950220460462
284198015623589
113686259703707
148881634191716
871893789278863
100957010874800
424287109036147
248928091704994
302150473379453
170070431468733
785030783052144
952888879565476
551490807840818
580962669479955
995013920075020
928022702737066
369077134293830
665562552981493
224587732605465
735280517767586
965134393363991
112385810875116
307094634150647
496964120404273
831926385012681
960691459787472
416900049186419
834493435745766
287975564870504
791271186857523
504967879446392
151282377679142
418872838284824
809861686808529
213800987875524
277920382996766
769852182371259
781659703676241
991391023768747
689385929017416
434898909203641
173853590557871
154283749139925
792871757220156
648945645228977
983685158757988
192997009201229
818670548178716
541120911142271
937953308594517
893675263850619
427867369314441
154022422204914
217147845659395
782863890975736
143167820349625
556209438929716
703898781336157
154921207763399
214742494608991
168005815057513
323800570026710
800907632565068
373210673601028
222961793834016
412500319742898
717172850404605
235934015294719
841889103541753
837280336011109
273006191432468
305061801726698
989058921162508
939486572035704
584584776840364
142810238593236
218837461294143
729975963107075
761708183299181
730816090274656
315076170187507
139231470620079
194961954804674
851393059557041
120030768671517
503885951887813
413787250207797
768290804604335
969426493303765
192003919955204
153084566136187
468900778853457
780607019832633
618038071333501
262030304068511
759087837043401
396803124632790
469837424473248
427038067284496
971504649508409
503758717435876
964693590057496
317098007744931
266132826780193
579885211224713
253867167695611
106141107996361
342209691999886
116694785384947
333552222535161
146010709909217
995950710469891
720585173512994
203947523224540
312596861899413
689768743234781
123872068226048
298191785342145
652054529972439
575069043337753
775809317026176
961789709495283
528862319761446
525962550542994
608160891016105
494989329643860
470769281959952
107392497432931
469945987480237
759902936171320
589979005980534
133524426594238
926851009748400
620162869539631
266292019712464
389268042844265
669508334745231
772570408302682
957889032337909
490498331715334
621309929593082
846095967615032
863709835078416
355717844631146
164396271986765
422498315416305
909051689264947
483035799129265
372675362705591
111699953623696
462766394651511
585975119103994
186178010411975
537697457800912
471311339062868
