102071279613709
638477337813562
935502268771238
515036645550652
609607473303957
245168939361088
393684853094892
581274645332947
456879229040787
473292118623713
352841314166713
236899966408662
169485339980607
900132359793996
773185448934784
888598230307832
880107637114369
563770230650630
190766717264871
743080181721236
465992195677311
940968814050946
867171535830764
623158354048702
748749645460617
550183735855971
753899499358604
117255761399100
458979381745449
986783526414686
555004948412366
115936959338749
845260521158655
356018845064346
113994109299150
121568630388278
489596347298055
533929180697311
537494627697430
181585785708820
618782502527833
360690436558673
722207296465586
839462830127673
591009603500675
397951391501325
320062958096809
887290593114769
827677375563582
425962936786899
139132028392097
944943294831741
142951340244527
786121431749247
417869290281822
959365487987686
881490707190311
446494588257073
724318249357719
261326487617579
977588964384335
833823160079225
995600887055951
709946347179170
264882799523804
791061818932417
558259201709084
152868239843915
129498760791339
216150503580439
703999239138034
741483189262653
832770040031167
581994995274849
524003373026219
402300514278113
448800827593982
317579973169114
334056376082686
452813484777471
181695834029676
322473050669198
816752666022082
605592568627829
406951075097786
666893995753927
178387866687770
682550184098265
879262085012474
581910849901073
944013697741027
904096918542867
194770243455524
899947993895841
218927317179376
647299094651164
657877193342640
699699936587968
153088663888593
649479177130737
739389067055759
336050719243889
221126578676581
574180291986390
258583100974539
979619401441041
344151038709666
280062413272827
590592003620939
666266002965207
655234594198904
955933555344737
954092999210497
200979495027988
977973098216377
417273795164384
652275165126692
736572942239248
862107129726258
570184665431616
123682801466821
196063976456918
773698745004679
835492656068501
281180617851682
201332885599791
420363249079062
712864022560108
478942022857932
972167506709747
950628482741180
447980600003237
404073739136469
112598637674667
118966128897902
473961672276879
755758786134388
322741566400726
547681521391691
200581186758187
648823539494889
666990688809047
931954056686631
378061676432460
633024940336173
701597346455279
936700936818304
351134618130831
489920671932055
379399131884836
292749059473196
530695542632829
563282806821749
266032497887865
333792865795636
667164198059846
904298029105967
514913809613968
717081000057711
201651055426567
584733338268127
676798836705348
550812896977813
584376575549403
533924879552723
601736495103213
562157507569763
592929787992884
488784143887806
732222902609273
549656052467568
388277957960250
259089557777464
563897691357310
462365129773654
697158606487016
250922020624274
283480510017332
950755635721997
826074344904612
289801194274544
694557989036785
558252365584249
782290754354375
654140365420387
283032573939529
531678981726012
106046978453540
377003825598136
598187748259916
251888765106635
857181531980934
784580913425192
504021427679949
725027685994307
123921403089168
279716731139465
875544259790173
249393109890692
743249029945329
745797281825600
133589280302818
408062541415846
130158218787572
486664065432017
651289583415914
157966696413899
760195553579064
380954571038588
893258960351011
182695968499468
874484488044901
349814681353023
790596682868048
706931088624990
951190325484459
896789747951357
231920789387609
323141547776814
349295845996649
115205272895976
820571560423638
169788655688772
926881796669592
820900817126874
230221324332392
904884906522898
202027993770219
265302520161009
618751288978979
586066282527832
463497803601647
440163658514574
262090210466435
988361976512227
394199277874837
193558297364656
588042510086548
472956916795712
131951644415657
856913746437587
804691252953045
302373252787511
614010737282196
671284438793631
282850640656027
535804618373736
979272067139876
843840611520003
344002511700535
289107084436768
959791362252567
524253450319996
894875318799756
476133930288339
326756659153918
843407321316895
687795040751967
563691678466807
446124707923309
506901006336251
733783549651434
124021656696778
738074149885877
459050956084037
553780423506427
259057377582446
272157356621340
611786522263332
843850639698945
343836013634547
984562951495770
215080592662602
335161086220964
111164987541660
914949624651639
963398631935131
332771565363561
414398035304633
155571433996311
122179402041821
351898741040587
177498307890777
783764131813510
942120450439023
112638647745772
297860825512426
922776388026619
770271360725501
812388493553887
519466433410870
261593076757259
612960995434989
748878297645955
525850303679886
417084234597670
120968561530363
195109695915327
676651312570988
873767307644511
763004514086991
245821636489058
730873025536419
113514610334066
188709582838796
633067024971004
401514284343038
132999169154614
586096731062939
216886713010380
531008269198105
991565999190535
529052652964073
663671250727077
633567322637174
710909820392627
525037965154690
291578947606778
801877252353669
373939726223686
796851658735041
771257970452044
247012903156845
118397337649464
534883867005963
518253486042629
583772820783640
561592998656546
279108824657251
887378050733253
846790785862697
669244625365082
805944721090625
444992105851238
796941601080507
683452548129940
575877395173827
242979954823296
896285714627721
390491604315586
300597415813038
460655974055570
214280295612732
325779744676029
683114113374106
883883992283441
817891355871238
938168655393908
673459950627031
980009488170237
503609525080923
202296796795121
526701149234919
960592739394635
599373275803519
285825937380016
676087157243950
629282237368948
332079636776048
118866366127629
186012113585415
740167548602508
500050605469326
343392907886589
405818787083749
339200928564754
645192005303336
445774805281770
417872914504601
873178527430425
115166750902714
621176011645899
814379276174003
249462014342833
916046522435677
446756803685074
298482009556416
147466180981160
666385883285664
836300425262484
266207954603778
145668536217645
799901619296373
391895715028208
456878298086976
739067785772548
934054218761600
191398416264914
335837051392295
618060276766459
623744056792780
149288958234302
518919648744628
415778950376698
907098881468926
669641550853634
870042079790712
398309447992737
814160798951228
797586841159594
843049311050879
121147165578011
948047842729118
870075180552390
259389005305080
460072279505965
589497140195927
940552278983191
530351164277666
382681281805809
385842463182741
992854911780799
856348827849753
758158077220965
321962379022303
468300569893367
947823631313108
143963909724548
225254037855611
147189578002860
782009424721508
673781240998146
499160447041918
992019435403047
535129033371979
396833085972545
351393908099275
324929894113516
192899735471706
306118199379303
382831873758260
705059021752445
873106611348679
541885058674984
935133490414553
793698815882256
292099574962838
282876932628045
160017585643727
360946897661663
982664561700514
341684010047925
142693962405558
800982818752249
861687930831780
578138809680913
967487159114642
807487961350866
391280558076614
478219022919396
899792938661276
210829125937075
868496504708518
698952746762724
959040691630058
343969555413273
611034838613945
507167493722597
610157923248867
284186033018698
588045950647799
554596466431706
519393181514989
638395832154915
457957168007811
383168078859167
262472275292566
273070615783197
318818083559585
886936406266196
607644874492666
753168672345957
791811937148361
973544407533197
621919573805693
244995947886950
372567020753053
696776113382563
996924308750062
369953024450599
667177784816190
548606912226618
773401125911559
428939471807497
933733324705715
124002869519239
186836425049879
968195248255622
224419486693864
867470836572480
142045910210133
100876488379669
470944418653970
962027353836794
271585359492755
416151736434095
129153078546104
401978304148795
938493559552921
630395841663986
409667061016804
505351685660265
925188640556442
515496906392255
942854049874270
107867461937628
873212922003577
263775486963093
271071725596978
834954806023821
900530757871023
782160640161669
992911405653475
428560338373015
488093726133001
664159506306651
473864505050224
758803929480278
889038688259230
840641500736907
436146670501046
591869256367649
195012811174081
730007860307025
248307671962798
221654132488967
558306361510796
762620887657268
378063983448802
321065786627527
471272660915643
168264270577523
924109324535810
645965425136402
644930959988438
913821050042613
926704973766346
899188080373553
348820675836782
418214961729817
578010990823091
664380258675401
898608335697407
733774701737630
177358742293678
262167105312420
451983050436457
495492116566760
958869391585849
280568027608897
825461603132045
545495554354322
181751983265118
220176192560126
398098938826541
600906752222223
170856589965721
159502851588334
378298597443108
197795611270318
629169451583985
870472522241535
217468024633188
401492160260506
892487780079067
454801588366838
258462516333820
628786589561698
581860388337987
856023991613253
330801961819019
500921650607053
712494075960058
792679877420621
664493828277890
226283324716578
663592837976072
916605992651273
967967411110659
479340443052481
278888297351750
972256296473204
743232599272997
490972722255308
323860073958041
243108292343071
720400918351369
318911608667052
891068552294817
312689820206102
679102960555918
207662181864680
185073520982397
235958185695650
598866555752686
266912192014168
670773872684759
103565579546786
945793336715598
207773614479680
591678861251007
549934289198588
318374178522741
411048117138929
516013990441106
242970039506447
779102613613958
718570949556365
610684319271728
673895931324881
891162889747741
402021138560406
859569045303069
671694309990048
384663124988627
615953060254376
495879603999860
234831548463584
505404030781215
100019986551443
941561876896723
342014011450515
805160287395777
280800324963070
803307304585384
