B;483989756839190;212141;RLO_BEGIN;1.695975e+01;0:1.170e+01:2.775e+00:0.000e+00:3:0:7.965523e+01:7.861925e+01:1:9.487e+00:0.000e+00:0.000e+00:1:0:3.996712e+00:7.145017e+01:1.23282:1000:197.951:0.310647
B;483989756839190;212141;CIRC;1.695975e+01;197.951:0.310647:136.458:0
S;483989756839190;0;HENAKED;1.701770e+01;3.04923:2.96047:0:185.472:0.410887:4:11.699:2.9714:0
B;483989756839190;212141;RLO_END;1.701770e+01;1:1.385e+01:0.000e+00:0.000e+00:1:0:5.152641e+00:1.549180e+02:0:2.971e+00:2.971e+00:0.000e+00:4:0:4.108873e-01:7.725618e+01:-8.72963:4.36481:300.993:0
S;483989756839190;0;NS;1.870928e+01;5:1.23552:8.88267e+12:157.177:0.957066
S;483989756839190;0;SN;1.870928e+01;2.89945:2.89945:1.60059:1.23552:5:2:495.24:86.8011:6.36844:13.7354:85.4705
B;483989756839190;212141;BSN;1.870928e+01;0:2.899e+00:2.899e+00:1.601e+00:6:0:1:1.385e+01:0.000e+00:0.000e+00:1:0:302.305:0:1283.04:0.767433:0.748353:11.3449
B;483989756839190;212141;RLO_BEGIN;2.167764e+01;1:1.384e+01:4.829e+00:2.769e+00:6:0:2.600512e+02:2.573581e+02:0:1.236e+00:0.000e+00:0.000e+00:7:5:1.581141e-05:8.770395e+01:11.198:3:438.4:0.345032
B;483989756839190;212141;CIRC;2.167764e+01;438.4:0.345032:287.138:0
B;483989756839190;212141;CE;2.167764e+01;1:1.384e+01:4.829e+00:2.769e+00:6:0:0:1.236e+00:0.000e+00:0.000e+00:7:5:4.384002e+02:5.055814e+00:0
S;483989756839190;1;HENAKED;2.167764e+01;13.8354:4.82894:2.76907:260.051:0.787869:6:9.49:4.79879:1
B;483989756839190;212141;RLO_END;2.167764e+01;1:4.829e+00:4.829e+00:2.769e+00:6:0:7.878691e-01:2.524734e+00:0:1.236e+00:0.000e+00:0.000e+00:7:5:1.581141e-05:1.361448e+00:0:0:5.05581:0
S;483989756839190;1;NS;2.169028e+01;5:1.42148:9.34339e+12:248.387:0.972038
S;483989756839190;1;SN;2.169028e+01;4.82074:4.82074:2.94602:1.42148:5:2:765.388:238.204:179.339:-3.90411:156.728
B;483989756839190;212141;BSN;2.169028e+01;1:4.821e+00:4.821e+00:2.946e+00:6:0:0:1.236e+00:0.000e+00:0.000e+00:7:5:5.06255:0:5.85042:0.135157:0.885298:88.6599
B;303815915131694;92458;RLO_BEGIN;1.888879e+01;0:1.089e+01:2.465e+00:0.000e+00:3:0:6.863766e+01:6.777674e+01:1:9.900e+00:0.000e+00:0.000e+00:1:0:5.044341e+00:6.489213e+01:1.09987:1000:175.049:0.0292876
B;303815915131694;92458;CIRC;1.888879e+01;175.049:0.0292876:169.922:0
S;303815915131694;0;HENAKED;1.902675e+01;2.87167:2.76102:0:162.959:0.399224:4:10.892:2.80274:0
B;303815915131694;92458;RLO_END;1.902675e+01;1:1.394e+01:0.000e+00:0.000e+00:1:0:6.552148e+00:2.031419e+02:0:2.803e+00:2.803e+00:0.000e+00:4:0:3.992239e-01:9.842448e+01:-8.08535:4.04268:390.42:0
S;303815915131694;0;NS;2.076865e+01;5:1.23552:8.19105e+11:137.164:0.922036
S;303815915131694;0;SN;2.076865e+01;2.74179:2.74179:1.47495:1.23552:5:2:263.5:41.8079:-18.6313:18.4179:32.5815
B;303815915131694;92458;BSN;2.076865e+01;0:2.742e+00:2.742e+00:1.475e+00:6:0:1:1.394e+01:3.694e+00:0.000e+00:4:0:392.264:0:1875.32:0.796884:0.957898:9.48963
B;303815915131694;92458;RLO_BEGIN;2.166656e+01;1:1.393e+01:4.887e+00:2.816e+00:6:0:3.467171e+02:3.356100e+02:0:1.236e+00:0.000e+00:0.000e+00:7:5:1.581141e-05:1.140349e+02:11.2758:0.875431:571.177:0.36327
B;303815915131694;92458;CIRC;2.166656e+01;571.177:0.36327:363.685:0
B;303815915131694;92458;CE;2.166656e+01;1:1.393e+01:4.887e+00:2.816e+00:6:0:0:1.236e+00:0.000e+00:0.000e+00:7:5:5.711766e+02:1.194871e+01:0
S;303815915131694;1;HENAKED;2.166656e+01;13.9315:4.88678:2.81583:346.717:0.80539:6:9.905:5.14023:1
B;303815915131694;92458;RLO_END;2.166656e+01;1:4.887e+00:4.887e+00:2.816e+00:6:0:8.053905e-01:5.979307e+00:0:1.236e+00:0.000e+00:0.000e+00:7:5:1.581141e-05:3.207246e+00:0:0:11.9487:0
S;303815915131694;1;NS;2.167671e+01;5:1.42687:1.43369e+12:139.423:0.990536
S;303815915131694;1;SN;2.167671e+01;4.87954:4.87954:2.95913:1.42687:5:2:306.162:96.4145:47.0428:-84.1469:1.42691
B;303815915131694;92458;BSN;2.167671e+01;1:4.880e+00:4.880e+00:2.959e+00:6:0:0:1.236e+00:0.000e+00:0.000e+00:7:5:11.9623:0:67.8713:0.841403:0.999986:72.3818
B;682903865727901;251539;RLO_BEGIN;1.869015e+01;0:1.096e+01:2.501e+00:0.000e+00:3:0:8.511991e+01:8.228012e+01:1:9.667e+00:0.000e+00:0.000e+00:1:0:4.611283e+00:7.768563e+01:1.13401:1000:211.053:0.0359869
B;682903865727901;251539;CIRC;1.869015e+01;211.053:0.0359869:203.458:0
B;682903865727901;251539;RLO_END;1.887548e+01;1:1.366e+01:0.000e+00:0.000e+00:1:0:5.968200e+00:2.056945e+02:0:2.980e+00:2.902e+00:0.000e+00:4:0:1.009037e+02:1.033445e+02:-8.57561:4.28781:400.78:0
S;682903865727901;0;HENAKED;1.888665e+01;2.9801:2.9175:0:67.5608:0.419946:4:10.965:2.9801:0
S;682903865727901;0;NS;2.039978e+01;5:1.23552:8.66808e+12:178.312:0.973941
S;682903865727901;0;SN;2.039978e+01;2.91288:2.91288:1.60707:1.23552:5:2:455.538:80.487:38.2906:-14.0443:69.3883
B;682903865727901;251539;BSN;2.039978e+01;0:2.913e+00:2.913e+00:1.607e+00:6:0:1:1.366e+01:0.000e+00:0.000e+00:1:0:402.554:0:432.404:0.17546:0.587067:7.74562
B;682903865727901;251539;RLO_BEGIN;2.214308e+01;1:1.365e+01:4.770e+00:2.722e+00:6:0:2.236123e+02:2.186165e+02:0:1.236e+00:0.000e+00:0.000e+00:7:5:1.581141e-05:7.494012e+01:11.0445:3:373.088:0.0878488
B;682903865727901;251539;CIRC;2.214308e+01;373.088:0.0878488:340.312:0
B;682903865727901;251539;CE;2.214308e+01;1:1.365e+01:4.770e+00:2.722e+00:6:0:0:1.236e+00:0.000e+00:0.000e+00:7:5:3.730876e+02:3.624941e+00:0
S;682903865727901;1;HENAKED;2.214308e+01;13.6457:4.7703:2.72164:223.612:0.747571:6:9.671:4.79879:1
B;682903865727901;251539;RLO_END;2.214308e+01;1:4.770e+00:4.770e+00:2.722e+00:6:0:7.475712e-01:1.806318e+00:0:1.236e+00:0.000e+00:0.000e+00:7:5:1.581141e-05:9.793655e-01:0:0:3.62494:0
B;682903865727901;251539;RLO_BEGIN;2.215618e+01;1:4.762e+00:4.762e+00:2.890e+00:6:0:1.818054e+00:1.809664e+00:0:1.236e+00:0.000e+00:0.000e+00:7:5:1.581141e-05:9.819930e-01:3.85379:0.784:3.63284:0
B;682903865727901;251539;CE;2.215618e+01;1:4.762e+00:4.762e+00:2.890e+00:6:0:0:1.236e+00:0.000e+00:0.000e+00:7:5:3.632844e+00:1.231571e-01:0
S;682903865727901;1;CONAKED;2.215618e+01;4.76203:4.76203:2.89025:1.81805:0.0551861:2.89025:0.0551861:6
B;682903865727901;251539;RLO_END;2.215618e+01;1:2.890e+00:2.890e+00:2.890e+00:6:0:5.518607e-02:5.590696e-02:0:1.236e+00:0.000e+00:0.000e+00:7:5:1.581141e-05:3.796756e-02:0:0:0.123157:0
S;682903865727901;1;NS;2.215677e+01;5:1.39846:7.91294e+12:64.531:0.880089
S;682903865727901;1;SN;2.215677e+01;2.89025:2.89025:2.89025:1.39846:5:2:90.7026:12.5922:-4.9095:11.549:1.04017
B;682903865727901;251539;BSN;2.215657e+01;1:2.890e+00:2.890e+00:2.890e+00:6:0:0:1.236e+00:0.000e+00:0.000e+00:7:5:0.11806:0:0.276051:0.572336:1:440.583
B;362118362548608;12189;RLO_BEGIN;1.936569e+01;0:1.119e+01:3.783e+00:1.938e+00:6:0:3.902896e+02:3.856782e+02:1:1.076e+01:2.714e+00:0.000e+00:4:0:1.609140e+02:3.787770e+02:1.04031:0.865495:1008.71:0.0522609
B;362118362548608;12189;CIRC;1.936569e+01;1008.71:0.0522609:955.998:0
B;362118362548608;12189;CE;1.936569e+01;0:1.119e+01:3.783e+00:1.938e+00:6:0:1:1.076e+01:2.714e+00:0.000e+00:4:0:1.008715e+03:7.143891e+00:0
S;362118362548608;0;HENAKED;1.936569e+01;11.193:3.78279:1.93837:390.29:0.899754:6:11.204:3.77445:1
S;362118362548608;1;HENAKED;1.936569e+01;10.7593:2.71444:0:160.914:0.389214:4:10.765:2.71444:0
B;362118362548608;12189;RLO_END;1.936569e+01;1:2.714e+00:2.714e+00:0.000e+00:4:0:3.892139e-01:2.504488e+00:0:3.783e+00:3.783e+00:1.938e+00:6:0:8.997535e-01:2.914350e+00:0:0:7.14389:0
S;362118362548608;0;NS;1.938664e+01;5:1.23552:6.98172e+12:172.129:0.838145
S;362118362548608;0;SN;1.938664e+01;3.77456:3.77456:2.11889:1.23552:5:2:102.709:27.4697:-7.90557:-8.74425:-24.8118
B;362118362548608;12189;BSN;1.938664e+01;0:3.775e+00:3.775e+00:2.119e+00:6:0:1:2.714e+00:2.714e+00:0.000e+00:4:0:7.15472:0:24.8857:0.712644:0.998291:114.612
S;362118362548608;1;NS;2.123122e+01;5:1.23552:5.47524e+12:128.169:0.908583
S;362118362548608;1;SN;2.123122e+01;2.65452:2.65452:1.46672:1.23552:5:2:473.03:70.7041:14.2131:35.2176:59.6387
B;362118362548608;12189;BSN;2.123122e+01;1:2.655e+00:2.655e+00:1.467e+00:6:0:0:1.236e+00:0.000e+00:0.000e+00:7:5:25.2294:0.712317:124.25:0.90795:0.805714:46.3865
B;966198262305115;111272;RLO_BEGIN;1.908877e+01;0:1.082e+01:2.461e+00:0.000e+00:3:0:1.062578e+02:1.049395e+02:1:6.218e+00:0.000e+00:0.000e+00:1:0:2.334958e+00:8.151176e+01:1.73969:1000:245.415:0.128095
B;966198262305115;111272;CIRC;1.908877e+01;245.415:0.128095:213.979:0
S;966198262305115;0;HENAKED;1.917191e+01;2.75464:2.6566:0:170.32:0.383379:4:10.821:2.67714:0
B;966198262305115;111272;RLO_END;1.917191e+01;1:1.029e+01:0.000e+00:0.000e+00:1:0:3.235893e+00:1.409376e+02:0:2.677e+00:2.677e+00:0.000e+00:4:0:3.833792e-01:7.657440e+01:-8.13961:4.06981:283.068:0
S;966198262305115;0;NS;2.113342e+01;5:1.23552:6.23857e+12:89.6386:0.625264
S;966198262305115;0;SN;2.113342e+01;2.61681:2.61681:1.46402:1.23552:5:2:377.377:54.9076:-17.895:25.0242:-45.4798
B;966198262305115;111272;BSN;2.113342e+01;0:2.617e+00:2.617e+00:1.464e+00:6:0:1:1.029e+01:0.000e+00:0.000e+00:1:0:284.386:0:4795.15:0.943243:0.925261:12.1583
B;966198262305115;111272;RLO_BEGIN;3.345244e+01;1:1.020e+01:3.369e+00:1.661e+00:6:0:2.094318e+02:2.055757e+02:0:1.236e+00:0.000e+00:0.000e+00:7:5:1.581141e-05:7.985009e+01:8.25179:0.859809:365.307:6.90801e-06
B;966198262305115;111272;CIRC;3.345244e+01;365.307:6.90801e-06:365.304:0
B;966198262305115;111272;CE;3.345244e+01;1:1.020e+01:3.369e+00:1.661e+00:6:0:0:1.236e+00:0.000e+00:0.000e+00:7:5:3.653065e+02:7.552173e+00:0
S;966198262305115;1;HENAKED;3.345244e+01;10.1982:3.36949:1.66076:209.432:0.620271:6:6.219:3.43301:1
B;966198262305115;111272;RLO_END;3.345244e+01;1:3.369e+00:3.369e+00:1.661e+00:6:0:6.202706e-01:3.531247e+00:0:1.236e+00:0.000e+00:0.000e+00:7:5:1.581141e-05:2.237811e+00:0:0:7.55217:0
S;966198262305115;1;NS;3.349355e+01;5:1.23552:5.21748e+12:295.637:0.455365
S;966198262305115;1;SN;3.349355e+01;3.35797:3.35797:1.91104:1.23552:5:2:319.167:71.3558:1.871:-70.6772:9.63774
B;966198262305115;111272;BSN;3.349355e+01;1:3.358e+00:3.358e+00:1.911e+00:6:0:0:1.236e+00:0.000e+00:0.000e+00:7:5:7.56813:0:94.6173:0.923492:0.999595:85.482
B;442206563963729;482266;RLO_BEGIN;1.903699e+01;0:1.083e+01:2.436e+00:0.000e+00:3:0:5.540879e+01:5.264095e+01:1:9.236e+00:0.000e+00:0.000e+00:1:0:4.223587e+00:4.893907e+01:1.17305:1000:134.011:0.0924027
B;442206563963729;482266;CIRC;1.903699e+01;134.011:0.0924027:121.628:0
S;442206563963729;0;HENAKED;1.909350e+01;2.71179:2.60281:0:178.846:0.377556:4:10.838:2.63724:0
B;442206563963729;482266;RLO_END;1.909350e+01;1:1.333e+01:0.000e+00:0.000e+00:1:0:5.389697e+00:1.519593e+02:0:2.637e+00:2.637e+00:0.000e+00:4:0:3.775555e-01:7.309913e+01:-8.19698:4.09849:291.269:0
S;442206563963729;0;NS;2.115106e+01;5:1.23552:4.72249e+12:218.71:0.993247
S;442206563963729;0;SN;2.115106e+01;2.57672:2.57672:1.46114:1.23552:5:2:154.879:21.8807:-18.916:-10.2448:3.99903
B;442206563963729;482266;BSN;2.115106e+01;0:2.577e+00:2.577e+00:1.461e+00:6:0:1:1.333e+01:0.000e+00:0.000e+00:1:0:292.381:0:646.754:0.552462:0.999453:9.51027
B;442206563963729;482266;RLO_BEGIN;2.318743e+01;1:1.332e+01:4.657e+00:2.630e+00:6:0:2.222443e+02:2.197692e+02:0:1.236e+00:0.000e+00:0.000e+00:7:5:1.581141e-05:7.610692e+01:10.7833:3:376.253:0.240583
B;442206563963729;482266;CIRC;2.318743e+01;376.253:0.240583:285.733:0
B;442206563963729;482266;CE;2.318743e+01;1:1.332e+01:4.657e+00:2.630e+00:6:0:0:1.236e+00:0.000e+00:0.000e+00:7:5:3.762534e+02:4.767650e+00:0
S;442206563963729;1;HENAKED;2.318743e+01;13.323:4.65728:2.63023:222.244:0.739081:6:9.24:4.79879:1
B;442206563963729;482266;RLO_END;2.318743e+01;1:4.657e+00:4.657e+00:2.630e+00:6:0:7.390814e-01:2.365713e+00:0:1.236e+00:0.000e+00:0.000e+00:7:5:1.581141e-05:1.296453e+00:0:0:4.76765:0
S;442206563963729;1;NS;2.320135e+01;5:1.36368:9.13493e+12:94.5102:0.927133
S;442206563963729;1;SN;2.320135e+01;4.64867:4.64867:2.80629:1.36368:5:2:453.201:142.081:107.776:-72.0437:58.1461
B;442206563963729;482266;BSN;2.320135e+01;1:4.649e+00:4.649e+00:2.806e+00:6:0:0:1.236e+00:0.000e+00:0.000e+00:7:5:4.77465:0:8.70938:0.48115:0.98832:86.961
B;827972837416737;361319;RLO_BEGIN;1.850662e+01;0:1.103e+01:2.544e+00:0.000e+00:3:0:1.390974e+02:1.351087e+02:1:9.228e+00:0.000e+00:0.000e+00:1:0:4.095695e+00:1.245161e+02:1.19568:1000:342.494:0.479543
B;827972837416737;361319;CIRC;1.850662e+01;342.494:0.479543:178.253:0
S;827972837416737;0;HENAKED;1.867924e+01;2.98095:2.91484:0:148.316:0.418259:4:11.037:2.97472:0
B;827972837416737;361319;RLO_END;1.867924e+01;1:1.326e+01:0.000e+00:0.000e+00:1:0:5.245848e+00:1.993718e+02:0:2.975e+00:2.975e+00:0.000e+00:4:0:4.182589e-01:1.014130e+02:-8.0589:4.02945:390.298:0
S;827972837416737;0;NS;2.022073e+01;5:1.23552:2.58515e+12:84.1733:0.76807
S;827972837416737;0;SN;2.022073e+01;2.90702:2.90702:1.60305:1.23552:5:2:372.139:65.5217:19.7504:-13.4331:61.0129
B;827972837416737;361319;BSN;2.022073e+01;0:2.907e+00:2.907e+00:1.603e+00:6:0:1:1.326e+01:0.000e+00:0.000e+00:1:0:391.953:0:507.232:0.267246:0.748875:8.56385
B;827972837416737;361319;RLO_BEGIN;2.306826e+01;1:1.325e+01:4.586e+00:2.573e+00:6:0:2.428736e+02:2.393024e+02:0:1.236e+00:0.000e+00:0.000e+00:7:5:1.581141e-05:8.307685e+01:10.7208:3:410.014:0.121091
B;827972837416737;361319;CIRC;2.306826e+01;410.014:0.121091:360.365:0
B;827972837416737;361319;CE;2.306826e+01;1:1.325e+01:4.586e+00:2.573e+00:6:0:0:1.236e+00:0.000e+00:0.000e+00:7:5:4.100141e+02:5.726739e+00:0
S;827972837416737;1;HENAKED;2.306826e+01;13.2458:4.58595:2.57253:242.874:0.746168:6:9.232:4.79879:1
B;827972837416737;361319;RLO_END;2.306826e+01;1:4.586e+00:4.586e+00:2.573e+00:6:0:7.461680e-01:2.833858e+00:0:1.236e+00:0.000e+00:0.000e+00:7:5:1.581141e-05:1.563740e+00:0:0:5.72674:0
S;827972837416737;1;NS;2.308199e+01;5:1.3376:6.85805e+12:78.4514:0.692445
S;827972837416737;1;SN;2.308199e+01;4.57758:4.57758:2.74356:1.3376:5:2:359.486:113.323:88.6423:-69.88:-10.0759
B;827972837416737;361319;BSN;2.308199e+01;1:4.578e+00:4.578e+00:2.744e+00:6:0:0:1.236e+00:0.000e+00:0.000e+00:7:5:5.73427:0:11.4317:0.526313:0.999589:80.471
B;504946865683773;222095;RLO_BEGIN;1.848865e+01;0:1.104e+01:2.530e+00:0.000e+00:3:0:8.549869e+01:8.362839e+01:1:7.751e+00:0.000e+00:0.000e+00:1:0:3.036204e+00:7.115485e+01:1.42435:1000:204.033:0.00839701
B;504946865683773;222095;CIRC;1.848865e+01;204.033:0.00839701:202.319:0
S;504946865683773;0;HENAKED;1.860736e+01;2.87631:2.80063:0:166.967:0.400441:4:11.043:2.8247:0
B;504946865683773;222095;RLO_END;1.860736e+01;1:1.186e+01:0.000e+00:0.000e+00:1:0:4.006875e+00:1.715910e+02:0:2.825e+00:2.825e+00:0.000e+00:4:0:4.004415e-01:8.963007e+01:-8.23781:4.11891:339.368:0
S;504946865683773;0;NS;2.035020e+01;5:1.23552:7.87886e+10:117.912:0.996378
S;504946865683773;0;SN;2.035020e+01;2.76216:2.76216:1.4913:1.23552:5:2:326.089:52.438:-3.53687:34.7891:39.0762
B;504946865683773;222095;BSN;2.035020e+01;0:2.762e+00:2.762e+00:1.491e+00:6:0:1:1.186e+01:0.000e+00:0.000e+00:1:0:340.823:0:809.751:0.636291:0.92339:10.1671
B;504946865683773;222095;RLO_BEGIN;2.592875e+01;1:1.186e+01:2.872e+00:0.000e+00:4:0:1.977088e+02:1.973233e+02:0:1.236e+00:0.000e+00:0.000e+00:7:5:1.581141e-05:7.182568e+01:9.5963:3:343.231:0.130569
B;504946865683773;222095;CIRC;2.592875e+01;343.231:0.130569:298.416:0
B;504946865683773;222095;CE;2.592875e+01;1:1.186e+01:2.872e+00:0.000e+00:4:0:0:1.236e+00:0.000e+00:0.000e+00:7:5:3.432314e+02:3.617764e+00:0
S;504946865683773;1;HENAKED;2.592875e+01;11.8564:2.87228:0:197.709:0.395929:4:7.753:2.87228:0
B;504946865683773;222095;RLO_END;2.592875e+01;1:2.872e+00:2.872e+00:0.000e+00:4:0:3.959295e-01:1.640310e+00:0:1.236e+00:0.000e+00:0.000e+00:7:5:1.581141e-05:1.117052e+00:0:0:3.61776:0
B;504946865683773;222095;RLO_BEGIN;2.776323e+01;1:2.807e+00:2.807e+00:1.450e+00:6:0:1.723797e+00:1.655354e+00:0:1.237e+00:0.000e+00:0.000e+00:7:5:1.581141e-05:1.139653e+00:2.26943:0.784:3.6683:0
B;504946865683773;222095;CE;2.776323e+01;1:2.807e+00:2.807e+00:1.450e+00:6:0:0:1.237e+00:0.000e+00:0.000e+00:7:5:3.668299e+00:1.368669e-01:0
S;504946865683773;1;CONAKED;2.776323e+01;2.80651:2.80651:1.45042:1.7238:0.0421337:1.45042:0.0421337:6
B;504946865683773;222095;RLO_END;2.776323e+01;1:1.450e+00:1.450e+00:1.450e+00:6:0:4.213370e-02:5.376096e-02:0:1.237e+00:0.000e+00:0.000e+00:7:5:1.581141e-05:4.998415e-02:0:0:0.136867:0
S;504946865683773;1;NS;2.777703e+01;5:1.23552:6.23343e+12:69.1297:0.998794
S;504946865683773;1;SN;2.777703e+01;1.45042:1.45042:1.45042:1.23552:5:2:446.988:10.1183:7.7939:-5.39977:-3.53226
B;504946865683773;222095;BSN;2.776323e+01;1:1.450e+00:1.450e+00:1.450e+00:6:0:0:1.237e+00:0.000e+00:0.000e+00:7:5:0.136867:0:0.148478:0.0782521:0.999998:73.5972
B;986751886635028;221338;RLO_BEGIN;1.789227e+01;0:1.129e+01:2.636e+00:0.000e+00:3:0:1.217667e+02:1.207368e+02:1:9.245e+00:0.000e+00:0.000e+00:1:0:3.976419e+00:1.102102e+02:1.22102:1000:304.643:0.517426
B;986751886635028;221338;CIRC;1.789227e+01;304.643:0.517426:147.013:0
S;986751886635028;0;HENAKED;1.800193e+01;2.98562:2.89328:0:170.189:0.409297:4:11.291:2.91944:0
B;986751886635028;221338;RLO_END;1.800193e+01;1:1.343e+01:0.000e+00:0.000e+00:1:0:5.118235e+00:1.860071e+02:0:2.919e+00:2.919e+00:0.000e+00:4:0:4.092968e-01:9.330123e+01:-8.37738:4.18869:362.196:0
S;986751886635028;0;NS;1.966660e+01;5:1.23552:8.78e+12:91.7474:0.150709
S;986751886635028;0;SN;1.966660e+01;2.85214:2.85214:1.56188:1.23552:5:2:462.917:78.8286:4.14255:75.7711:21.343
B;986751886635028;221338;BSN;1.966660e+01;0:2.852e+00:2.852e+00:1.562e+00:6:0:1:1.343e+01:0.000e+00:0.000e+00:1:0:363.715:0:2006.15:0.897561:0.971985:10.4334
B;986751886635028;221338;RLO_BEGIN;2.270138e+01;1:1.342e+01:4.649e+00:2.623e+00:6:0:1.877735e+02:1.832458e+02:0:1.236e+00:0.000e+00:0.000e+00:7:5:1.581141e-05:6.327071e+01:10.8587:3:313.432:0.386417
B;986751886635028;221338;CIRC;2.270138e+01;313.432:0.386417:192.317:0
B;986751886635028;221338;CE;2.270138e+01;1:1.342e+01:4.649e+00:2.623e+00:6:0:0:1.236e+00:0.000e+00:0.000e+00:7:5:3.134320e+02:3.798652e+00:0
S;986751886635028;1;HENAKED;2.270138e+01;13.4161:4.64884:2.6234:187.774:0.716206:6:9.248:4.79879:0
B;986751886635028;221338;RLO_END;2.270138e+01;1:4.649e+00:4.649e+00:2.623e+00:6:0:7.162060e-01:1.884291e+00:0:1.236e+00:0.000e+00:0.000e+00:7:5:1.581141e-05:1.033461e+00:0:0:3.79865:0
B;986751886635028;221338;RLO_BEGIN;2.271590e+01;1:4.640e+00:4.640e+00:2.801e+00:6:0:1.929033e+00:1.887340e+00:0:1.236e+00:0.000e+00:0.000e+00:7:5:1.581141e-05:1.036079e+00:3.75496:0.784:3.80618:0
B;986751886635028;221338;CE;2.271590e+01;1:4.640e+00:4.640e+00:2.801e+00:6:0:0:1.236e+00:0.000e+00:0.000e+00:7:5:3.806176e+00:1.322335e-01:0
S;986751886635028;1;CONAKED;2.271590e+01;4.63994:4.63994:2.80146:1.92903:0.0525367:2.80146:0.0525367:6
B;986751886635028;221338;RLO_END;2.271590e+01;1:2.801e+00:2.801e+00:2.801e+00:6:0:5.253673e-02:5.965969e-02:0:1.236e+00:0.000e+00:0.000e+00:7:5:1.581141e-05:4.109241e-02:0:0:0.132233:0
S;986751886635028;1;NS;2.271594e+01;5:1.36168:5.98396e+12:512.75:0.964477
S;986751886635028;1;SN;2.271594e+01;2.80146:2.80146:2.80146:1.36168:5:2:263.491:36.2586:26.5013:-21.1208:-12.895
B;986751886635028;221338;BSN;2.271590e+01;1:2.801e+00:2.801e+00:2.801e+00:6:0:0:1.236e+00:0.000e+00:0.000e+00:7:5:0.132233:0:0.275797:0.520595:0.999985:395.777
B;282853828712550;331804;RLO_BEGIN;1.814438e+01;0:1.118e+01:2.579e+00:0.000e+00:3:0:7.764211e+01:7.523960e+01:1:8.535e+00:0.000e+00:0.000e+00:1:0:3.456546e+00:6.651011e+01:1.30996:1000:186.932:0.312607
B;282853828712550;331804;CIRC;1.814438e+01;186.932:0.312607:128.496:0
S;282853828712550;0;HENAKED;1.821738e+01;2.90378:2.77753:0:177.147:0.39781:4:11.184:2.82611:0
B;282853828712550;331804;RLO_END;1.821738e+01;1:1.271e+01:0.000e+00:0.000e+00:1:0:4.469804e+00:1.634130e+02:0:2.826e+00:2.826e+00:0.000e+00:4:0:3.978100e-01:8.278191e+01:-8.35465:4.17732:319.402:0
S;282853828712550;0;NS;2.002282e+01;5:1.23552:8.83387e+12:201.675:0.672122
S;282853828712550;0;SN;2.002282e+01;2.76192:2.76192:1.49236:1.23552:5:2:445.849:71.6852:7.82509:55.783:44.3372
B;282853828712550;331804;BSN;2.002282e+01;0:2.762e+00:2.762e+00:1.492e+00:6:0:1:1.271e+01:0.000e+00:0.000e+00:1:0:320.739:0:709.473:0.685418:0.893277:10.1368
B;282853828712550;331804;RLO_BEGIN;2.459750e+01;1:1.270e+01:4.377e+00:2.403e+00:6:0:1.891860e+02:1.856168e+02:0:1.236e+00:0.000e+00:0.000e+00:7:5:1.581141e-05:6.560613e+01:10.2792:3:319.84:2.23222e-08
B;282853828712550;331804;CIRC;2.459750e+01;319.84:2.23222e-08:319.84:0
B;282853828712550;331804;CE;2.459750e+01;1:1.270e+01:4.377e+00:2.403e+00:6:0:0:1.236e+00:0.000e+00:0.000e+00:7:5:3.198401e+02:4.206948e+00:0
S;282853828712550;1;HENAKED;2.459750e+01;12.7003:4.37659:2.4032:189.186:0.725572:6:8.538:4.45734:1
B;282853828712550;331804;RLO_END;2.459750e+01;1:4.377e+00:4.377e+00:2.403e+00:6:0:7.255720e-01:2.064516e+00:0:1.236e+00:0.000e+00:0.000e+00:7:5:1.581141e-05:1.163246e+00:0:0:4.20695:0
B;282853828712550;331804;RLO_BEGIN;2.461519e+01;1:4.367e+00:4.367e+00:2.549e+00:6:0:2.175653e+00:2.067136e+00:0:1.236e+00:0.000e+00:0.000e+00:7:5:1.581141e-05:1.165905e+00:3.53426:0.784:4.214:0
B;282853828712550;331804;CE;2.461519e+01;1:4.367e+00:4.367e+00:2.549e+00:6:0:0:1.236e+00:0.000e+00:0.000e+00:7:5:4.214003e+00:1.458297e-01:0
S;282853828712550;1;CONAKED;2.461519e+01;4.36732:4.36732:2.54927:2.17565:0.0513524:2.54927:0.0513524:6
B;282853828712550;331804;RLO_END;2.461519e+01;1:2.549e+00:2.549e+00:2.549e+00:6:0:5.135240e-02:6.456841e-02:0:1.236e+00:0.000e+00:0.000e+00:7:5:1.581141e-05:4.641624e-02:0:0:0.14583:0
S;282853828712550;1;NS;2.461529e+01;5:1.25628:7.76614e+12:250.664:0.647526
S;282853828712550;1;SN;2.461529e+01;2.54927:2.54927:2.54927:1.25628:5:2:487.244:65.2651:8.82876:-60.4607:-22.9368
B;282853828712550;331804;BSN;2.461519e+01;1:2.549e+00:2.549e+00:2.549e+00:6:0:0:1.236e+00:0.000e+00:0.000e+00:7:5:0.14583:0:0.296471:0.508658:0.999946:373.901
B;911198840933120;42248;RLO_BEGIN;1.691798e+01;0:1.172e+01:2.794e+00:0.000e+00:3:0:1.069773e+02:1.057030e+02:1:8.946e+00:0.000e+00:0.000e+00:1:0:3.587741e+00:9.345348e+01:1.30952:1000:262.637:0.254693
B;911198840933120;42248;CIRC;1.691798e+01;262.637:0.254693:195.745:0
S;911198840933120;0;HENAKED;1.702552e+01;3.21503:3.07706:0:173.215:0.42867:4:11.719:3.13153:0
B;911198840933120;42248;RLO_END;1.702552e+01;1:1.324e+01:0.000e+00:0.000e+00:1:0:4.652930e+00:1.819834e+02:0:3.132e+00:3.132e+00:0.000e+00:4:0:4.286698e-01:9.476722e+01:-8.58322:4.29161:359.494:0
S;911198840933120;0;NS;1.853393e+01;5:1.23552:1.23344e+12:305.557:0.476307
S;911198840933120;0;SN;1.853393e+01;3.05404:3.05404:1.73143:1.23552:5:2:277.539:53.1638:20.2498:21.8481:-44.034
B;911198840933120;42248;BSN;1.853393e+01;0:3.054e+00:3.054e+00:1.731e+00:6:0:1:1.324e+01:0.000e+00:0.000e+00:1:0:361.217:0:362.65:0.249444:0.854721:8.80549
B;911198840933120;42248;RLO_BEGIN;2.288177e+01;1:1.322e+01:4.602e+00:2.585e+00:6:0:1.817191e+02:1.787870e+02:0:1.236e+00:0.000e+00:0.000e+00:7:5:1.581141e-05:6.210993e+01:10.7039:3:306.393:0.113091
B;911198840933120;42248;CIRC;2.288177e+01;306.393:0.113091:271.743:0
B;911198840933120;42248;CE;2.288177e+01;1:1.322e+01:4.602e+00:2.585e+00:6:0:0:1.236e+00:0.000e+00:0.000e+00:7:5:3.063935e+02:3.789859e+00:0
S;911198840933120;1;HENAKED;2.288177e+01;13.225:4.60156:2.58516:181.719:0.709485:6:8.949:4.79879:1
B;911198840933120;42248;RLO_END;2.288177e+01;1:4.602e+00:4.602e+00:2.585e+00:6:0:7.094848e-01:1.876529e+00:0:1.236e+00:0.000e+00:0.000e+00:7:5:1.581141e-05:1.033911e+00:0:0:3.78986:0
B;911198840933120;42248;RLO_BEGIN;2.289641e+01;1:4.593e+00:4.593e+00:2.759e+00:6:0:1.910968e+00:1.879524e+00:0:1.236e+00:0.000e+00:0.000e+00:7:5:1.581141e-05:1.036511e+00:3.71673:0.784:3.79729:0
B;911198840933120;42248;CE;2.289641e+01;1:4.593e+00:4.593e+00:2.759e+00:6:0:0:1.236e+00:0.000e+00:0.000e+00:7:5:3.797290e+00:1.307498e-01:0
S;911198840933120;1;CONAKED;2.289641e+01;4.59273:4.59273:2.75928:1.91097:0.0529574:2.75928:0.0529574:6
B;911198840933120;42248;RLO_END;2.289641e+01;1:2.759e+00:2.759e+00:2.759e+00:6:0:5.295743e-02:5.881359e-02:0:1.236e+00:0.000e+00:0.000e+00:7:5:1.581141e-05:4.078892e-02:0:0:0.13075:0
S;911198840933120;1;NS;2.289654e+01;5:1.34415:3.06558e+12:296.204:0.962677
S;911198840933120;1;SN;2.289654e+01;2.75928:2.75928:2.75928:1.34415:5:2:158.331:21.694:-17.8374:-9.77286:-7.54641
B;911198840933120;42248;BSN;2.289641e+01;1:2.759e+00:2.759e+00:2.759e+00:6:0:0:1.236e+00:0.000e+00:0.000e+00:7:5:0.13075:0:0.305166:0.571555:0.999995:418.965
B;121178167227899;182020;RLO_BEGIN;1.749424e+01;0:1.146e+01:2.699e+00:0.000e+00:3:0:1.140518e+02:1.139149e+02:1:1.042e+01:0.000e+00:0.000e+00:1:0:5.271798e+00:1.090958e+02:1.09923:1000:294.249:0.445315
B;121178167227899;182020;CIRC;1.749424e+01;294.249:0.445315:163.216:0
S;121178167227899;0;HENAKED;1.761808e+01;3.09013:3.01473:0:165.865:0.424666:4:11.462:3.07606:0
B;121178167227899;182020;RLO_END;1.761808e+01;1:1.462e+01:0.000e+00:0.000e+00:1:0:6.786134e+00:2.017117e+02:0:3.076e+00:3.076e+00:0.000e+00:4:0:4.246665e-01:9.973681e+01:-8.38207:4.19103:390.644:0
S;121178167227899;0;NS;1.914511e+01;5:1.23552:2.73438e+12:230.866:0.469482
S;121178167227899;0;SN;1.914511e+01;3.00182:3.00182:1.68523:1.23552:5:2:395.949:73.6675:15.5208:-21.396:68.762
B;121178167227899;182020;BSN;1.914511e+01;0:3.002e+00:3.002e+00:1.685e+00:6:0:1:1.461e+01:0.000e+00:0.000e+00:1:0:392.331:0:704.211:0.478787:0.745994:9.24585
B;121178167227899;182020;RLO_BEGIN;2.007576e+01;1:1.460e+01:5.125e+00:3.002e+00:6:0:2.909869e+02:2.855900e+02:0:1.236e+00:0.000e+00:0.000e+00:7:5:1.581141e-05:9.512176e+01:11.8184:0.875598:483.062:0.253348
B;121178167227899;182020;CIRC;2.007576e+01;483.062:0.253348:360.679:0
B;121178167227899;182020;CE;2.007576e+01;1:1.460e+01:5.125e+00:3.002e+00:6:0:0:1.236e+00:0.000e+00:0.000e+00:7:5:4.830616e+02:6.988166e+00:0
S;121178167227899;1;HENAKED;2.007576e+01;14.6019:5.12502:3.00249:290.987:0.777932:6:10.428:5.14023:1
B;121178167227899;182020;RLO_END;2.007576e+01;1:5.125e+00:5.125e+00:3.002e+00:6:0:7.779325e-01:3.526028e+00:0:1.236e+00:0.000e+00:0.000e+00:7:5:1.581141e-05:1.851686e+00:0:0:6.98817:0
S;121178167227899;1;NS;2.008654e+01;5:1.50923:7.56914e+12:76.0552:0.82215
S;121178167227899;1;SN;2.008654e+01;5.117:5.117:3.1601:1.50923:5:2:304.054:94.5928:52.3684:12.5618:-77.766
B;121178167227899;182020;BSN;2.008654e+01;1:5.117e+00:5.117e+00:3.160e+00:6:0:0:1.236e+00:0.000e+00:0.000e+00:7:5:6.99629:0:47.1189:0.851702:0.977909:88.8729
B;429124057997752;692008;RLO_BEGIN;1.889447e+01;0:1.089e+01:2.485e+00:0.000e+00:3:0:1.081728e+02:1.041918e+02:1:7.803e+00:0.000e+00:0.000e+00:1:0:3.094212e+00:8.948727e+01:1.39534:1000:255.334:0.445138
B;429124057997752;692008;CIRC;1.889447e+01;255.334:0.445138:141.675:0
S;429124057997752;0;HENAKED;1.896551e+01;2.74226:2.6592:0:174.266:0.382201:4:10.891:2.6718:0
B;429124057997752;692008;RLO_END;1.896551e+01;1:1.191e+01:0.000e+00:0.000e+00:1:0:4.066811e+00:1.541436e+02:0:2.672e+00:2.672e+00:0.000e+00:4:0:3.822014e-01:7.839867e+01:-8.21868:4.10934:301.745:0
S;429124057997752;0;NS;2.094996e+01;5:1.23552:2.78553e+12:64.7923:0.989846
S;429124057997752;0;SN;2.094996e+01;2.61122:2.61122:1.46364:1.23552:5:2:330.688:47.9201:-23.1084:-29.8154:-29.553
B;429124057997752;692008;BSN;2.094996e+01;0:2.611e+00:2.611e+00:1.464e+00:6:0:1:1.191e+01:0.000e+00:0.000e+00:1:0:302.998:0:3608.39:0.920939:0.970389:11.1032
B;429124057997752;692008;RLO_BEGIN;2.596631e+01;1:1.191e+01:2.903e+00:0.000e+00:4:0:1.981314e+02:1.969307e+02:0:1.236e+00:0.000e+00:0.000e+00:7:5:1.581141e-05:7.154774e+01:9.63862:3:342.34:0.180958
B;429124057997752;692008;CIRC;2.596631e+01;342.34:0.180958:280.391:0
B;429124057997752;692008;CE;2.596631e+01;1:1.191e+01:2.903e+00:0.000e+00:4:0:0:1.236e+00:0.000e+00:0.000e+00:7:5:3.423400e+02:3.643241e+00:0
S;429124057997752;1;HENAKED;2.596631e+01;11.9087:2.90278:0:198.131:0.401026:4:7.805:2.90278:0
B;429124057997752;692008;RLO_END;2.596631e+01;1:2.903e+00:2.903e+00:0.000e+00:4:0:4.010264e-01:1.655288e+00:0:1.236e+00:0.000e+00:0.000e+00:7:5:1.581141e-05:1.121879e+00:0:0:3.64324:0
B;429124057997752;692008;RLO_BEGIN;2.776739e+01;1:2.836e+00:2.836e+00:1.469e+00:6:0:1.734965e+00:1.670779e+00:0:1.237e+00:0.000e+00:0.000e+00:7:5:1.581141e-05:1.144901e+00:2.29302:0.784:3.69494:0
B;429124057997752;692008;CE;2.776739e+01;1:2.836e+00:2.836e+00:1.469e+00:6:0:0:1.237e+00:0.000e+00:0.000e+00:7:5:3.694939e+00:1.371116e-01:0
S;429124057997752;1;CONAKED;2.776739e+01;2.83569:2.83569:1.46936:1.73496:0.0423121:1.46936:0.0423121:6
B;429124057997752;692008;RLO_END;2.776739e+01;1:1.469e+00:1.469e+00:1.469e+00:6:0:4.231209e-02:5.401277e-02:0:1.237e+00:0.000e+00:0.000e+00:7:5:1.581141e-05:4.992148e-02:0:0:0.137112:0
S;429124057997752;1;NS;2.778138e+01;5:1.23552:9.51483e+12:67.9941:0.846107
S;429124057997752;1;SN;2.778138e+01;1.46936:1.46936:1.46936:1.23552:5:2:526.646:12.9724:4.79714:5.25465:-10.8471
B;429124057997752;692008;BSN;2.776739e+01;1:1.469e+00:1.469e+00:1.469e+00:6:0:0:1.237e+00:0.000e+00:0.000e+00:7:5:0.137112:0:0.150544:0.0892682:0.999984:81.7014
B;376746004602731;942306;RLO_BEGIN;1.812471e+01;0:1.119e+01:2.558e+00:0.000e+00:3:0:5.099184e+01:4.956997e+01:1:9.475e+00:0.000e+00:0.000e+00:1:0:4.256487e+00:4.594613e+01:1.18077:1000:126.008:0.0700286
B;376746004602731;942306;CIRC;1.812471e+01;126.008:0.0700286:117.184:0
S;376746004602731;0;HENAKED;1.820281e+01;2.92612:2.7839:0:176.801:0.40012:4:11.191:2.84896:0
B;376746004602731;942306;RLO_END;1.820281e+01;1:1.364e+01:0.000e+00:0.000e+00:1:0:5.393060e+00:1.729960e+02:0:2.849e+00:2.849e+00:0.000e+00:4:0:4.001204e-01:8.523729e+01:-8.33882:4.16941:334.587:0
S;376746004602731;0;NS;1.998420e+01;5:1.23552:7.54769e+12:96.5034:0.887485
S;376746004602731;0;SN;1.998420e+01;2.78369:2.78369:1.50937:1.23552:5:2:422.016:68.8208:-9.17803:62.8304:-26.5408
B;376746004602731;942306;BSN;1.998420e+01;0:2.784e+00:2.784e+00:1.509e+00:6:0:1:1.364e+01:0.000e+00:0.000e+00:1:0:335.941:0:2676.25:0.907389:0.969924:10.7259
B;376746004602731;942306;RLO_BEGIN;2.229358e+01;1:1.363e+01:4.732e+00:2.691e+00:6:0:2.275348e+02:2.258187e+02:0:1.236e+00:0.000e+00:0.000e+00:7:5:1.581141e-05:7.744163e+01:11.0336:3:385.429:0.406153
B;376746004602731;942306;CIRC;2.229358e+01;385.429:0.406153:228.886:0
B;376746004602731;942306;CE;2.229358e+01;1:1.363e+01:4.732e+00:2.691e+00:6:0:0:1.236e+00:0.000e+00:0.000e+00:7:5:3.854295e+02:4.024556e+00:0
S;376746004602731;1;HENAKED;2.229358e+01;13.6322:4.73208:2.69073:227.535:0.747384:6:9.479:4.79879:1
B;376746004602731;942306;RLO_END;2.229358e+01;1:4.732e+00:4.732e+00:2.691e+00:6:0:7.473838e-01:2.002611e+00:0:1.236e+00:0.000e+00:0.000e+00:7:5:1.581141e-05:1.089694e+00:0:0:4.02456:0
S;376746004602731;1;NS;2.230727e+01;5:1.38984:6.65266e+12:347.288:0.995405
S;376746004602731;1;SN;2.230727e+01;4.72346:4.72346:2.86941:1.38984:5:2:422.107:131.764:59.5072:-79.3449:-86.7471
B;376746004602731;942306;BSN;2.230727e+01;1:4.723e+00:4.723e+00:2.869e+00:6:0:0:1.236e+00:0.000e+00:0.000e+00:7:5:4.03203:0:40.6198:0.903526:0.983491:124.903
B;210909380757465;972432;RLO_BEGIN;1.740863e+01;0:1.150e+01:2.721e+00:0.000e+00:3:0:1.276465e+02:1.259403e+02:1:9.117e+00:0.000e+00:0.000e+00:1:0:3.758515e+00:1.132809e+02:1.26101:1000:315.521:0.289233
B;210909380757465;972432;CIRC;1.740863e+01;315.521:0.289233:224.262:0
B;210909380757465;972432;RLO_END;1.755502e+01;1:1.298e+01:0.000e+00:0.000e+00:1:0:4.804337e+00:1.665559e+02:0:3.775e+00:3.084e+00:0.000e+00:4:0:9.238346e+01:9.511330e+01:-7.72064:3.86032:341.235:0
S;210909380757465;0;HENAKED;1.823226e+01;3.77399:3.6474:0:21.3297:0.54087:4:11.5:3.84033:0
S;210909380757465;0;NS;1.864531e+01;5:1.23552:1.75727e+12:460.307:0.812754
S;210909380757465;0;SN;1.864531e+01;3.72027:3.72027:2.15034:1.23552:5:2:159.114:41.645:-14.311:30.8513:24.0355
B;210909380757465;972432;BSN;1.864531e+01;0:3.720e+00:3.720e+00:2.150e+00:6:0:1:1.298e+01:0.000e+00:0.000e+00:1:0:342.618:0:1331.72:0.763273:0.977243:14.7422
B;210909380757465;972432;RLO_BEGIN;2.298934e+01;1:1.297e+01:4.465e+00:2.474e+00:6:0:2.567276e+02:2.528737e+02:0:1.236e+00:0.000e+00:0.000e+00:7:5:1.581141e-05:8.859313e+01:10.4938:3:434.515:0.293347
B;210909380757465;972432;CIRC;2.298934e+01;434.515:0.293347:307.052:0
B;210909380757465;972432;CE;2.298934e+01;1:1.297e+01:4.465e+00:2.474e+00:6:0:0:1.236e+00:0.000e+00:0.000e+00:7:5:4.345154e+02:7.133206e+00:0
S;210909380757465;1;HENAKED;2.298934e+01;12.9653:4.4646:2.47438:256.728:0.773218:6:9.12:4.45734:1
B;210909380757465;972432;RLO_END;2.298934e+01;1:4.465e+00:4.465e+00:2.474e+00:6:0:7.732177e-01:3.513041e+00:0:1.236e+00:0.000e+00:0.000e+00:7:5:1.581141e-05:1.961873e+00:0:0:7.13321:0
S;210909380757465;1;NS;2.300566e+01;5:1.28539:6.88908e+12:106.57:1
S;210909380757465;1;SN;2.300566e+01;4.45575:4.45575:2.6186:1.28539:5:2:377.39:121.14:108.511:47.9021:-24.6107
B;210909380757465;972432;BSN;2.300566e+01;1:4.456e+00:4.456e+00:2.619e+00:6:0:0:1.236e+00:0.000e+00:0.000e+00:7:5:7.14322:0:9.14427:0.272968:0.996196:58.0228
B;330354781292880;11488;RLO_BEGIN;1.772766e+01;0:1.136e+01:2.660e+00:0.000e+00:3:0:1.162900e+02:1.151560e+02:1:1.101e+01:0.000e+00:0.000e+00:1:0:6.738092e+00:1.135433e+02:1.03135:1000:301.775:0.439932
B;330354781292880;11488;CIRC;1.772766e+01;301.775:0.439932:169.014:0
B;330354781292880;11488;RLO_END;1.789339e+01;1:1.513e+01:0.000e+00:0.000e+00:1:0:8.842441e+00:2.052726e+02:0:3.124e+00:3.049e+00:0.000e+00:4:0:9.833749e+01:1.006513e+02:-8.23274:4.11637:396.287:0
S;330354781292880;0;HENAKED;1.790025e+01;3.12442:3.05729:0:75.6535:0.432043:4:11.361:3.12442:0
B;330354781292880;11488;RLO_BEGIN;1.908249e+01;1:1.512e+01:5.392e+00:3.211e+00:6:0:2.115000e+02:2.010188e+02:0:3.075e+00:3.075e+00:0.000e+00:4:0:4.644573e-01:9.790902e+01:4.91597:3:387.101:0
B;330354781292880;11488;CE;1.908249e+01;1:1.512e+01:5.392e+00:3.211e+00:6:0:0:3.075e+00:3.075e+00:0.000e+00:4:0:3.871013e+02:4.586833e+00:0
S;330354781292880;1;HENAKED;1.908249e+01;15.115:5.39191:3.2107:211.5:0.640702:6:11.015:5.48168:1
B;330354781292880;11488;RLO_END;1.908249e+01;1:5.392e+00:5.392e+00:3.211e+00:6:0:6.407017e-01:1.964585e+00:0:3.075e+00:3.075e+00:0.000e+00:4:0:4.644573e-01:1.520453e+00:0:0:4.58683:0
S;330354781292880;1;NS;1.909522e+01;5:1.58969:3.87967e+12:334.364:0.931148
S;330354781292880;1;SN;1.909522e+01;5.38191:5.38191:3.35842:1.58969:5:2:745.923:231.579:83.1112:-169.924:133.594
B;330354781292880;11488;BSN;1.909522e+01;1:5.382e+00:5.382e+00:3.358e+00:6:0:0:3.074e+00:3.074e+00:0.000e+00:4:0:4.59477:0:10.9779:0.632854:0.967288:164.267
S;330354781292880;0;NS;1.933618e+01;5:1.23552:2.77683e+12:63.2272:0.625193
S;330354781292880;0;SN;1.933618e+01;3.05007:3.05007:1.72551:1.23552:5:2:211.576:40.4398:34.1202:-18.9543:10.5796
B;330354781292880;11488;BSN;1.933618e+01;0:3.050e+00:3.050e+00:1.726e+00:6:0:1:1.590e+00:0.000e+00:0.000e+00:7:5:10.8463:0.626679:12.7048:0.64261:0.997952:39.3755
B;682970812860663;661748;RLO_BEGIN;1.886565e+01;0:1.090e+01:2.481e+00:0.000e+00:3:0:8.921082e+01:8.696645e+01:1:9.404e+00:0.000e+00:0.000e+00:1:0:4.360130e+00:8.130177e+01:1.15885:1000:221.996:0.297779
B;682970812860663;661748;CIRC;1.886565e+01;221.996:0.297779:155.891:0
S;682970812860663;0;HENAKED;1.897144e+01;2.78183:2.71711:0:168.166:0.391174:4:10.901:2.74082:0
B;682970812860663;661748;RLO_END;1.897144e+01;1:1.348e+01:0.000e+00:0.000e+00:1:0:5.586272e+00:1.855947e+02:0:2.741e+00:2.741e+00:0.000e+00:4:0:3.911740e-01:9.037056e+01:-8.18558:4.09279:357.361:0
S;682970812860663;0;NS;2.082439e+01;5:1.23552:8.242e+12:198.61:0.980688
S;682970812860663;0;SN;2.082439e+01;2.68004:2.68004:1.46863:1.23552:5:2:127.848:19.4533:5.89935:11.1415:-14.8154
B;682970812860663;661748;BSN;2.082439e+01;0:2.680e+00:2.680e+00:1.469e+00:6:0:1:1.348e+01:0.000e+00:0.000e+00:1:0:358.731:0:361.168:0.1257:0.985746:7.26384
B;682970812860663;661748;RLO_BEGIN;2.275081e+01;1:1.347e+01:4.708e+00:2.671e+00:6:0:1.926744e+02:1.856760e+02:0:1.236e+00:0.000e+00:0.000e+00:7:5:1.581141e-05:6.399973e+01:10.9026:3:317.418:0.0603034
B;682970812860663;661748;CIRC;2.275081e+01;317.418:0.0603034:298.276:0
B;682970812860663;661748;CE;2.275081e+01;1:1.347e+01:4.708e+00:2.671e+00:6:0:0:1.236e+00:0.000e+00:0.000e+00:7:5:3.174177e+02:3.666895e+00:0
S;682970812860663;1;HENAKED;2.275081e+01;13.4704:4.70811:2.67134:192.674:0.724404:6:9.408:4.79879:1
B;682970812860663;661748;RLO_END;2.275081e+01;1:4.708e+00:4.708e+00:2.671e+00:6:0:7.244037e-01:1.823006e+00:0:1.236e+00:0.000e+00:0.000e+00:7:5:1.581141e-05:9.942154e-01:0:0:3.66689:0
B;682970812860663;661748;RLO_BEGIN;2.276473e+01;1:4.699e+00:4.699e+00:2.844e+00:6:0:1.854115e+00:1.826221e+00:0:1.236e+00:0.000e+00:0.000e+00:7:5:1.581141e-05:9.968415e-01:3.80314:0.784:3.67463:0
B;682970812860663;661748;CE;2.276473e+01;1:4.699e+00:4.699e+00:2.844e+00:6:0:0:1.236e+00:0.000e+00:0.000e+00:7:5:3.674633e+00:1.263051e-01:0
S;682970812860663;1;CONAKED;2.276473e+01;4.69947:4.69947:2.84427:1.85411:0.0543079:2.84427:0.0543079:6
B;682970812860663;661748;RLO_END;2.276473e+01;1:2.844e+00:2.844e+00:2.844e+00:6:0:5.430788e-02:5.715556e-02:0:1.236e+00:0.000e+00:0.000e+00:7:5:1.581141e-05:3.909833e-02:0:0:0.126305:0
S;682970812860663;1;NS;2.276513e+01;5:1.37943:6.10122e+11:92.7424:0.917336
S;682970812860663;1;SN;2.276513e+01;2.84427:2.84427:2.84427:1.37943:5:2:575.307:79.5082:-47.0301:61.1742:19.169
B;682970812860663;661748;BSN;2.276473e+01;1:2.844e+00:2.844e+00:2.844e+00:6:0:0:1.236e+00:0.000e+00:0.000e+00:7:5:0.126305:0:0.333136:0.621149:0.999971:447.215
