256529056557906
547393620927229
537796540284438
690171555794830
966149805023590
840674272040978
514884274961759
927517536747893
369178015355777
214103497959339
712659558804522
937571274082425
932774852580020
370940328235900
601311807580502
610955963807640
114282750300001
216454842369495
664494936110567
754403466390740
523127265714419
381168536593727
312063095673712
447050446388098
224114574736611
867049100234899
849783050544696
717186311358706
408206593045328
546776059404605
632735031625020
889241379067533
966122863977027
348969501903355
720040721952467
127682372977232
655766421135972
513806245560385
868861746079777
495798720015929
387799434744646
780177097131773
198938073236620
887937869717636
574698141867056
365938817313317
612068839000399
223055242978354
536882140055724
304972636748248
565286614167748
766396881422739
556190765774771
659696406137830
114565800832601
568076474912522
655708457810634
862295601385774
593783765300629
407472451006638
471024937216645
625175059096798
415078737814740
313782985000833
300895965095959
214195025932866
215462154207672
255461855261109
820698751609971
431469011991908
138069716232046
715688653855012
538905792169226
406869176916655
500903890913315
314871929047422
659175423529626
508940726889927
922770426173462
196004960702723
141208018148652
742937750332710
592609973633809
847560247931300
222328030677156
570180430397796
490162117580870
614503083900521
604966032639063
746951662591133
342695015403449
302189504860106
858192668473727
904276545320885
943187676491466
726306275313278
658056046167599
744937202611227
336058698023794
390139682237742
313280637216773
890882122746233
166041441840549
729716900707171
114541804093396
763704718851181
744462436511450
867019521526810
147289423690549
838780400268691
497071620858127
270583422371859
888471023889601
917260096068472
404170906527577
840475556237293
590253076709582
136485882541685
320888713971039
959948017987109
856456311136913
431407909336060
720699019024253
873826869889116
667163950734986
896910042513099
239957486902334
599078786049655
840254979575589
478390052246587
619862295630632
627273326375973
197630366089425
947250520476722
960986746598327
705467873642151
131959457153762
924117906745678
358405557743404
759858539860517
996400022956945
321206445866028
817089258837300
252847643877597
543796970033953
859560666874668
108018383521869
164878014333591
780041159593570
516167308851364
490778148304626
337053229326539
968263898910553
950057871133530
938009317708834
291490624588605
230175708413018
271808804606407
776269053945805
470561345436822
222877463876791
905022848179867
896679315698557
890177321305711
689679762916381
674888734740586
834552165505908
385313688985548
544017733724897
778465762494909
140591069727182
370950251312008
305661342998836
556161527987932
534980590122875
300275986499024
506179372449410
937463803245946
942039567807378
326872068100697
247037245374801
627273850635722
524690266241901
657665742093355
186542732052640
740156639893197
675253748440431
315855895857120
549952296027669
404588268181652
393591723488879
641268414680757
586260998390135
676943458483279
423154897044821
106481194479080
934867155114552
783555617625757
338886160673658
456779187297074
321006855927008
128751513015824
202226964124294
569977528229032
340076876873454
342228988724572
806596631221668
954060527532094
297774597702994
896779349169256
903173867533767
238278228859266
591040547049710
333959732567035
571332757899607
568997854314555
435939115977984
723609987896516
522490513031389
526098860660414
775491564522888
968302206734043
553933742722022
616945783635931
300815857148186
182227151564648
330880570880786
362565478684821
150776865672089
884970623043798
233113504061160
749395078786613
193948506651818
821999693350902
675108650119620
150055184733667
565216691444442
763579066973519
716473700361044
111681836929180
706960881066982
614179418855957
224589425564768
768027725568650
276929859039898
893826509176651
888799850244190
704451159186185
484179221735010
345483482340670
537061911246684
597750480709586
390948684704798
826785678350096
469962118828783
463368099829027
961682528323306
464915917675068
641615257120387
750967454424541
428802716586726
623677899165739
200475080953605
990135653438079
113895461338847
914696820640769
978765779160097
697901955993488
519938651892555
218682611116530
852938799633866
697286814421189
980780125432827
147989491918010
648942300667609
204077938522211
608643428479824
353554158515653
259287074529756
697002060290145
187573809068430
523694318790314
948286482577905
590470927042990
192167873031644
819154536792921
681791910687311
907983999676326
705561171219547
285195070780039
587110925581384
591620868548454
689042776713578
782707742858660
199003562554830
336054953673660
777691764741553
201670518165987
463095960446055
376069255778026
160875772865529
339993997207927
931078039069295
811956782574925
828790421474711
814050429987736
885956159179717
743179388395962
741347383456835
759490975884666
893298103193049
244328901837155
608776090641212
321281229084991
940861632021515
372645681075625
614502066377056
528444544297877
176787363552077
907405781191950
195469378602841
618104934698618
603595068483252
644111501581993
966364707886896
846956262454227
720798088579043
496477037047738
924392540270712
914803648899535
538277703041023
781958582107112
183231512006714
946714093321291
757715541299514
733424468101935
566037255673990
925713098395516
682267321540297
609618875934431
685875341541563
658988986086624
506691564682324
937283181389300
452860516370679
558201005683245
571209705877028
287972859466185
985992793571076
208095735964617
153782078246416
687465776597684
701929878647466
696927561844670
607252381684749
520485585756825
448579343941738
606009471887199
260689741853404
418105539160569
877040539746220
648146279683535
580842895005839
172312632920502
523370789917009
154875184187554
499666414109963
158699752446664
634156654354707
540952086165064
164879718948785
988954911777920
669612575183172
697907992626094
732324677920948
137045575966726
836280822697204
932181418889398
792077965824640
