230303098970185
102071279613709
638477337813562
848330392816358
935502268771238
245168939361088
240857142300275
604963411168885
168590615980791
401928736969798
918451479602857
703674603402865
716685443409827
284010255466086
190766717264871
506173344429265
465992195677311
918988823820340
336175141856925
867171535830764
216800209910537
623158354048702
748749645460617
557531105693226
753899499358604
431148706122254
458979381745449
597061735926445
555004948412366
949957539038587
664604090290937
494173989200128
121568630388278
181585785708820
913464311006270
100391798882486
722207296465586
473211051664518
352010338902160
912971751912756
839462830127673
887290593114769
480074796112387
742584236573430
227177810512757
673136923865163
959365487987686
569600572689132
127941659754226
724318249357719
855145308199422
726096842839193
109074986473381
146791187503681
519047924355202
331907786275886
290997775671383
877158436637513
772384168564428
835072972585175
480147255490080
264882799523804
228209103627977
973294989204223
210778787420376
216150503580439
372284909051972
858859076359760
459062469060673
432599704567363
405236908088604
747785162318724
150679061482756
200750912772463
150870709502058
317579973169114
637864230354621
322473050669198
871890849061316
225872754486013
605592568627829
181654479163720
406951075097786
666893995753927
862127058413942
275562668780032
591159386446092
581910849901073
362072365615355
392091405738170
904096918542867
510256423814334
213868048806008
401200363115817
818373970902816
344151038709666
280062413272827
967894858827472
438877859082468
641974912419200
847786279914948
410996114692844
249376686831790
652275165126692
736572942239248
123682801466821
269458399935395
767920085059922
942277117108777
478942022857932
984086243703327
483698542615998
694039325988769
404073739136469
894403168049994
518957627445005
615702571080332
344560357786111
173495892842451
200581186758187
917561446856677
666990688809047
543472588085124
863066697473397
372020449690148
273840895838840
866777759313173
103862904355548
861505465601236
841909638518347
464123487777766
936700936818304
991172539580444
182775791374978
911100625439768
266032497887865
163133871254635
368282789613132
154037295349278
224382671857710
886102648121683
481879561463036
648449894691877
592929787992884
598398890211704
388277957960250
549656052467568
687040085775249
918288038443805
449490830468795
901978033447855
207396851605909
805870077085767
723800308594317
283032573939529
377003825598136
866257056653498
878931321406518
637977380240921
251888765106635
857181531980934
784580913425192
379399215486936
923231483559370
656490317238373
725743332553347
520033831522640
829120121114787
224281784401994
731967846000817
925061259741827
249393109890692
822862180544384
780660709505747
408062541415846
127576452248164
917963950195690
747395845173306
760195553579064
824497726942136
324856322250337
197597322904055
634976648979248
558251747687902
892859735863196
297497101523613
283065516651350
672780819366570
790596682868048
380395636257778
390096605684858
491078254262524
538182747734496
624186559859742
415252913366549
951190325484459
200859945885681
538927533523082
231920789387609
863989947355184
791247916462959
820571560423638
949118604916833
820900817126874
904884906522898
202027993770219
492811684543864
586066282527832
309869966734369
828016255181441
465680851404170
988361976512227
424955625202853
193558297364656
355669918933611
195707835253840
472956916795712
131951644415657
206109036686358
552922126840011
590802026433895
589944740499604
843840611520003
364557151995451
613454131175907
197611705393753
326146246423547
615108488018669
524253450319996
953497365588824
228567266984762
723190528148177
255801092964492
687795040751967
299413136655189
797086848539312
506901006336251
747940514494947
766469688291869
666038206167520
639194248548767
170035938202933
124021656696778
401885860772963
611786522263332
373950846165409
684789927948912
570545188642049
438703760365131
472962279613202
914949624651639
333666446291740
281557789418839
332771565363561
414398035304633
723197001907697
530040503840717
122179402041821
792450663370432
882664959282295
351397938958887
261392772405180
426543417435988
922776388026619
492993073962855
361065469108715
938077730625518
184065749192042
885122736931616
973399085070128
612960995434989
748878297645955
761790252526689
324001467806828
410713678140467
195109695915327
839489836910979
676651312570988
873767307644511
312463720147290
797961503401529
165906093119911
617660458268813
398160217071804
607590857629330
527495596928871
216886713010380
991565999190535
952874479574034
250169753482693
633567322637174
298029594566571
515944923444889
987096748364372
801877252353669
491916873280254
534484595242654
330967070983972
522857858991529
414881088998012
368880381590749
464283633732765
583772820783640
561592998656546
366600477024892
428618453757150
183047780463965
110666095643720
919810439326148
672607550305668
952012057473098
239285980170606
923355343192115
409485446696183
821852566703342
444992105851238
683452548129940
451265588048058
741288624351795
575877395173827
242979954823296
896285714627721
390491604315586
227679197759687
775983941235638
460655974055570
815696182864346
491788018597838
933168110862516
683114113374106
673459950627031
526701149234919
960592739394635
500050605469326
715813263038743
167395173949500
339200928564754
917705352603990
445774805281770
150806876089037
417872914504601
561782559680669
483037048161583
338497215707543
621176011645899
249462014342833
230003135888780
916046522435677
836300425262484
147466180981160
390225083134956
266207954603778
961188890305442
145668536217645
799901619296373
852587385924988
458893385910730
907098881468926
470789556730212
600492125415740
121147165578011
939038953469343
411286807900039
791697590973913
259389005305080
567805969681405
799463621610005
544042737165001
543771934073424
530351164277666
535185193842556
720203699982430
385842463182741
411689358657213
487274044862861
551494854154918
259027036751502
468300569893367
143129887191776
147189578002860
808687896644857
257469389814980
822138550026782
535129033371979
508960277953883
324929894113516
598822503431746
638151353764603
382831873758260
705059021752445
541885058674984
371873761195990
793698815882256
531484999658460
832787678866846
842594756460670
835574877597356
801385201827826
502047924562008
499298544306133
208867707098936
160017585643727
360946897661663
213509102396190
132969657780764
849485864118142
967487159114642
578138809680913
456778881743286
827496132122746
509572081842230
899792938661276
887515450045953
868496504708518
698952746762724
331708385070610
635939642193279
232608562023039
539065567745161
587882324130714
186121190383126
273135588016220
428622044671807
818140896740997
262472275292566
273070615783197
964058403614765
753168672345957
973544407533197
621919573805693
369953024450599
231785069233888
149295923576186
913205370983471
124002869519239
689280929798530
530922756489234
785815757674856
635182588097678
867470836572480
187991802382503
737356018065648
966043094515552
136781154140467
487795755701684
190054527581153
967610214251927
212902763796198
938493559552921
505351685660265
107867461937628
834954806023821
624699018991827
604630667499572
782160640161669
820949782842475
665219425021873
598787135082803
633649471058964
488093726133001
721499082845897
583857375580369
177951552092059
343472027164143
542143984296380
910734278781789
195012811174081
681787605691522
730007860307025
793807692277868
730809369753449
506599953845110
508062433680380
440809314577941
297928912392666
634177187135972
924109324535810
840933881894299
926704973766346
899188080373553
578010990823091
579789133755921
918769858921345
203937669288548
664380258675401
991307755744630
400893919828531
835493097395772
391680733986945
756779846632740
963162447122751
280568027608897
151187882022144
668691861881106
159502851588334
689855490088771
633784249082011
867349039175278
629169451583985
870472522241535
908509589821246
401492160260506
736426619185880
582187017823880
217468024633188
892487780079067
717373789957800
951717356504468
200774638011105
158911286747758
152690679845284
458786800190050
628786589561698
545879490085280
188541831756893
581860388337987
244781482636907
663592837976072
712108391849712
614842148430046
922284626031134
777699784434635
813690013789668
490972722255308
826956749324343
519854140775189
607069038372438
205480257508124
467013810124842
318911608667052
312689820206102
679102960555918
129850561609446
912567729740962
605207417435742
798927057262819
865660149012821
529363901007829
900574138201130
969555193508243
853979273985327
411048117138929
282859574463861
718570949556365
899577780266864
815928915503129
673895931324881
216384178125964
891162889747741
525027304843965
562997987664595
402021138560406
859569045303069
860947217113677
993870607172393
550819988590266
495879603999860
100019986551443
392205799213565
861069294458516
961688167278333
342014011450515
754592746909596
975808007152680
418882082211350
