444149166147134
699300480614456
948849424906383
610099758041062
884206603792926
990021274119526
759174221653534
514884274961759
144019398649338
998206195113201
405135963577830
152173397915857
607999276445846
285940025183537
303191023494923
450287202601956
659800029192434
610955963807640
347045083788875
552899649322666
631552307597937
381168536593727
433593197421298
124268961687277
909929313217837
890784696035611
479550935849713
361927306757960
187923550598579
519180518492376
488240387638845
277397173815405
182968576591670
657222450831546
495798720015929
484927284486676
885989591952159
656178612258854
131959227834906
638912049121203
700601932516421
332020425395561
263282500967243
119652466638853
983431661879629
481118091710050
469266075323365
766396881422739
105262381253291
208255962409773
410917747975170
207029145363594
675981271877929
216690343250243
991949544673313
165956874485710
485198689979675
162801589961505
956585125728239
720142368851379
248078730860737
319822096460726
658043636661544
732593947701290
584123982791148
433957564020828
869836982590585
116877227900577
945047975314869
324951505172549
569003060932068
773564729172413
610863455444407
739556444052876
769310624286996
187864488985773
783140457187603
854629802292346
754695793405245
128142059611878
545094969568877
210929374638623
875831904696139
622501732167212
296099192386254
948391606054863
631276359263360
811931810787371
380029788911955
201716770508527
637827541886910
141208018148652
742937750332710
948148828329598
331933387734135
815809399596041
342695015403449
839392705558887
753878574230435
223212736144073
471966127517024
610602832540124
636070039525532
877919474406541
462036905846186
872385887924808
971511161353557
864893047158157
341573403689913
601948948335633
825079847882780
177938615053797
335071200497047
907916915933156
737180348173626
867019521526810
838780400268691
748094692368971
404170906527577
840871532286003
598398350496873
561818869170362
241910189037112
602082769760411
576870693578259
780495156362522
224183578361575
222287886501400
495935429692075
275808762294990
120301354466860
862124056847259
924117906745678
515177665586073
477967972954003
103500451907267
205882524991280
575818371706359
458267853856271
620988387307469
766265476029613
334272962599977
465191089700583
987263627065812
476564462213486
353173292110579
914831096893644
474140524122407
753208081513634
930298018921483
337053229326539
955862270710475
659109633134897
570010500407427
174632518521485
140911088302834
625875814470567
767191194674442
878065019240161
825608237016744
313398280775196
610172500208389
776159951337035
393111171105662
769131395412732
765148436851739
621703958637551
114841809168102
323933267729886
674888734740586
126161918303931
104077159436108
260812390953251
908862153387335
642812937914159
531137593803389
449881175183576
181693844890837
512395874410639
595491148352733
510493356365584
190148978397447
609752520414708
407292112694735
224111022689177
513015920880608
289386513354375
942039567807378
247037245374801
371580048387393
404746376275212
220217273952742
978858334402989
970602530500509
983147557145686
670910274340536
184058785687576
586260998390135
336878274620274
791817377776379
958983773143758
224159586512514
550303015954687
132114454418788
382266051415476
532767008471291
928594804866916
698495158065781
946753579344104
393527062307996
985199250936806
518133539046111
199010878613598
543072379797398
313129839221589
150133507655939
527740938146774
620484147012178
911935261028784
564231377127092
803271228613605
553874577312190
930067302096868
551393504250098
843933343545781
709068230540587
688967021236388
492058598280869
157195799942541
415143254706706
251293906448146
891088298871867
103750540138841
628551634818655
607209673068282
622048910319244
840492307101500
255871464017641
465189786213164
743049900783683
233113504061160
421907095000310
887960655044659
579963290425684
201382692338863
494941865521736
639131192621571
675048904056656
503923521118298
234399342041511
264590311049879
221930993023093
629951319115183
389259929883119
715108739087356
714764993710152
983295421512466
551483175663077
768027725568650
611949909885089
888799850244190
753794715815838
241374560507508
966011183770635
395298139500036
152930748622157
126787841928664
860139619214755
449823488105903
263899245686580
534958802752699
134699553465096
909130651318728
285253325809029
751842341881465
434181884372781
914696820640769
503858705703677
406942102024697
803948870390214
248633984147095
275384921840987
371228443444811
105959902908622
104809671870105
679946879423344
959697022455731
980780125432827
127056672798019
646021654387337
777010803870519
308023227271779
424887933078577
152863992727336
101852196735504
836764350702553
809157631223027
691981464842478
877932003609099
357193913250114
424056729695820
450284667325638
324955301950528
266842203226694
460966154327899
156219016067870
801177088842062
532858678222784
689042776713578
652907975272461
667529255706377
782707742858660
336054953673660
777691764741553
304202528370076
664361945484059
762813373740463
819122907573465
438260397336073
287385131718037
737373602246970
388056596004935
966634854167274
524771907532649
223046413007933
983179026790710
399028232440958
259171633056275
917898205547220
159899005504093
284252392972540
256798314176294
940861632021515
469940018683400
959592680856860
324596770716547
789980551817818
603595068483252
593142067510497
211503515569633
482048704312917
695693553482319
163921798024756
140942744005606
768057205640262
711085963350956
121580253715283
619070575020907
710032950386862
781941045287532
985857029160343
356668162651654
885128763573052
209563514076608
333069760194130
278974855062862
945796017899829
457694984639165
900202534794750
201375857537331
843109386420607
295741110767027
646786533994803
668031724705939
107059230794340
178823385556793
931190344004468
448579343941738
168923507945208
256573518289780
434693312566896
372969835208173
785930001777431
104674806192947
992874017857317
982081461302698
829957220860380
885062596477528
696979703160748
164879718948785
908868092817077
905056664903068
713711316005103
793151351131967
290610653882933
882262781038072
859841583820940
984388218747726
553883897178004
