247930681352538
569176421374979
270283020594479
943273947631716
552044733840316
892810386625770
715567280014747
778859759078705
978791498075852
271881910903472
384952530817589
446402570939193
448490345975416
798077501522253
480785882107911
141763217988448
582763791263236
600897037822842
460263378915695
573468394163962
460396045616829
657276251502699
852051505932181
648173498442314
799836994036161
271934104474328
866994678592723
785200850635116
463386186759994
442891248899225
872781241989767
303063159442535
382050316352066
373365891709034
924729904816174
567938949944084
422879454520321
558610598070430
962253579108771
617063474776746
157478008196697
269136468431829
536286091290879
776688715979493
586297426254899
938282010809486
873836081000397
775365092521948
806677623576783
576968500541876
662038031115047
155729093270326
660391944991567
313457861307123
695095523937546
374333550517814
261879704824938
969590263356076
553419279205314
245257684914995
698962698294826
691924954491424
116340222808042
520970742319069
656886957270506
584153292292291
592299695371639
767425843271751
192352110507078
989967469318731
526396537984796
271171558742357
208870772252119
834846065537425
805871150802683
672180668420514
144297956894634
162959657465707
960802630874270
271064031972686
358561131271617
819045971900187
300375722500672
682276596154853
273980483432307
564668668987736
959951461646677
732173020793771
464003087056910
353972674416624
461309884437100
816069169964439
192820124528949
788989978855354
354174398597499
179798678898675
877795706574164
628956168255063
696018826790816
696515622633676
976197724504958
116041096179914
661457972575527
871306196515800
363927084866108
865864908920462
930676979720473
623626610654455
132968358774439
433182561607146
438621180612866
461267593855732
763490972685302
148121572384997
977283105413427
222499313399835
705936729414994
985034913726371
108691364529989
647399775736847
669209151225867
220031548490661
552174934922820
877484406886951
949381962896011
229032245422020
791009259182378
566612380626510
812283129883596
888429955781971
206859704747696
551136482951943
579673985352707
768061586862387
107889465174959
356461946110721
504052963417436
981873980747759
150397823506156
767578583445061
896907969487002
342275323677118
136785764500517
925706035224920
869276160962811
681641179302669
508700500192576
441292958409815
498589194603857
140831263014312
679295646577488
512499876646859
182773200586843
362285621135400
199176100307812
245036338540123
449560763829175
852698001123594
668371153449531
766679453881971
733047853084637
628279499545456
564234635045632
223960518152502
700868892767236
814137284730102
370210120785441
878018018500476
252492864061234
188383372197514
270585359562399
250820031033668
234303978485029
608948218604494
707078497116829
314952258881055
358783548588868
676171567067211
615947249855909
662929287697468
208660558176716
315788440759497
323914729737024
632961767226633
355478255176728
364407874867559
623711266922410
357390957917943
884281033830273
899076167941208
955948657067179
458457020590328
326697324410218
373006621955578
526040779555813
720658398240602
657384849787312
272972536621562
742526951750867
418091706474425
898483361870880
319808699250222
832116919424066
811393139822792
830399411677710
405897272947884
564572830001682
461956666512774
523375006911604
648071276637438
165690291630826
695270066630220
309178987026465
433982791849260
514120328575203
378014657463751
722158104387112
428383001467637
375385221270265
958284158536687
992869179533489
351070764394396
255945610366095
454459106063278
225864048897501
614952484787576
691941891132991
388762480664980
556567285747529
325686328327912
446181555994168
312288216125208
441165046681977
927603980957405
245372890339812
702060069923824
125076863356805
277563755999091
571482725325744
392010261245414
170322445601980
954823286829422
456562127329310
541075865683447
564284195944978
298971793854389
777300138640393
697158591792664
742479312212878
151998623654473
797057039863782
283939012748009
581690174289451
424003757178117
707901828652189
308990117021739
897957451868686
624973265586104
595787035772251
482874936047018
972252325498094
842472038057419
629052075390557
283045148405770
992983247073131
348192039429461
833954056580783
848048023812066
905693071233186
178951448685656
258459910358559
214182210348512
642660360885780
346960375050259
185008839675297
884279158588247
550052321711707
636579438006380
128485839212595
200805841063879
281461042658617
143786058645765
216057462699829
234028208609451
628219149017692
549517589915336
428919575684976
881810081085750
222393342513587
845108505613849
405239937917508
171031903135833
606701424218582
853288130283565
581452838082157
315964530707673
922189081500514
799328103343877
429162804297182
544555318041541
675529907874807
514968088499354
805967770313513
938573379940947
582937403795702
322704993352247
633047633138909
747969572304834
843063312960628
523711335239046
807073185692960
855458496317523
118939569302313
138858762199596
936597662295756
663196122612667
447157648329269
598836511860320
191104681824378
586598833287837
590007828772594
390979109680920
417962201057047
851219114736956
192453328613417
883936846105324
120170014008247
694644853092315
217091666538029
563062170621224
936960999179333
697303658533427
484484618896072
759516976164693
132921194287878
461374723069108
654819672712461
545817752841376
425298168615242
926009906236685
422230746715311
979059315363335
113189489151034
609291049310335
136840311214794
494891792316402
934076801438800
391010626057351
749878167984452
347183382109651
410913317045946
368800459583543
969877072226728
999081058269452
115003838094240
553797773396019
873389730645818
953205449471077
582385747891946
130047727615895
538119088437484
907648538421445
970694928108694
975061816698484
415457664552140
528933961805018
829698503994012
916392703867853
833699620536571
751684170531381
664194872555759
661599560834548
396403832582122
844063362511077
570164103521572
261384881532740
491422477105826
698297760773832
277691553567226
464819481698205
794857833392883
597858025197302
675915969308056
301684052454315
341993948214808
484663409098936
214460538095751
977184161389762
692951604530416
317385634307507
182693598224080
272180708377487
827049641550247
843877136810233
990882600750755
119552042039954
700593511260292
406801795599575
729180562151611
329171209126658
924788592613584
518138000822609
709119995550848
920690039431665
114298251603277
558199550056368
326683680440949
129064039750758
670394843509765
760775140335714
124959233570028
707322990250859
125873442569961
854826716459991
860270476890515
939922062107369
827989458767259
908789017330950
835979589051737
980078658576664
960308175875929
580358694014270
832277983231829
266378904176170
538038193105980
789069489026087
469387261491208
667176833353956
817878818361902
190518711825410
166921443363045
688408401878658
665027252375132
697684206412864
240798024485566
303812351773722
808940360881654
304526196724822
106174940614564
623999706158611
394098689573737
640379252014018
494876907931351
595053980974683
107895023283670
598936261844405
709788969720597
752947079905850
791380838479601
812848158199999
623866560229073
896488006484885
435049003908067
298056159995652
503523563529044
965174968194231
450823540516506
412391686238148
281602510730285
973895003522588
936293493638498
767347124218573
631498883176003
207497000954068
640778718264820
464017984390082
397585299584466
338718375539167
870786617891777
222862139516046
359543948217821
900890610405022
459286963151425
899383229376909
638594317222851
734786182703618
524245159800678
161580708647597
596493305475230
927119129779332
100485693252899
123065952807716
450396608132980
938150104078152
426495916920232
606134110340399
680793985713478
484967734633554
963871412146087
246821546240492
615955931711824
937473527315734
267069774743334
132167477972543
552498254266919
565802809654497
262001084710515
545497580612638
352773416067367
731950815326800
546857677783144
674695216899819
509991493642059
949369888118003
629884819683081
742578645745454
234691001844353
368259609724528
284644497055718
632662989555899
334357429236023
637318503866917
327459020774469
653582407359225
241344502523233
225383440763740
399376166406912
118686748705903
152635963095953
390047311117151
283989521755647
852049840134347
347444753910701
937761848625053
676814991424656
773856355478836
785736173366950
125800416899129
382492912254056
881180914901709
695276894250677
940978070078583
