856061984655088
256529056557906
501088507387471
950746642755771
190851525675562
966149805023590
990021274119526
271980405503688
331971059028719
119491635631211
927517536747893
921707901510865
892695648871840
369178015355777
501591051296127
152173397915857
965761021224288
677716056914710
932774852580020
170464776993469
601311807580502
648278290841046
610955963807640
114282750300001
247085005445902
547119518890628
595595763420816
890784696035611
148055505434754
408206593045328
889241379067533
590675476903812
186779201617823
416373695358845
803876789502891
800297099797842
182968576591670
655766421135972
122565805782690
100265015601744
768049945369358
934182393951869
730939170244602
387799434744646
735045129577850
444037419250287
574698141867056
612068839000399
132394951282186
440130160018247
698926001400778
565286614167748
766396881422739
397301730788964
441078803174732
503647042514100
659696406137830
410917747975170
630392736524781
952490682263229
112779336938133
568076474912522
524876727771503
593783765300629
156392275878668
427042825494074
674996667700219
973574729287080
956585125728239
739971947063003
435465873413572
319822096460726
837174687334018
402658126799027
486162587526718
640776664007056
869590214435926
845983907346219
446215882213185
610863455444407
853292670515882
859191841079165
427118864079605
676069729307334
859060104927929
391601571561777
214195025932866
215462154207672
973476747565797
330938907161318
725090206054937
583060456517833
408251368601518
296099192386254
798922490755720
399331232974184
631276359263360
659175423529626
817465873147787
508940726889927
993439698570778
239858876382391
344373483470737
916668390452284
141208018148652
142665957345180
742937750332710
537470993248738
847560247931300
222328030677156
331933387734135
924976500458425
466137184227442
662697181986068
932899729092673
870668259545866
159421717050051
678687994692752
839392705558887
626514374382008
954052438364691
471966127517024
336058698023794
383160263436490
519988307659736
143773169535576
935376111354892
365699400664715
571971792469212
668047519658344
166041441840549
719899402600839
341573403689913
251378128169984
825079847882780
379283599436670
513950959072753
867019521526810
181537514690147
464170223834168
838780400268691
144811424371414
259392281572010
512070322466440
228960585415033
524885586824913
840475556237293
256463519577679
430673826497866
677272219391204
779156558328036
590253076709582
930146231553460
136485882541685
320888713971039
780495156362522
959948017987109
219116091010793
214298452732881
873826869889116
667163950734986
660700955971517
599078786049655
840254979575589
654158129329165
643881012388549
496134639087666
828751072285803
319592615182896
874374455544511
197630366089425
947250520476722
804938310998619
871304719905520
499317195225102
990010275777078
131959457153762
914953799930347
924117906745678
477967972954003
805795182157987
790176789929899
406363686483309
888478098520262
364586858676694
842166536114423
770073585372806
225392543558877
629699757093492
465191089700583
817089258837300
756859511652331
155278154859714
543796970033953
991909696981151
730937563379149
624538668517115
761585456493995
655948166307570
277770009630846
911045461135830
219176839010132
693813322364576
204397558908472
642151313297616
291490624588605
781475206766996
626101662648623
708742262963837
233151467962405
782148000137431
470561345436822
896679315698557
906708202472121
759251560388114
514298817489947
890177321305711
769131395412732
389841451741658
746173311167842
506773221830570
674888734740586
669079830234192
773115983369844
942685835356602
777928355722677
642812937914159
892509216201647
677085884887863
113958056485829
722052815402383
383927008250022
305661342998836
592412374209552
805691269760168
407292112694735
224111022689177
300275986499024
937463803245946
861657980853070
513015920880608
247037245374801
275888094942906
148563685108447
929038434476752
186542732052640
524887097634067
987121305280844
105510567114818
136374372334916
675253748440431
549952296027669
213801987217494
687786023725625
404588268181652
393591723488879
727587413625914
644978260071380
674136466518086
535841875062909
385994954021657
748209245595695
837828662189439
812397463241632
224159586512514
132114454418788
783555617625757
974367445465052
522962520904712
421342142014076
985199250936806
380507248062832
277798460860226
843946245969214
908366439951796
748915538980116
362901986672889
408855857136773
912062164451871
267660966852727
806596631221668
512172616579695
787458360989423
470090422230306
930067302096868
297774597702994
972028340324050
951392970198737
985020415558379
584383657166866
235006926034353
342178521125629
688967021236388
571332757899607
635930430040210
492058598280869
796267090751013
339883713021371
190798016597336
571387515152998
723609987896516
522490513031389
478986087758003
816202878038645
786275508502348
616945783635931
255871464017641
465189786213164
444058678221698
239872866570276
743049900783683
884970623043798
378304974933613
332197839553779
544166243993052
675108650119620
639131192621571
854413864348813
608187518068764
763579066973519
264590311049879
993761736003618
882179199220496
614179418855957
997763828793278
224589425564768
585375452663432
619882737511773
195070009032344
789464557836545
768027725568650
681695774909087
893826509176651
662863826777131
533015518814250
589229089578845
152930748622157
597750480709586
126787841928664
218058790826993
556192260291530
394580044460394
243836716882084
406402435364823
168024695255594
946377691848557
534958802752699
230257480958362
190932376827846
290391993198132
661791647047633
615768609013614
998230282399990
464915917675068
517010649395408
830195957766877
876353420529033
423868120426808
428802716586726
186890071927734
231917397294793
864299913532210
770849793014119
400583295179823
342696995704485
242485123318002
914696820640769
369311390770632
391471377968505
248633984147095
320970807602472
464712088917766
489036660202198
218682611116530
205951197828325
980780125432827
190267492026684
385687215331747
777010803870519
646021654387337
143755710025506
648942300667609
980165840541883
425873973135186
613058719017669
836764350702553
608643428479824
583040571595348
259287074529756
649390826721410
567789973444385
571538168728075
556361135633539
424056729695820
840820877743978
161365735476547
997541492127430
127692531525544
121893972533333
819154536792921
656786542482419
944447574139810
641974808972884
235757078816356
123457850423451
861960773203436
760759367577592
306932244811609
460532474980885
782707742858660
491497455792167
858374778836766
917132121226219
125077974965917
575020299127748
336054953673660
418289108899918
227107852561916
998675619307849
479099706948302
918833731541115
616600483296278
788915092574243
376069255778026
318497797046740
160875772865529
821420068421118
550695092333669
287385131718037
913865776412001
596692810619695
811956782574925
931078039069295
509486478159438
711007840206054
251395168896379
340170074162311
388056596004935
814050429987736
703044573153558
743179388395962
488925653978037
797332574465871
741347383456835
384899689451503
266597971300013
332283452635659
244328901837155
420058433212453
159899005504093
868906214769073
395236380386736
940861632021515
330218745162921
810176262988170
528444544297877
469940018683400
270284499842356
176787363552077
435866064532845
536097756269227
376684728224801
324596770716547
603595068483252
593142067510497
110566826192919
925764278863747
496477037047738
914803648899535
183231512006714
946714093321291
733424468101935
976465707419193
868996943707770
236855783669755
506691564682324
356668162651654
341209330657627
709014865645940
416027860218084
571209705877028
101103859894332
187085684054746
202198432208787
783164238128802
178373774472764
951493751914686
338266820943187
266250481365242
821740391456046
877040539746220
851269376649900
104674806192947
648146279683535
390787399204394
992874017857317
172312632920502
682292418764826
753325912287791
868759479252090
568932214827331
501765976420307
634156654354707
413984720524131
160607558499337
825669913570742
732324677920948
843222713777973
297855261538731
920967619880916
358500522142272
308041075518917
553883897178004
163214906566641
