831759630019040
244034001682226
991486749194520
975022175494024
148686103085781
807590601469649
399293764813629
218961235090109
388685183948190
750216851148473
288176665395022
349756861083692
986558470139592
840298798563034
750484262270317
578202386286521
682068475625999
647059227430377
360263642270766
637860319934993
928066915762121
157163512991986
852089922862581
700547441233828
115487976591668
345697565230240
653715160420748
431277727688761
240386300547457
367120867976734
261583812810940
735676746400300
834880151477917
922873671575346
373589379561993
969952827206468
809830168566535
818589068266900
637692756453889
973372190396067
812460218087657
637275889897927
893063072989873
994041370369496
577741783771685
154198312500927
833185161693969
852496223624741
341180766303706
522550119132928
218936070189148
411148994030048
482776634219472
904148671281978
486685116479817
693650138234156
235790818508582
129922260017502
169786113358916
754269921134975
892448462922880
420783349249251
347497821775759
110782693686471
535365074239646
833676323394448
678031523099776
574041174345558
983164027383858
987590522409418
437558257961674
260242592713964
341694116110295
106171250905742
239777390338739
256031270953949
802385655959144
404937436583772
809908737050043
487934463759409
765684105003684
289952811452506
839053158444150
592595757896163
638954091899790
751499885167131
240289952044346
814684175024456
641034836042456
325101987415782
304742708493708
632172554834826
929197727152665
122946732917774
592184074102308
340863749603752
133015367911056
237156633288999
750882653656575
897965444949091
385784943884903
613951888068976
993284936440746
489473239268650
535471803379966
671908768947026
730057274534565
306950976040779
900085619083037
260593775440344
106881124826339
382797731813659
786505453888067
707851545924695
684969222445274
429170807875538
458006361145814
829958831187891
728461412553635
725879058739913
848829694909648
573409524399508
195772691085967
321946504581558
634465416881670
288883821942292
410513464190785
198146851492680
216114514331236
268135212478380
311789590200709
497270545001693
867104828244733
245462012491925
917755578569414
654149299318988
805290008351261
319465986036945
912000503303281
574921706369634
546098642815104
709070458125250
384894985159256
761781304429587
558775091437626
118876875436260
129394445974945
942703800285466
470063511736763
803954787874898
336673105236513
127338919534958
673117272912338
937388647388672
506935021645867
986087121391136
859928535745886
488180244393835
549208137129057
339291740409623
450904783551375
975234050541888
686288270936527
558986088069936
325817140107104
443393061830505
614878992008216
645294632940187
592072850628819
826309644703759
856286087550538
892371596994769
881882869328725
603973576735991
821174828409971
282261853380250
540397371618775
437978571431670
650523756326983
661762741102781
242509303557830
659158025141604
334298624785310
698888458603625
764936087470548
231962059901094
369062674086285
412216786076793
581179213182034
984178683630686
996876453561669
789465064477853
925945035666808
795817977778167
527122474929938
413955826604679
643890322503788
807252672460205
538182940994915
542819339508570
229039185630673
902496521344372
546798807409705
118625170589970
878606288513730
931958386183025
763081749984310
498599433953184
541137909976888
267590123193207
560889354554258
834887474514465
865855162162212
520271684908181
907298296068811
467366033706637
380177546568704
745980783027120
233907627359771
166210165974758
655910911045076
154862916481815
981836368305080
623064200568767
479480091010873
879560348484696
132777136524479
643586357230136
338262118399201
821951779354503
922208468593954
404297411819024
281775424002504
196539679132845
416377426306540
201804746624244
216390599817038
398799723117859
955123273186035
439956486792593
738798530045746
720832269995579
917261174594436
128791112227008
972287134495887
854395240364090
177188850879853
166816230737797
486172057401632
671110375396465
615378012772149
741819314796156
194733094799714
360779774711059
813909655429395
940973601847881
382696851649358
249979856942432
272497091052152
649967435233155
337497916934835
389690763417374
543282708089685
216781356011226
326780559436948
908958694265846
811337055378737
336900449883431
160928392229837
875579946060669
825880670841010
302360617319612
185786307041271
625282629687980
740921293562726
910099869778999
708712196751389
250057583076427
751994399959030
