959836238617733
831759630019040
616156156275466
985085430209688
563166602305517
526936042144809
279974576574131
679969529204562
494159179994522
682068475625999
745987577339058
527683047739692
198382423129077
656549427123716
157163512991986
752246698388577
280055924927541
429839957642591
610175710703800
552505936521060
508672838324666
581355221722821
852496223624741
535598610374717
667778286107387
101771292998341
169786113358916
204155366088579
389580517065868
786810598508049
117742151247832
376578538588888
714836801586420
547853251937914
713597508098271
159753233653430
165052036141176
443900215309681
618376222685320
188857407512400
470806966772471
547077279422960
987178875750189
409164523537128
329273953390438
564974009852743
287117572359841
212700816581985
786505453888067
257033402720019
635604559027577
631505055578708
328695994431769
278195747925250
825732960519841
781910583111469
879223039607470
709070458125250
936550802552459
339861718217071
832793844056725
404828157969523
272404834240883
386132316462099
763690983996836
355169904337559
236568442459711
996179543842390
119495785267494
156263272104598
338638522850080
989870308139380
328606620129992
354940984934249
770865485251054
158344197677449
580643938603541
282261853380250
860271959745009
864891769004906
618982492830840
585474653246963
550145826148524
385188270638857
669002345678061
690399792249717
869030463514335
144837504330231
592612991231489
980825663825141
380570640927105
526473659284012
710384160758508
684286994515093
619966675604228
746971631103715
218550274477530
267059361607807
356246986511810
801667993851355
429405846491355
347034102254166
975958321275466
693234996997040
432922652152801
808375343955058
132273485611135
402792607649146
656275823789687
100280883780727
535871162263890
656087580235744
975166656477055
426499173306205
859466817289986
285581843566717
247598879080500
343073819274106
738723174221527
476483850352637
604159558582280
158386624003902
571674192339967
625958451076306
607728755183831
986558470139592
361767760979162
647059227430377
899567194534932
857148325714852
992104574630259
494283742557049
172766558448913
347928104948229
988151283184906
637692756453889
259865031036007
426838710091770
465942319530528
899998346966086
693650138234156
807289664612991
308031305933529
141822186938307
897118096532288
493060750555842
802385655959144
303285637646277
962055292861846
836041564542358
420881488365513
449751963804229
703169927398594
149093537343009
371386939945413
151218454933799
520955173079240
162151173419845
429983048951557
799071070026209
660845116437940
525163304352713
118246548655840
163757285426096
987216234812612
848144724523335
410513464190785
639161736889718
548473955379316
398076317911839
966160053505228
669480861384967
409732706272798
243516908976752
497783447403756
528239865407496
670772947950095
643879329234254
687773081087654
377305929277769
453017611153592
594826656093613
743970388298344
753970898523931
469883407563392
600901007997862
165106687953400
675891741681439
987604172027344
899188266367089
619175867861506
795759704949879
363269181803710
329272617790132
727604987212883
508290754362359
480049850161916
967100212087726
649796098455633
562844572986191
101965131140194
398723960931249
940390830403966
462927795189193
468746540938136
922208468593954
746285417819999
313849140688619
916094966340030
746001007764118
405238250126807
451487703249113
431858635070866
796412261534252
640952067590988
568286671213422
276609656482553
963063879053951
911183862331229
952504338959979
916959298001420
675021456694150
198282781187565
991486749194520
558952320822719
515910278999512
388685183948190
338260133940776
783374923027717
720600996586509
155798016802812
894498214825282
177374885768869
940762283624720
144719233490934
406933411978713
531939184957166
929154704935301
119707928790729
680040172466519
127867867050799
203863333829728
561790939072065
682819203312513
435182575293232
982858301695496
372986910545900
535648403855276
402421470983614
388194807824823
972849558986900
389714345182816
875940271440658
357319535863264
112028686130659
692390788679222
457850318996419
630550755218442
639266632760960
940519767436570
463009697220542
610787053612511
639781904076437
647769373163161
475094137060856
158139004799168
973106551851703
814101806883284
613784994209322
204992606840080
169945343210277
513233099779636
952443175273399
820800070408028
361652630924603
691378459727991
755679165606558
816148721168496
761830785238550
863609205967776
325226574354241
210400500226513
268307758719750
443606481891361
431448563184047
654149299318988
841355503004418
912000503303281
809088869106070
804900971977007
891860366705304
391216570366228
681967801282610
470063511736763
298072817777853
986087121391136
648737563904876
616196666063099
549208137129057
520907858085786
594055780286367
401276685219163
955262767619732
440585751488724
740096163891281
910769864738644
743428258409112
979980430210608
225357110341470
268217603463029
620159268656520
118625170589970
789068434234984
599384258456696
164609894251990
853970671373161
194951298391365
813906841946966
578862033988622
351784710649146
299051301620381
822973435585521
218789411573502
325302524963170
488216341342829
437807985399426
831794638313153
428999120208579
979949210793559
756747327843097
417703928355747
886542703452113
353171913150889
211742439948487
681209047907598
568136604658797
739566727722685
585600006800029
100970282465990
180772118638729
657208305987942
785152992738117
961805516550103
299874178067381
934604990675292
810979118867686
669102954574675
884188379792773
245026016887040
151942431839381
574830067210033
655307428427069
988493469306802
375476587556773
765648872482143
294888037299192
154198312500927
878344925031981
638982431375666
444979641552298
904148671281978
486685116479817
708010583198980
936970598298318
992042776356011
815046549546630
892376228975242
678031523099776
983028590849429
136384364785077
239777390338739
129584525792145
481687228868193
957007383424937
226330130888395
464812021978344
340863749603752
675618584410364
353941872670707
527010259719022
828066480702102
910254320839193
411490293734505
629293424579463
861917103577198
410285800363767
931385783284835
996903785715342
782183965061734
862030300091324
755692336576370
342064056093762
216918729261647
861122241502764
464289616100385
743397664858833
631084912473002
583919081110791
335178224563383
133590994105805
823790730061333
882049364599098
387477208067250
262994530576611
237745307836646
211571998108342
212180574650290
450904783551375
124289236390063
981326358603225
548298702286748
468197739925015
680663267364063
603973576735991
855308027322451
976674999885485
308577116814747
930045873456531
964706863706538
573282635531593
413955826604679
648711881414850
943675257767701
337692035610616
648928950231901
490619022909990
591613803162368
708758484791385
305880378443396
838747157928172
762478303715436
109874185487779
742844029235328
270409670552822
120811475506064
841929695801183
602590584734364
749660421954665
882781097895715
162849660698327
588830687045119
513860479757252
826039017982985
488751524107441
741079271956295
401599544782770
212289858314098
158078539311970
865667834244570
132390351446789
747236534410368
767064664954132
740148870340914
349756861083692
235200968316854
367120867976734
320757849924829
623270365120375
898400562607592
549598295501037
814130455962047
829793826687218
540262992651419
218936070189148
251928706819407
484826991635453
333057628227853
587731509362812
449868541990260
488981170304783
490217653624706
234639986347546
733092652468964
261092199830147
577897837500347
583960032656177
892397492615091
932920273480333
685298628302759
728037461891188
623982332241754
101619207101329
148564548841004
983075811603717
468562220889623
722977613075985
150640896091517
164000198935863
944225079455400
711037620624878
270496739767759
747111713244669
220374361947777
265927643040193
967164195293185
349946287041731
336385943104941
809070895775686
190451655638359
876238113254519
885202357521359
245462012491925
566179681620134
151278635265019
720164064980747
647086023416189
883665515698882
188261919358250
113956886100249
463091595099763
626489743967944
746700881948804
907168432334621
954950824152526
735945002010871
530781469821994
149290278650686
950889092986747
692675391146957
418568098619020
923850710120615
733927286236546
563030584423256
252166158635896
824773021146007
451839515429424
862044106313704
496210094595686
564391365239334
709983889564707
555496113401586
233907627359771
533891993232450
104597350663261
902189316728917
879560348484696
866582193479370
227046918969667
454777048770107
491186718388899
430171339268922
982721231405921
398799723117859
509876080793237
643353265132776
160184798083378
609310844672447
917261174594436
678054274948421
944464163013656
599227606161983
515484244645960
940973601847881
685142888265279
768040312678258
226682246375967
126941760377679
536490776148977
596812807625309
158393724446389
435409716213668
797407182326384
972802594157323
957926681994128
784189192130619
303221987245196
892049951715079
809830168566535
620619807857128
476076927682320
965290523624736
258602710471514
806183872310816
947265041189104
698030483175362
866626554041624
169935038279581
667141605415191
873591671918478
347497821775759
549820200281944
368149917187198
983164027383858
213300534473907
376759379739374
427132541502253
686764421951257
280854932034333
722179834110223
929197727152665
112288924699977
588979682730510
329534713894971
825712083436704
404216258243259
936948602156673
648609294037803
456862495940569
476435393917404
260593775440344
512759576667353
190195520806811
141174660859275
194961785560009
149347063941986
978820722139192
240089508743534
198276346485776
659746581175580
687849054628635
466028970565648
588870349497716
290729469114618
505718215274915
834243669464430
252683113758746
623951471430160
714928757225335
297072604954741
935936047651421
483166994189070
103948435900261
339291740409623
227248025733802
591728464912916
834714907838583
585296803305479
791037255588891
964859659775877
203135359522851
585564025914345
282110313042966
856874705661777
308486229992404
665903702578565
737176786623624
378451048077932
302968937951741
255606122262859
376945624833542
149204897560919
373177510359067
998711564019690
511674914808393
127758121283987
527811543688457
810876178957727
449767398513831
797876784012607
573793984375949
498317881576672
852459663525216
534942949777138
365825383148006
311231821811674
564381140161504
858915937687643
338262118399201
710026751047873
762286893650992
509182160635250
720832269995579
860772664866436
166816230737797
447054170657065
908958694265846
260920135787640
878155734816853
163037345477332
340936019897612
671865018605642
557944809120552
731943989922567
778066472175469
824248500891693
269520911453470
173082872847597
591761071988494
991917581415865
269828822805636
971817681237708
991474252268484
126821570036412
681990013348396
237217604178555
602563505789633
593871808354024
207072987705524
616761186474416
248813974307252
917204236495316
161098716404260
993157574436190
978097281017661
746507592091035
849465990359866
567699296231880
293397994387848
680709888128503
111028673017652
864157560714919
897965444949091
526827194705708
613796995283250
832058725724177
907061241596837
637044239061360
476577782438611
327666302109151
523506325003264
953602794660483
267771527243171
115091664057661
421813001698989
360606000158904
308923312780926
558775091437626
293114114728008
353387189924366
256604513448426
823616107398633
816060708729732
251451081635849
512061321609389
808137297610413
910367280392669
963264637941131
577801295912501
547573327838606
540397371618775
135951668005161
650523756326983
759805926663574
222948428062965
231990161717767
789465064477853
363389666385708
776605403876442
886508205570462
491062997166482
995995833943375
135655753846701
230009876253461
241253696352248
177971146594839
601176655927586
200259844672855
414138298658018
892695726186622
560889354554258
286863495941357
236981928298918
146886592073529
708565350043597
601560528340364
163907856347467
136160495120319
285934816043680
981836368305080
547422318887387
167722774348757
750830500884490
955123273186035
128791112227008
186579056632736
492005906243282
157088282760830
753266583726985
829712104338581
826929116392314
623843495832734
841359637823445
817833870535068
796963552091580
725289233461242
572848206424517
375140600109762
925771905339349
106978735557687
244034001682226
373554198689257
920021728844209
434916464838271
947689242944088
296174781038476
399733101018753
928066915762121
418858198281361
703661115579807
352761753381585
137023144023264
502992512921619
998048559087662
286453245410671
809334389828843
877622536023355
790226633775849
814728895118762
367827348243026
341180766303706
854778674937827
184281027807908
994127914578393
495156649401538
167131423382968
631801790322930
300177742419946
784989490327101
209384120290006
829390383122530
456848842630043
831173375469977
353467061579756
809392673997545
822681665540591
900123398039224
826869280626571
564914802557810
455266833490398
352030904657474
461980816954238
623836406134009
218685907954952
346048077622377
749557583039135
784172762232609
503277600663776
536309456434646
829958831187891
462377473302365
198146851492680
314591406627712
874896934287870
916417131923511
129394445974945
960933439031953
532102488945946
188071708018081
393818510485286
462999932129822
270810123996950
484167814511844
198495297939464
254486447899438
188998315463520
229931953388147
948291891106346
219770370324303
946041687567671
336058934351926
819197912977640
661762741102781
987965137608935
711842355003525
107709402415359
843856265749659
274561450185774
592279348586955
323897891649422
798073562841647
271789867098857
479234044783001
112398967933716
272017184060168
200012931609418
725860628432932
717183153573272
138150531513465
760785410519383
841676485675004
208767654455295
460949431452384
741819314796156
406551719926242
352057977105094
954736944528836
455178866428400
203587623344957
910056627232279
265114004558003
591211679441355
462040246212462
643868786922508
155126225998731
234691299852272
769042641040724
669501081114783
433212656434574
859151850755670
114263776625630
475461586150969
675000939857396
274602116017502
704928854489707
857388090869533
932207885753092
781516655854782
917835728841461
278492445275590
951945486112586
239484568975601
196495959787807
543845529518695
384007128054937
508784695378007
594195841492079
346140533784740
182759083614108
303958179141439
211027827141287
371735912287372
494280252793334
594231000453842
130812392763976
413023318106769
307876775086832
302743222082099
949397886325029
510263876752018
866928698254419
591562180061303
271860978497265
980401756386719
453505700740273
102010417747526
490945467474928
987948297122071
624143059628203
510071973662650
559490893038928
521209250581966
968407448436274
937388647388672
774898120113086
937519932973486
887953088915650
816872726268665
362022611862416
877944111222054
975234050541888
808051725029529
546875285853746
566903703206554
766178031278138
959021340428307
277989579396957
847591121731301
279297027430141
445303382295554
411756794350939
468827160367267
490067950494880
298084926228598
749748838604154
932216703384991
160686386647209
542819339508570
244968550034935
506050737254440
104402354342935
184466160365430
726661003496904
433492613515238
201800308045864
645689407451050
763138434928520
654676265752606
201837714971154
765743817891019
506153638283930
695027106212785
806312535832644
765184268403988
278946145496838
731804406730398
559148518722622
598591787893313
728953235261552
269003778458908
244391650314474
906861016907452
280144300474186
383148139434237
336347968043531
421042362658104
916694940864361
464355639850910
897401280465546
750216851148473
466969078304012
571382148983288
254174310661291
462896665153993
397614623501907
628601322350510
847175428636813
750873612590273
860774042647665
508809304484556
136664412395964
465841010008504
327449799563659
790680679128900
212182293819825
393053130853331
911771242730540
659992043486332
399498496823081
980708430325810
951267718387738
659289323407638
788477916588223
122946732917774
119906756264442
354172127260952
732057702575534
385784943884903
561502565332780
996696236757825
844612249387741
987458579820525
707851545924695
973866204980097
827582933316545
288883821942292
231875783462833
615059491369382
873154501385865
293052017940591
536847269155565
254873116950129
173663608124449
207276472820136
236906648834010
877786608990510
544342481838043
210713299641310
559808392938569
506908883056173
411125596552563
597868398594795
698126012644763
513275402520295
704502356679140
695287116495569
617675266031937
647950128717511
685958312144421
230490781538729
807252672460205
303039398123742
607977185708580
263407246355071
376834705757317
320895663327740
862474762282882
964977193015813
475880083920464
673912752332260
957601948352666
509027706073427
953879807192318
198198536511467
556788998436208
217216901965436
904708181180649
183683091707217
353406913135102
404297411819024
518225878979562
299006201986686
782908098185483
570914963046095
224242592065690
639474237615391
440120915758603
982878750419563
917605878848641
310992041713367
690132920217028
425117542812763
284162450846959
416504511196780
381254530984943
996254299042048
486647231400291
107492055823874
189194841465819
684300823307571
637860319934993
612785754909716
733862288185605
657253154263461
540302886613382
453753665346934
834880151477917
616912257959785
116943668352816
978322940246630
628161146620014
539072320280618
861585526883627
738973663899639
391259461368527
702028926579340
297289104548045
649754936650641
203945736664866
118846264716821
556584428132699
879790409092651
499757117482095
490263241322934
654021892892865
183136399472211
897927539299552
650714983668137
928138458466169
688492856980788
602757547295740
196181558449517
997809699304227
278631481341393
506702089687322
156808024220673
219845855760650
415091104173705
819062068802983
535940421053163
307607469697620
654695040618899
328852333574579
429976913709601
497270545001693
755452697846697
463589201005560
167936833147784
506935021645867
886382410625875
216829255731801
859928535745886
890270079155782
850637889045053
996061162632537
382156186116807
495851644747277
228697125419227
444701397611793
492935974423097
850858204137216
221864806128724
340933670116601
242705283645241
559040016922971
403584790531859
442376427313676
679885540024591
418967726029051
878606288513730
185929628427167
276869423699670
212289322832614
977705667480748
943170841795467
110013949999041
180729998723884
913920370955555
451957310429817
351695704881576
233938687428163
145377309095717
890878325594571
672354356838233
761190248109978
986597858211616
249979856942432
216454983319238
216781356011226
952670829037142
406394712044773
248299636399670
407483220160728
342386349098088
774291020185229
588228517754014
976971855308458
155836535832797
541939923424627
114398656324980
489757052154990
887199465912009
848945015087495
940149361069176
907091539177933
305942381625652
945283080608699
536704181852689
191071982039556
155247884434656
487591365973564
914642958772186
794314166397956
993168138228194
850079480345433
155092996067350
267053630205377
830561945715699
232289688381449
444591676778662
951615056192856
328869187963000
596023652837594
514379771563951
669207863946576
164758334857212
316150572373464
994897775218408
995963279922598
289952811452506
650940364601687
420164653269728
376595021264340
373015006154376
500506835828691
995280483443780
908944713392080
343318735960034
503546878573514
682497556237307
111970458218838
159836838726937
190955947483017
123746842260246
257934347661697
233702533385123
380936992921820
295584556189796
854043978859239
986132316735229
202517733074432
557935738481999
281864916096930
131769675453339
613425797740157
786929116109815
877162025268029
246146960538487
683919107088668
119769866745277
596062330394765
337255753753914
530577059881250
479056567355325
938930484877994
558986088069936
170172457009830
985866960145591
889454723687760
899528056199883
648796275168721
312599681487731
317270822112680
892371596994769
687118757948586
346761541610817
632415266250239
896019372819257
587722699809599
800608379761107
566070980540935
747194665712622
758171876715452
686071628518918
374998983355340
293767743143655
653026734392255
775279677496440
291978556219132
529789712176901
859464994799726
113069570881331
530324499222516
362209726090744
403743441699506
580278631291038
402654386664189
615265905797992
315142994509825
205554228224973
172037189319719
671365715738667
489983815357282
166171291770924
323663395601894
550036445156177
399293764813629
200202353613375
920156738881882
336464661759465
731819332925183
809405712081922
640190531614825
598960584931284
450151017494706
768594444988651
811582780639467
114508850271247
391753240684893
986587081537145
836675126818308
821039295465908
467490264374227
672282333264561
755284630800384
209469180061571
387764372643384
820344665999515
373693512672731
817798781347407
765952511249054
601984600771224
629066207461172
490684421827671
429288780651464
181743040474073
826958012284187
935211146542865
984862186908857
489473239268650
897918949891716
586172135602881
812284879343753
884008784536549
382693426997134
712572952508254
547583280109194
312935229599102
801771396887449
495163591976463
958597075551178
694222474315575
894709609296288
138967423097247
337048540925424
632278719297221
917305854359590
818389501828458
855386273001886
635961238935356
765462392161381
278036309487619
376022030958879
954407363218728
613755009715779
645294632940187
152584124005846
391139215657534
596496879128642
629398382356564
217858315481749
125382412626100
264757199425635
111812109177839
441148198592323
543960929408723
221645497411869
925945035666808
500921535962841
520381545637178
467944149327743
796817315758026
895132022859449
349827676196056
271259467413530
159935013491242
268934828996769
208917664215905
467366033706637
177464563248857
684969455363878
355689852732207
301037484863427
479480091010873
732864077092718
582382252679888
974579112827469
956981748432179
477062757529526
139960834607429
811788505979176
859409091209828
364194005055786
592815234712008
433568743862612
525107490295967
303890290240828
834855256735732
914273615147255
438070721567965
353907001089877
458041627536439
155154369239352
272963437910926
586179295801914
202936016486301
433904344057395
741594005675237
520215172626708
562384360973133
451401393915138
360980445028473
638938383334649
971289133132125
341694116110295
944866004740963
524978438816047
221664411928148
340496171099793
958909239938639
918895497328442
700500930434378
192172375126946
831261668467825
724561920595455
404967842086757
803126996787946
195358991667609
780862204562374
681686693658470
306960260866507
111689936766723
676050402847396
219892299219982
931889648862201
573409524399508
146007039158073
982034550387742
466492799989893
717395714136512
160517450328421
531293146044292
587057551347523
256564532937480
492297077314831
241238593280100
727063026189957
911649745953243
178932446592742
866070859513982
566795902688320
170068927795109
443393061830505
115058265399664
894940095479756
404957127725327
253148897773048
305215097774992
662597683321793
476026080407367
596961685027594
544168763443059
256948459843114
614622131880587
282199608301012
346700285160051
156370003432475
109200577346608
176176958166494
643890322503788
316170628516773
114290329457282
910685870515300
733390965449010
379012137121033
267590123193207
360160113605769
644402175371487
859183465615073
956921003924000
211035808671322
402850123285048
334001219920601
728044602965569
679870298243875
864268825185649
606939586086691
518098698187802
660254037224202
828867172023378
186872097165940
327219059678327
541872400812473
790955731332863
740852818782137
259946274116606
498557264515325
930867725558331
229232803573528
738048957349199
209128843815208
238302677141781
242694139389868
818070658092891
953449544694022
910818404603425
288044425706764
795630006716663
680246443396252
670107035881721
554887522326543
720809985741598
713281295134685
885949686722422
646242462596122
561043004312858
601867714522110
437278442591178
545391049024658
706592080575798
441783161245729
399039077705934
434566473926028
339083649394688
624613378065883
618401069407357
676996561311092
352715321004921
853499668495215
189777738632499
768066585981503
389752884446769
416018763832230
684969222445274
807277955901653
691186359906652
321198478822586
848199174273868
156358115247536
229783035713565
731898564297109
660990369540087
955044283690858
777262447349211
994967974571047
803001779450854
513352383628547
278463904424088
226153081941278
117772018876260
746141278199060
865263470411385
344067185232039
363154403838194
721776825068847
328961949581039
451882872313531
219530922601789
120057935135555
127304076313866
730373155492021
592072850628819
847298958260561
534156415296947
871681957701657
553072495570993
600070792790512
260041926622930
590601888900973
577512757700228
659158025141604
689486428914070
533220590885828
238869407090525
387617169386992
391861142154737
698390202461225
873802076949022
181119743329976
657945297998688
134292783580065
474286597723493
792552611331213
196855474354184
656046089831525
341068427274210
177411264389612
407392190706817
746587694408788
737837082207084
252399066625659
900495022726653
772388205270625
975142141056944
625157502507879
839686154870969
740921293562726
784682542680410
143867157926688
647590306862556
747922379805273
489424122174278
881221624633399
341957674593225
465682594355533
218961235090109
164762527922829
499169254185001
782781592369738
569129372966636
288272370261738
534752795235103
557632932206335
207610766660736
471393566105241
687073637706220
368055291045352
146887384596571
702019347567803
685591508104878
760499873927014
833185161693969
228708673944766
352235305748630
695997826262769
617827439401958
654133143524311
331494113700012
892448462922880
550976756129630
375296269338273
679120913965268
121211678486784
468039917657466
677870242073085
719787693207547
176790810584756
304742708493708
324714462276276
133015367911056
469937949462947
501088977398595
678608360610038
616965544025117
698930516755990
483990468147848
507374374964347
132978985215555
686913784225926
116850241023360
333475644894775
984070104290456
949083031068687
407557372918729
582472969365448
476827350583054
537847037351776
433157518816867
220153757613505
135949068953118
517488619572390
678901498520221
560509772971624
811591577320081
445402587576993
864329565619363
348246959047034
879998774008448
793820316646656
744877999603553
264396593561166
881280738983956
117812471102772
428048265965266
141264409136814
583044136199139
672997583056081
170082240635134
708557152649089
165354865117873
928231756211519
412216786076793
413215619008742
507137824569940
266820392786612
771396702279560
401485016367106
884034480685680
541137909976888
565840167592352
987666003634780
899985650467022
452748424882613
446070262626819
930615394539417
729499974038566
390250810936667
699827203825311
486172057401632
735850684955826
327718591234998
171171049832294
219119940367959
649285997192702
909593861390038
585001663667206
915265628320737
