641819713964623
864872010868996
970573805079502
961059964633411
769061884654673
301938194464405
909275616047670
611692883340141
432454773714613
157959580152821
358816211314983
251166877033680
721159198859045
432486447802117
648936761008927
998114067092535
930550994173224
467037783817467
606297685777635
108866090115369
373210673601028
612550913556427
508271865266675
789693598060756
366891979613457
445795871980937
717172850404605
940684318996643
174283344679166
638192322555288
492394485703054
891909376106520
485050321469935
991391023768747
791271186857523
758052307529479
730008821368890
236385250795562
126776583501012
372752178894648
213605002321432
337191532609837
493680147648714
642481340975517
518029589415919
110387707625964
919419617587650
559950639661735
205579017599583
600199270732756
161590240398648
750835998391849
268616759549903
657587699274660
922799359325628
104186210875741
392956473600703
873884376826231
824713344782589
761142584287563
149709005054806
946864925207636
883282650462076
238280368381692
274019816394856
415557609442313
858492532661481
644091226804333
530890893878689
632000528528616
452706034217623
324583224397188
239224393931287
930905976126541
351283951543095
909242535348727
884984977590700
545178940850345
103520498223862
782827372780621
321115863834818
389388960270947
808951716521689
567397737452390
670827739202904
312596861899413
217237420722082
298553861272001
151757442146087
675496768939755
289285721141004
428042881429845
566697228059681
371400619608169
285956400749111
312763105416750
546863263513931
946609665706466
943452502277848
927693519983856
363590317840039
726884020614675
992370337116013
305113583692719
456189603385110
941404900346613
117704938700395
311309955068765
806186439308167
864043964773910
339118104166994
302731384684413
142696241185220
108939749767397
160774579337775
677480089420247
239918981394664
461923557405225
100174913839415
901274854871424
570586891573339
871270197167668
460972664212973
482260846530789
432815880533509
759087837043401
482939892875388
154773151781942
830861411551045
958927738350778
839589788885992
441318962876871
936033425913248
335296935227385
906806956942630
338954113670407
602908828563922
634167085308747
880956865974921
940287322366959
781851106962997
512871338045859
160683196850642
447034158596589
858416854878103
180292759971059
493256296692362
842957621660480
418872838284824
462299959576107
218191916735658
645463192477097
660285667846048
270584269520565
502590708335070
126814694159729
934194623361220
106151968589727
382472798790406
803997893380893
967100830961348
626665656420917
326314496258725
717968589307108
533850203269247
510694711757844
967108109711982
532032037124877
463847171845597
759302647866269
321179351761660
908576136751707
558695390252988
252923422304786
771015706284050
608956851535673
277920382996766
227441379887997
713397000803759
374980562637677
794279350626425
739016704628019
783591375460166
299946973923934
645823026259617
301130920739621
828910876566576
113686259703707
497872178264605
312383771972871
515088624312679
158727375937874
282854179279422
469037411037519
597653332601689
748653073859330
455336955491201
625947585831604
390774042572447
817551515350532
626165178756737
169990407290143
811684417327273
326382501038538
307094634150647
630792405877628
595180127562368
923574761934713
789697064085710
601926958281786
939591968856693
122595801936607
638200946978995
942967784104788
646275476790013
150593058507800
584793621069370
175162507649318
772838000174743
580954324208959
597063512329445
712189752048415
557963473698747
923829483285802
430497037066090
785496867608906
952888879565476
192997009201229
157079728875976
669867948508531
669786020547802
412500319742898
117901847433853
918153441555798
239080507149620
694038107106975
469460218326756
979277453348804
706164354828361
928926788865556
213815976636402
292798446255640
257878921454637
233280767081926
972896826234837
559879459188819
894698491520953
578786919246095
153399985532423
702694012599037
322288659320176
251932680485711
239698486508404
935684334731849
501674977331946
578682706736228
671398763073007
447109616852486
971901124221835
922879812804657
634732664310406
674990739901937
484588204713515
670409488486593
933477007687794
373376770754637
175952653861763
601172654834045
751682239844822
440032370131158
188908649883271
399038439347443
662685876299594
315068036527068
447921006126207
693872336236695
977211955353915
351762745811387
802680335072339
103807750162237
898203247384176
177021200005818
607174248929682
766105982672250
730816090274656
428803383042929
782863890975736
446160920262021
376419959081858
443821196805143
927780285675693
446386937367057
320150054403116
100957010874800
718881180959156
721053681313866
591404286332808
414642236075375
227497997295322
173734439702509
450774502720985
892913018333370
428456284251271
372790679145504
106652353418557
330955751706597
474860914883326
855899429261705
134281652985912
235934015294719
619839150046747
693601610500904
762708596059704
301215979945773
907487332614035
671716194710116
843931329784723
777498613058730
454169769351066
620162869539631
727691002531545
541399288905267
289865152718248
234596896097895
722818154207206
754600198398867
689028134262280
956003022194893
235127060011736
254188433362483
715509655604557
404394939120750
601952563373400
971586934732915
500455049422068
666578030204103
514397632097533
807111085166035
457214472076046
140990136439949
990601611925701
274173677981051
515918571475803
780607019832633
121881874362152
113971318802248
810658992707892
602252417854302
599907607762736
162779301635089
634399833594511
902188259788892
115570021498403
364796736934845
814365814452330
562264409068924
230591674639793
874012673981660
845113528527429
451493223402669
317760349907413
380117813083945
742593914948906
475132000082966
805919820833192
770672496098850
843003014946806
169262006802905
788768450518907
631663739229186
998789593530243
872876544277820
407773642422582
720585173512994
770943607476012
518802070518176
698407554890396
967798664440916
827984752873300
381982151664777
369142576075740
255340064074355
907647373101601
722011965000325
831071513530378
904909371020903
769017758279318
952811626277200
660000613408673
321159537255407
942057286156827
391031629461956
305227684822727
309150301860959
258181097674772
470057220224222
735691907410454
606763892496549
515951317711625
626558307221104
796363759741153
686784899476595
580429591250083
653872884350303
234921380723239
562929408473915
895950219160738
253867167695611
601123408957791
689671841080546
800691324657963
779884548373997
137384443030234
377001630259838
556909806809959
901992736902014
168005815057513
623361030102212
258483438838669
128057901274196
228694119336780
629059105399295
557388653300497
785030783052144
564870426704251
192291929381010
761148139823778
140342674943921
480689438530303
104898581441255
962855095209414
281708832569736
314774500885132
339057720500792
547278990571359
364395936151911
498689375707057
529399787995118
603374694481419
203692870283614
700399653774450
230162880022772
956861647050698
297303091292739
733417186178979
154022422204914
514253229335840
251066044114910
680907649397739
986911112846798
499462786655989
200486242505586
183696313961058
140170316395247
684273713577994
251100994497979
980821253401159
361474933731679
633495094126326
416900049186419
768919379537518
965742284053155
347460645789425
805287383083570
877295515653630
305492752206726
848396445179732
911166092622792
627755679970693
158889493965931
413982882796024
594977505554949
230456960999102
118060095333086
860289475380247
799909434018386
115103172012519
659155670909901
596594476589940
298404540583958
939856924959194
655694685323909
680257172762710
118064296147051
655169520310185
715203542555518
248491811922147
866163144473826
299069178765235
455852854646444
306133665103474
194383250861235
770102599834362
381755700320933
579162965998971
906693465892948
808083890313455
299094553824167
360951000961922
941772676445076
649181198930632
171576230800634
102105955403701
459782844940789
606485325139948
301820804557947
874374000811721
274090321063674
983139940611220
971715932384968
900058646177442
718936175182135
935493927154320
169164633495547
821852688022996
173853590557871
471905623234343
197736029480100
342849441450457
713165004769758
864698548141253
535663109783823
123628738634092
159756014263591
753552057356477
712169198686928
451670031070347
583771826613000
979895622608328
665886880556343
774588970216348
404663271710854
725226786608045
759971498873687
859167459937091
903387883808626
807051137689743
771035253290926
975485329295049
489285270347840
423206710683469
224992922206299
901633342122587
505378625751368
347291288805093
362249725124119
355495045343707
818059218193416
851017644787000
777825948799117
238941386600401
908196958541277
642286222941976
665353957845255
821461925528836
243601831857083
374285154390607
783574307164530
385942020880162
869896988525059
415933758198314
254182010224968
732968718919853
106872695426815
555200463012275
249601814497820
225975593049349
550844713383687
508707687702281
413509787142802
193257790181879
321952945418724
557301807281689
360769332837595
483035799129265
927408528189087
491818230380805
188810380977388
507352397596699
480365397356170
762052819615897
719549505388129
454946835012913
709664442926818
443273054119025
216942985262626
375937048527780
552474305852810
768829563966050
969282407619997
584584776840364
319308455336682
413787250207797
780991858600547
906189972636628
247154592304076
990681996009042
378811152796962
815461096113472
301203274104589
302138336825929
718784899157470
129962477074857
231351204649696
384939301761937
655942842957006
656480117680769
955063240132840
568595070584449
647692304606818
922837004874258
340755589645160
989058921162508
598010597476066
775809317026176
487485275302597
967506302513081
159377120411880
939486572035704
176584133069655
469496258111886
639951278108703
559482765105667
549282545795572
128247049942380
972690110423065
701512976767804
530396195314287
880838292449844
436473230000205
970886780196643
115018669696400
195028109709888
235047407040861
412257756067718
170101694725711
326968768487277
129919290135285
247168376241055
427038067284496
353165271183531
502147810840331
962153299165915
154921207763399
712827443885676
526028186968428
164396271986765
718962741237789
453397487747569
953581565834247
919826844956171
633858292620420
149390324982227
360947895455668
490099506203051
387480367311416
241796729499335
151282377679142
641963388447483
570116628512575
295957667638999
671778384386805
132781738400128
755942069207675
160155153644723
692578531620445
360188798304628
618132089489633
107000718433888
824838661869791
293238685460165
763732297950766
916064834969334
136107710688900
835265029823975
248928091704994
992851936288783
669480792468562
919392340753165
999274734040310
142170718526258
446557310136167
856082746691586
207592208699693
419484795898274
848073625249625
976678027678907
112385810875116
255855521557688
412621391485916
771899882738666
173929621951419
364817693045454
496988813296021
953780505563005
179664167415684
495972391598453
551490807840818
439040481681472
848007222925238
415100849167036
315979212058728
684810094106042
603083071226128
223609278415249
395794974715548
701668849842804
426038064248157
796927627094780
844380528944927
137869772093758
359593626279517
893830431817147
299503011449969
489806154862788
963180496716244
229783826209546
206960083610469
975161280087254
772570408302682
705187316508905
826461077549318
704606129645631
776984941512532
429850960063787
655186694174060
262881566820168
985583074082727
627830770802756
138100654804289
767121394965594
568786866827926
563476691756824
870456701375896
783464315578779
627852799647629
466482025394900
367782016733141
447778216938170
736254870040749
184586741010148
925507933767088
382265056428380
961943954160460
513853077014841
110714799074980
540517837853649
198977088126293
511771010677426
148881634191716
207168772918559
232828999994356
551983046313937
169813959635095
169305739438923
366219224750037
443388469773928
215927555775750
116483355654877
294798606002900
243177229463870
197996945867767
223502858419513
655170451931797
336673753600838
258805009009386
942168782563757
285499123119110
299618907150123
585831047322786
887601419805718
602863067136050
286050026354645
536216412207607
512882047060616
183012547028848
229497980537817
508864115289669
478980100573872
958502190626821
153397767098355
339658606187944
620152839664915
156606238513401
409978466573632
756990497516924
983871714650159
688078838610026
907966339270138
388022249964651
366947936999476
586943839799275
373858765763352
481872559004521
596185884636615
696479947399777
625376464925847
354027550946601
880091119562198
474582005429955
728846305539908
630888795596563
550191604125056
183995542133785
247909525227996
973483175835268
892946982220203
251992880380054
800284827805528
598282267663876
668001874371675
848962577373065
612789910740527
440574108228457
729777441450611
233189779127721
618861110348789
333946407561710
151453038211635
123872068226048
523645576481499
703898781336157
263041369466634
373854989660415
618072740943269
618273616882619
690495899066871
973010376098373
417683166647839
174198840050986
116297441564857
527850825124248
731564315074525
218920509056479
366798826344229
358241379844852
984068425883391
167301488477796
125189764187461
482562774327812
849589871071269
740917574837808
307092039485350
466982709154779
964777469711120
106891404030679
755056080195498
295205018884719
122377068613838
715819265377903
675048662328466
