179457061708736
962594277587627
460821293623424
494500869922944
727956715157902
310027801922837
599923797442071
250608028210331
970465216415091
468300569893367
882564290497935
573600446467953
117946144619431
349046805919915
881302442361879
362007312001045
612946559335102
583042838141838
950130906513592
704786988445652
634899736577999
