643868786922508
195707855885181
166171291770924
920156738881882
640767297873152
446914537442629
859151850755670
320757849924829
150508390863613
898400562607592
704928854489707
932207885753092
391753240684893
131065741123575
218936070189148
951945486112586
540317701871089
431930361746979
169786113358916
476115036615248
250286669713102
373693512672731
436750439041384
508784695378007
594195841492079
932094819324093
917810427175493
728037461891188
826958012284187
371735912287372
547077279422960
289174364072362
763009811388541
671908768947026
173020948436127
935049875438619
164000198935863
786505453888067
257033402720019
631505055578708
694125399325352
809070895775686
793394588616209
721384858373313
271860978497265
958597075551178
577150423938077
894709609296288
724860343048325
325266547097736
936550802552459
175644025665013
195953256679847
619849293150615
236568442459711
478219478041168
746700881948804
703941772998744
260041162157516
735951927336692
702051790341474
766178031278138
115784117133708
100879122106072
237939658549172
618982492830840
715849134414472
458966793123340
692675391146957
988863417014887
289086547187833
916166553892255
542819339508570
946365643744192
463100819770864
862044106313704
710384160758508
555496113401586
267059361607807
533891993232450
104597350663261
429405846491355
296665570096186
347034102254166
982721231405921
176850547025487
559148518722622
847201389760044
728953235261552
834702498716670
391293902540609
656275823789687
160928392229837
918041865621951
738723174221527
476483850352637
159024679227960
194954182071542
972802594157323
885728964248926
208928553004528
434698859436485
670959309852277
550192566941897
643871602028990
458041627536439
847175428636813
585714744140281
637692756453889
328921554102721
688700383081590
465942319530528
698030483175362
308031305933529
197895798738703
913251348003899
860697318646053
347497821775759
368149917187198
945803228818036
700500930434378
519951828492098
929197727152665
788477916588223
662477328821126
764263862585303
518264981070839
295792612016928
184392167398169
587467232402677
219892299219982
931889648862201
290729469114618
831195772728856
304026823384301
503039414285998
623951471430160
815859774403901
149756032434473
934925532734012
241238593280100
923074890975348
240119613054837
210713299641310
894940095479756
225055975843281
665903702578565
801856339502202
877180592076456
841120587689895
255606122262859
282199608301012
619175867861506
533149396149991
643890322503788
316170628516773
733390965449010
957707567887797
862474762282882
499821877465214
548586871818710
797876784012607
644402175371487
311231821811674
894053135720442
198198536511467
879043423459626
556788998436208
211035808671322
679870298243875
439956486792593
431858635070866
276609656482553
982878750419563
207373800808110
192238230219743
371860599915636
916959298001420
671865018605642
468072569962605
858881191186720
693398824761969
566331878488571
120474439027840
558952320822719
634679628907468
591850213743097
637860319934993
214202595278169
617983981262597
406933411978713
992847223304698
659774033370367
127867867050799
849685194735599
372986910545900
504516737385927
267681583238008
335936976274922
352773759592233
112028686130659
492198356531523
592784905506327
776086859170469
849465990359866
831940341911984
293397994387848
680709888128503
864157560714919
544921649796888
471202675367164
158139004799168
196181558449517
997809699304227
741491491011111
537168470611744
814101806883284
768066585981503
337381412458928
945372824704877
731898564297109
360606000158904
308923312780926
328852333574579
777262447349211
497270545001693
643191475686243
716400315317662
654149299318988
761781304429587
470063511736763
865263470411385
344067185232039
363154403838194
506935021645867
256604513448426
859928535745886
549208137129057
639984701678419
816060708729732
677044572088315
520907858085786
996061162632537
366120327621507
364577902447898
584034845381016
752758818556180
963264637941131
371748901600214
540397371618775
276559379121993
979980430210608
198780904008346
573377743021839
491062997166482
620159268656520
200966008316524
213872096732810
789068434234984
873802076949022
414138298658018
586064073280579
381892725421460
599384258456696
110013949999041
549399095307646
196207375963745
708565350043597
194951298391365
451957310429817
819117631003961
299051301620381
474286597723493
241030171319263
656046089831525
486608213555823
508901277331230
737837082207084
900495022726653
952670829037142
839031203186296
625157502507879
739566727722685
316927660732557
796963552091580
805936507473082
143867157926688
910099869778999
114398656324980
785152992738117
346765236942273
920021728844209
218961235090109
164762527922829
776037255420131
601150314201761
536704181852689
452110281977324
636403158409456
368055291045352
146887384596571
637275889897927
154198312500927
779864739165755
155092996067350
225837734166129
708010583198980
695997826262769
610452818981070
936970598298318
631801790322930
617827439401958
165061788188836
678031523099776
730032689426439
353467061579756
669207863946576
809392673997545
239777390338739
716299413217834
559493670010974
679700291198372
797800202939066
202046208327432
340863749603752
714873881063903
258692663233209
690940852063434
868674136250885
159836838726937
931385783284835
984070104290456
306300461827657
186875671791505
380936992921820
323180289982953
874896934287870
583919081110791
478201491367539
557935738481999
253093745706788
672759032542223
296171921652254
164786396220409
445402587576993
297398340911388
897180388120236
879998774008448
200800383280153
730708129447072
264396593561166
219770370324303
648796275168721
603973576735991
437978571431670
672997583056081
648711881414850
266820392786612
245497831005429
150299907579591
450901046275938
884034480685680
146872989404428
271789867098857
112398967933716
493365738169661
786857448705795
841929695801183
760785410519383
494598045480553
735850684955826
460949431452384
272497091052152
337497916934835
315142994509825
560956513949271
456281167602420
730500530409328
401599544782770
212289858314098
158078539311970
