775365092521948
892064195812308
620041517869545
700593511260292
418608926600455
106394804706706
448868366471336
410913317045946
677872152237581
435990892495219
985131241902736
555180686185340
273561082727297
207964117677957
408797140673971
724148444447594
613275315841601
746164715201868
178789780143805
995276835026578
327812797331510
409057693411867
950699772489551
707078497116829
748703597349153
383649485882708
102056041576928
864709398957948
705594671871069
790675192568576
102878825716395
167882820688715
976167258475305
778005359568814
852698001123594
668871815009075
870094852598104
561877899736589
602781879679644
422490288811965
143071546466239
134043182945524
345064897234317
204757273333904
628408998930945
130597281888894
816069169964439
785736173366950
615846081352766
126467009930318
498589194603857
210812922221679
229842202112010
106158701967760
383163880124882
736586372870968
112679957600829
113672434032197
921282720580785
992931034402464
323724289945794
313789602334812
859408573067656
414286314910987
418301114928797
878288218288080
679295646577488
538038193105980
285591012137995
871306196515800
609291049310335
760775140335714
616942876322338
404035222496765
793078409980627
585110288517334
319962339874277
988661780603777
432556290145010
298490228248318
943273947631716
322704993352247
491067135873249
307778482615594
412552595066449
562393671138937
256246770195164
216836863222939
361251782886681
808940360881654
221492739401729
597274430386920
516054439871948
188977401047420
120774956184513
325251611563742
642437271947899
674695216899819
804959796266739
613685226736883
286286627927840
169970712890933
859953835856736
705936729414994
373081559573604
541895633923057
775146740045774
319852872721420
960062731295772
172104890729931
612877565521265
394098689573737
879161908822954
124137578737698
739178284250158
918583710683589
399153591732792
182284836135424
511223969218486
952970791338076
975080787039977
459199198892045
729012402012636
348699923743004
192820124528949
292561989635530
508490727073135
873836081000397
187028875975131
243073870841595
233227889118741
972673893470811
368686779951424
582592253147977
430971295916045
836175459345361
967691261617336
458032169758611
570046333093661
960308175875929
819045971900187
842549696914891
424137578413832
476465505092176
915104910310993
409309048884137
428383001467637
247143285168018
463883027293988
591865083632218
669021689804768
808452087478546
984177293446859
544399542090870
366707185091868
783848294366158
550591219163282
280383788229333
360844924090058
888691784911084
281270486408415
597807619913287
169948724388578
283989521755647
827989458767259
658826561073962
969590263356076
896488006484885
615048619596072
943892506434993
130886495384928
187804760778839
277174459431271
734200683860805
200805841063879
872262413103709
235271798818378
833572302057416
732173020793771
348331164664189
806677623576783
267857833610191
459063295695920
938566130693646
320890061354669
289350806963400
646295160342732
326497445064661
643939285692645
728790307760703
756785745560923
166036503801966
856248860345620
680793985713478
994510354805707
561311946070455
846926867890704
501046894940831
539275194982695
658939942842101
105901610919551
509991493642059
710965652279516
625965937541850
830399411677710
244957414827403
593698205235649
991259891413875
824376801298560
506725545981521
231826425275960
277397539812160
986516943548779
737009890315633
152784984554227
493064208482437
262899269731260
892397014754129
216057462699829
570950989974645
446402570939193
247930681352538
851497933038756
274021187765178
630713861968186
372197632383344
603010643717667
342275323677118
946923355802526
177166758567076
345815777764514
144615421015667
227677633026640
648071276637438
591932596972911
185287770214313
347183382109651
200060270174883
606701424218582
772851407194937
391140541457718
260372256986039
689783826572887
180993010116061
534968667675547
814093585278367
652238222672853
853593391767123
314930260366010
910033294846532
639857711865930
219613201797131
557940850834775
830874229671243
661599560834548
168799188710703
757593718852167
586760263692969
597297997149937
518841856876867
606363965022616
309299988518432
921379526972798
124959233570028
164383666151816
944591370179948
295258786415874
352397447248625
554752671684061
878018018500476
776688715979493
960053587846723
628033462085777
105021974317064
576269371420526
403949380498347
833594841730084
503034039528838
499709140791974
423306132030886
456741028980292
790709524613424
295187460083349
916392703867853
666097782120587
590007828772594
459290072695936
826460627397788
213967671269622
973789744964626
168833730335566
637318503866917
101636886539405
160460972538330
722287440311774
863418139807946
964663586485918
954141171996937
433582310248117
327995085892447
535291270815257
707140889670758
598188972013359
852866788969374
642660360885780
772703719984608
570164103521572
954502025302587
318508596084742
612863303757567
953774340308799
241508015784022
522989651512875
612048689244519
428253605843916
838893822197828
254047736686546
484190817699616
589790119124699
970694928108694
285147192726107
409951032907529
953205449471077
124986768743880
716808662039665
483064380720968
605962118420230
840800387873748
219898284743577
276273827479870
138858762199596
458585316099033
337595594731779
932791968561067
938573379940947
461302267048934
692883013818858
732493086853582
590393725334867
491406604464849
820820590550460
284098547193089
327800987667365
505058329572956
168607426217366
321362209857034
100186656018677
375385221270265
854792139470228
121370396404607
935700087730708
777588826016337
315020933195913
716886324613754
343171845165733
654928126710092
242523193917749
414976769423678
476983937527516
675581901419410
819217126470570
727628945989917
155020659697087
169792922118368
686472535854057
550302866409746
579179099259714
294399285107377
816999514655332
523782551290741
362893967685846
608848708635964
293851234622925
635377716327515
324209395399677
599111860082468
116814460221892
722158104387112
661039462447265
998319078975239
662887378895283
186967338615350
398687846072946
812848158199999
402385656261562
847751842209911
409035190642431
190984586684627
534281577390649
924788592613584
513598308452467
582937403795702
856891187521972
586297426254899
928059160971803
544121133160447
752785624895807
913391777418536
848048023812066
986123001625891
340674667035641
847952289296286
568842589238123
308951494066387
860270476890515
995461751982905
737397407292704
744484085947094
374718886566841
616972106188210
757269384223690
365155030931687
507664555437662
666857185836823
550165627763213
244141873275709
330959145345279
188383372197514
823953776429237
480382723243066
401828516333026
265981645972819
214580237423605
512499876646859
218574630499124
402942028807744
146834352554804
900890610405022
146160560989046
458457020590328
397040543500385
923188881634337
234178001006398
441063749530791
815265812313652
913877866306898
652805706543196
474300859807720
882668588894847
308700508223506
963806082179901
415175636168442
283496625306567
201582611160775
364850064408189
332511428967886
273474579615816
363799375799777
358561131271617
646876517685338
992584423722729
574127923182388
428897743752277
123065952807716
912986153678124
194005012122947
338850889502353
501935234311747
884097886708124
214141221984795
949730290799921
999601462215997
844819708193307
640984575382356
498783351575559
315492234513522
223960518152502
908185931493605
706986996616213
873389730645818
738065915146962
978835995491619
593696747923297
967888016980975
654819672712461
198973678664228
400052818219189
931694735940023
228752613049301
707469215283569
115119550014630
973373596648148
746807038352084
589849341121405
817574694659419
319808699250222
215759767790659
600897037822842
308756261682087
650696419613640
569920422280138
414850848434807
148121572384997
827049641550247
137282270220696
589920799046795
501901235413099
316964817660948
882798577369872
434907165206570
826593371074058
154051152219716
526574480310674
632662989555899
949369888118003
875054875076654
693152893790681
684182245700060
966124906183462
916354530445395
980768121595698
623390697441070
383277000405572
692293836606278
733047853084637
681871356646728
667176833353956
316969558134135
488253791007721
381242788077851
586158925570522
654507024725742
883373890940706
412391686238148
163226410351750
872781241989767
945998437233074
556274257949970
902852583326626
849759633744467
860596962654847
616077600449035
366815575732901
272299696754421
365868102507911
430795216342783
632551469224726
688408401878658
520946235265710
143704697675279
136693746741694
565367173987368
870082081014731
129061529826785
454764762502110
188298006164669
133299510144931
182858907418936
652906772992083
710292666969051
911696142754043
162842419468272
355186892394686
535590599904418
874371169520097
811793061099970
677691004854451
614957495119092
696515622633676
106874912855809
136785764500517
253666587539561
461370048082394
609950766750623
577713361301878
912523367368345
400964131944797
865864908920462
921400260839622
190991641728891
756064963783799
910038146357316
957972368305913
207779786251680
499900569803634
539398196115411
160959670924415
726658103971559
415457664552140
435925955126710
325343347335649
946938118498492
932225157590581
301945238768303
760797199326067
491400972391719
220787995256964
139539602264069
982703649685064
681779035878021
626048780917423
194456810764122
955093607523516
542879999535504
749673046792682
564572830001682
573221675440508
586598833287837
236413595121260
404821281632897
397057398773258
978059646994137
163509469114537
790226241080069
649972230745902
270283020594479
284111737088634
690110089087546
984939195463290
672813200774468
461267593855732
434186154725256
200801140843967
842790275137990
254398599454572
696018826790816
111959123952259
209214428791149
208390773141582
398487495894885
512124774983142
587956024926347
329815778981236
461956666512774
107499776732831
231372501324777
863464308255867
102356826560832
171031903135833
611171171117969
392936744687872
286224933208978
820648959351791
186139868168119
195373529867736
371037576944184
269136468431829
927867706158538
338718375539167
370286651475938
497899523002503
288853614519666
864209635605980
158899241397826
407288502027125
745173994577849
865611019366028
762784403771747
199257497347683
193356690755781
414573744580047
107895023283670
595053980974683
191104681824378
795917926329650
825309360787367
232857065885986
269911392616494
468429920322216
424068544808165
950454748884905
394871650240690
277563755999091
931967427782418
757872375144852
820415559233346
753728948765278
809946342040437
426087267549996
884279158588247
808890559361066
796927080161923
363268104057915
547959036976066
316593298735701
421853061835703
566219710373011
457340689592120
907066164477685
775079972481881
470467044527676
337472555680190
891919055172064
367972547707113
235282589667876
526731749416709
464017984390082
410891721461107
998988531948927
752947079905850
460692690956846
579061027010146
312121929141224
395147921026895
213476626694605
275781967490429
437973975167689
756778053180261
632073528562458
400265400797398
254406527032915
712330054464997
808740741258347
370461623583625
258508771693714
214460538095751
489866691336562
689189470189209
724273049440290
313457861307123
707901828652189
614862133690378
323914729737024
745829403755468
949006777038973
123940716172788
456211855617276
611748957083953
131914969497275
339784259613365
161864505991155
433959366613082
267058486408793
496901761086160
402062601298101
272180708377487
315964530707673
750013449692188
997119304704673
923262855268579
554984584026933
597684357931678
926156084074691
731950815326800
485480789244349
927756307529166
507183202208036
626405176661602
581155415645757
632248737179716
564668668987736
775137666631075
817398653243956
291177483094295
293843698120169
666552469246324
815794970941187
247955775013899
102165728749601
783332309061952
207589191235868
122286425303631
612460524094894
552027543005962
122050760139244
390050184724794
392741533509263
467280146290462
978949467855270
907667194030432
285910992307300
208870772252119
355478255176728
366974714766787
208660558176716
732637385916757
712902129806930
387890284793957
722789358814584
387012918656084
779103984029529
504052963417436
893183334996181
756282259454162
549998443262195
155699178314552
484932051785698
346249533151933
872000799108594
348573543686237
139455042270798
834846065537425
741793904577111
874975462843798
285263032765728
415136467138610
403149950733704
446181555994168
511644450745711
478877319905872
179798678898675
658172091773251
270032473415545
213050229345700
936272865995232
596380031974287
560826651641996
249880995944349
837111310289070
855458496317523
162959657465707
762842787624950
898263750253915
238744798726712
591942270479407
640778718264820
664194872555759
922088718321139
914073672382282
245372890339812
143584558689728
187255613632020
211597820067548
632305936655527
992655244938604
877484406886951
219899110970926
954784599885919
272972536621562
326683680440949
980808981068539
953809620468820
563089765190210
926619997754877
553788716342610
382842057912669
395288689014256
751598197551163
685019551916528
767578583445061
943192748286718
881584830804823
187621170561982
168686214037616
484663409098936
487880081208036
432695851100143
653582407359225
330792794298796
271171558742357
298971793854389
663959653284936
298080746877119
228597628879512
987765238620783
962185343129386
736253156685719
717586784373712
766549566951358
916281432544947
340125535209331
416099602164678
737637810973726
