408851475212072
194383250861235
284198015623589
632492999717649
606485325139948
712827443885676
343032821899901
803011157493901
630792405877628
128112886395220
785496867608906
706382603668489
532280259017790
145860736392127
435938687747002
805287383083570
318466846351404
908196958541277
671398763073007
580962669479955
995013920075020
750104603516813
726884020614675
225975593049349
421167601070813
596185884636615
563476691756824
447109616852486
142940963273745
735280517767586
735178028486869
183696313961058
581936708588133
142067953279081
359593626279517
938067894959651
788390065798605
824843657264457
625947585831604
573062459094205
243177229463870
286050026354645
297491087215333
278278007333239
634140298173053
848962577373065
777850064309216
612789910740527
746783329918869
315068036527068
806970084280233
990601611925701
736168592731934
824838661869791
333946407561710
568282158703332
777204722167678
794215990897616
357040078076274
831071513530378
788768450518907
154022422204914
531687057344994
801598943385468
541032233820472
309090705383706
180112476293275
212079417034303
704606129645631
568786866827926
863392836236763
884984977590700
718881180959156
154921207763399
511771010677426
450774502720985
922879812804657
110714799074980
719051762860183
906189972636628
834911384289202
637915882272878
109970684591222
983139940611220
374300253259014
222961793834016
559482765105667
462029613736839
208618887052434
412500319742898
688078838610026
102596066056276
229497980537817
884993733160398
126776583501012
471493293619752
270584269520565
285499123119110
575075998242008
518787524516235
690859302609936
841889103541753
100174913839415
446386937367057
390774042572447
732968718919853
289875448477495
584464327288864
750568261058517
989058921162508
939486572035704
584584776840364
134880525523740
247168376241055
359780673624902
257878921454637
773919437281902
550860986419961
930905976126541
884878444782912
627830770802756
499462786655989
383681061979199
167301488477796
730816090274656
194961954804674
456558529496872
113616022482068
913283036341414
655693448559462
768290804604335
814053781532521
712169198686928
468900778853457
433971679036102
618038071333501
362770425057754
869896988525059
248491811922147
419484795898274
396803124632790
303875879623361
911166092622792
427038067284496
605968143874103
115018669696400
939110010024573
737296879702362
103807750162237
888360349016692
662685876299594
780275342215191
871670119524047
458025298075554
160026823266376
218490253915445
726715440195736
977484732233144
515918571475803
106872695426815
153283688594250
158889493965931
790018831491110
655169520310185
312596861899413
655694685323909
743113418681080
645683705588182
197736029480100
937880904063451
239080507149620
325048396316380
503563306798993
775809317026176
601926958281786
528862319761446
952811626277200
599595805497476
364796736934845
759902936171320
755942069207675
210980687376121
339057720500792
116037741071714
185778094688806
901274854871424
313031596331063
129962477074857
437683722730155
942168782563757
923829483285802
319308455336682
773483511651672
773029874806942
508063333299641
690495899066871
825680360725369
360188798304628
848007222925238
299391660457098
134281652985912
451493223402669
696383488304258
185283987826361
784052413233230
584793621069370
372790679145504
209368830155513
415902876548454
388022249964651
771035253290926
374285154390607
164396271986765
844494259830468
967108109711982
251100994497979
391187409420119
218175589217343
848776515633148
684273713577994
277172758074479
934180627475562
911773815003884
776025622482725
463391779791255
434978176729644
198977088126293
990479840188479
297303091292739
380212647270111
