233786559707462
742172233052890
999278833386196
421303240083693
969873485122876
693287391354872
693960667909582
167401734206344
155077832244598
668502526607451
455065028244140
235958118609312
456937200150409
671056191599496
624812559774954
884154177520023
204603172479738
197376325351385
243573897505426
641785197116953
187206418541796
646474988873180
753390647408474
665900668499652
295877461631679
186079364261044
262297977492489
134887515582062
945689002226760
560293853891682
405168040445380
790197584169930
463450774001696
428568276086816
806003861539833
672980898016913
737049280594435
882698166420081
168819265898712
113961100850105
528008203834549
607251550321860
995882297792774
955189279583960
485376313604114
509077197732787
604920884730681
850766699148444
934874175913851
641180891261774
313976738464518
261853586294238
556144991496918
958151164712722
496040204798619
815271977848941
534304886235661
653718921197819
871650284021511
322154831164035
641702858682240
963276531568907
795740293549580
923990949470187
758776762451063
656407578768146
133468499277943
165292909755391
827875101035804
422846615149507
855790914463832
149134058104820
120717430909817
505959749278248
728850523058773
383118574754828
140684824773069
339847403093878
596991893049485
141807735009702
197811259240738
235606991827421
121930623964458
141005968999696
340689172740087
373550264943627
898957822062898
326050710135610
764998198907989
178277687673019
325886322607035
741173811807633
119152872335782
580379262290209
487821076200650
831308735852833
978666267046563
706350181969881
936282067749634
683955194170878
721857624568827
638401736723305
619157297593897
521408069870085
513028558171595
871294064484321
726930663747288
829031101307760
608029175126341
742942350874830
776391069011853
394696735490033
609714739873529
991215754322544
583753065080024
451508802003205
806223965823648
508506433060779
818498930411348
457887698897756
600783139003171
131752621370719
769048582587432
430464305548127
462200103107534
475687554443752
870280785914157
270307711486220
747973168864437
735773881124409
318158286129153
580143482930700
465746517651772
563037818044622
840052039675768
388190589957621
793708638096605
614812009837580
216253107623075
184777344554098
928930682386003
601584130169586
669963662062611
108046440562524
961813442256150
997847620391295
730338039717435
443556913719878
962213971574907
135797521172677
469176025375519
208693784895426
461889837557663
120710224865980
889835552331888
550275115581542
322044499891108
426292149846431
774166448857179
985110215996051
900053645047678
857945602929705
417961237957612
798052258618412
283851270682993
778946092226073
700211603110183
738866337043614
469575919131051
364877065472224
649294077707784
273393560144733
897886787302852
160009535695895
742836000790732
941954115695960
667197647014064
351162747919495
876860509970260
610860817618534
395283143384807
957866168638755
617831916301430
730846936438275
885112803239026
190009313818502
310829615412460
755493766827438
942099120864271
576165607659160
991473334177770
687956009404639
776834988763112
927038642586106
624585557055081
328698631053299
597081330550148
284695917637282
896254262873317
216598556485953
179805984482532
977678989326734
666163318247827
227837910455717
840782620807375
432595631006944
453571273906110
236150582867515
648275124822046
183557536173750
339162183066217
387913948525450
305112510014088
321127029457972
411923047507237
458842627840122
828676697727921
938863541848904
495960634556186
942802980300796
837816595770549
361180351798656
900797917322819
343076755923074
434963299627613
750061763617387
869282599125914
571053212162661
344159351324018
917786680558592
367030892059834
308605886158644
277198046476001
626832233865747
818178463370415
910229505672015
745716852027964
149821130357017
125101116094177
878007832043088
386941494358522
593807766726999
847050790797677
807060874314127
195824858898046
962965737722308
309951902953594
554274726791983
950860160061267
889095915622739
277259560003889
688076967422125
788155024397204
538240189723623
986887088174704
969851027479438
435753345718440
368818781262160
338250677911298
316750203618586
614067156632105
708830838543521
860065888773641
964815002084146
823810094752056
842504582300554
946280718282557
370111687977462
696990109213406
701700519285492
166697105023741
887961164031049
893220399076254
266083099738139
884180396653956
557030650559329
353379954797289
211905114906672
914304308302469
153383221136987
405184919039315
613875036044926
602590180960427
663189920908781
948284100772081
243929748705800
556919314969652
327690059212908
230683540630721
355879326786128
623852530659438
562891781310738
959866282777837
370952838419886
454894612969435
657147429448959
480154645521910
371152262759779
407212643330806
153171822224983
884033996604741
478772807912710
572980666771673
272069750598990
594132755421587
213704060916282
895771947327777
260407999643320
520463212749277
874036902125559
801913968762135
257696508797980
106181039994080
410770109366292
603937686834036
532272302177446
320779272905249
599659220577052
537018418772449
727871855222975
753925346759094
661167571801569
608275446405823
353777659808845
935089797774454
383173313790953
150250149009550
407845183741566
378070950107318
888708500743747
178811729691933
282177045869630
755190317410780
419880432112378
538770929000098
416008805341459
189934006765568
237780975096546
812982588721514
257391063310273
847857417871690
131721665539774
574709673777430
887618621492324
768820822260996
119950920483507
524685495407964
592119627852312
451881741355825
194764101436354
181383618507133
154391398646666
441866075637463
239047420662034
890394052526649
533031273696227
467978086476147
771572562423972
358877552701791
230494712071973
964862076960516
295462154120539
635700273760522
676125004030281
299959584744700
893069769606543
631497741614695
124828287408378
259966897019193
537069231393834
543401565357239
415889439834966
139179432005827
163763447547888
374588977516519
787752253836607
686016314800212
499707112049581
654181343516337
836161006632578
131073715592131
962785002454384
534950238373441
475771906274227
926954464786884
794238668618890
750413635768157
772782605437985
660284780273965
894861706349731
