372308477365550
119073484842768
600199270732756
482070571854594
910852295641223
606485325139948
626558307221104
128112886395220
785496867608906
706382603668489
995965870953956
294798606002900
780991858600547
995013920075020
977739422635546
630888795596563
726884020614675
545067422220622
953780505563005
924175478655709
173966670299131
359593626279517
475059849266900
117901847433853
788390065798605
769852182371259
715203542555518
991391023768747
154283749139925
366029686806067
746783329918869
926593678548127
571354870124834
788768450518907
969185766051394
531687057344994
801598943385468
151757442146087
212079417034303
463050321351047
516939623126711
556209438929716
718881180959156
703898781336157
491508893840452
153399985532423
640997049976508
906189972636628
222961793834016
102596066056276
412500319742898
801785278334163
689236088158586
471493293619752
151494769683730
235934015294719
927780285675693
923952198270639
887403922741101
567941447957822
705187316508905
134880525523740
431920305747354
923182226518081
257878921454637
859925910940558
742304082216616
763916846485822
550860986419961
315076170187507
718962741237789
790960025997337
711399309152169
287719434728712
468900778853457
776984941512532
433971679036102
618038071333501
541399288905267
605968143874103
757009583388918
737296879702362
772487069898819
322701999799915
160026823266376
662829225937968
129972332205766
217987808978352
478960455250306
276464039556744
271591957387234
720585173512994
218920509056479
158889493965931
790018831491110
203947523224540
299094553824167
885911495365336
344859059230651
325048396316380
650187242344288
241052554853595
608492176068841
986911112846798
107392497432931
759902936171320
990185517245017
185778094688806
634399833594511
235949187400507
942168782563757
152069320258101
953695929256907
963689609511739
773483511651672
773029874806942
601819614481257
262296110132990
210062550591469
771035253290926
836487008681157
908693614848102
104886489696839
955118297449666
132888033003571
917886864459085
391187409420119
847392965410854
781792331996711
884693412624391
684273713577994
934180627475562
900474184566661
692008722292273
434978176729644
