987173772468544
447980600003237
951190325484459
712108391849712
318911608667052
148419200551350
160764796919077
873106611348679
618751288978979
344002511700535
379399131884836
278888297351750
799901619296373
202027993770219
763874234524277
134154583743560
636118051522316
682550184098265
531484999658460
885122736931616
973544407533197
134491377784904
826074344904612
563691678466807
464123487777766
887290593114769
877932113131716
581860388337987
880107637114369
394199277874837
629169451583985
352841314166713
378988501175361
664493828277890
846790785862697
240857142300275
705776271674847
843407321316895
687795040751967
112638647745772
298029594566571
885861196943925
724992223474651
610157923248867
836300425262484
217468024633188
602469655934628
615108488018669
589497140195927
635182588097678
904096918542867
296187822481234
879262085012474
916075556155226
453163867211117
406951075097786
892487780079067
145088804518171
873767307644511
881351203678520
402951502373531
449490830468795
647299094651164
768765031562359
592140642021038
959364822965152
718570949556365
195707835253840
100876488379669
931954056686631
181654479163720
621919573805693
949957539038587
170856589965721
855145308199422
115936959338749
258583100974539
676798836705348
274891371905831
673895931324881
397070704194549
942854049874270
848845978355673
538927533523082
704948362736936
109683772555740
666385883285664
638477337813562
272167966612191
572568164040549
990527644621539
200750912772463
112269138516124
555004948412366
330393612588584
743080181721236
846867513824419
342014011450515
772888781985640
297860825512426
867171535830764
598187748259916
696776113382563
368880381590749
304595372398531
774992865864070
467400711340381
539065567745161
891068552294817
279186152858666
445774805281770
652257253809245
456879229040787
271071725596978
262090210466435
391895715028208
150870709502058
753899499358604
192899735471706
588045950647799
520560128256592
523399602177470
607590857629330
645192005303336
587266684564734
236455877637816
116187746236500
835072972585175
472956916795712
562157507569763
524003373026219
558259201709084
633067024971004
465992195677311
242979954823296
324929894113516
151187882022144
992854911780799
521176677865805
519393181514989
351393908099275
797961503401529
591869256367649
204232011192218
575877395173827
944943294831741
448800827593982
425899359126612
200979495027988
431148706122254
801877252353669
959791362252567
271585359492755
791899632302523
266207954603778
966792816820606
889038688259230
760195553579064
984562951495770
695599282445857
147189578002860
705059021752445
467101128630398
792679877420621
143963909724548
119038925349398
639800655102034
737809270078280
971020606513627
257469389814980
991565999190535
554596466431706
450995983699928
392205799213565
277967068307266
873212922003577
489596347298055
478942022857932
100019986551443
465509667840962
181585785708820
649479177130737
473292118623713
648823539494889
745868166840428
289801194274544
753168672345957
487274044862861
950628482741180
115166750902714
187810582406947
300597415813038
628176709585831
177358742293678
159502851588334
645965425136402
990958704083143
326146246423547
869882297112604
664380258675401
784580913425192
791061818932417
865660149012821
529052652964073
590802026433895
550812896977813
804775889497068
791697590973913
870042079790712
430301284419695
124958918272126
867235641888956
324697132343454
227679197759687
465680851404170
649682497036451
401885860772963
662109662914879
279716731139465
544869552287145
596989828300398
633567322637174
738074149885877
868496504708518
136781154140467
124021656696778
163133871254635
792450663370432
145668536217645
800982818752249
232608562023039
925061259741827
899188080373553
663592837976072
200581186758187
938168655393908
427396909724611
941561876896723
711919487986490
702545446986289
977756275867755
591009603500675
936700936818304
722173197122834
958869391585849
961384995179158
925261792059126
634945781441061
216886713010380
526701149234919
326756659153918
598787135082803
981203800646601
299413136655189
385842463182741
600492125415740
225872754486013
460072279505965
736572942239248
473961672276879
331907786275886
954092999210497
680690576236828
916046522435677
129153078546104
154037295349278
973294989204223
732987552661616
211045203175284
641974912419200
863066697473397
533929180697311
299802109443202
535129033371979
500921650607053
612887365294535
530695542632829
499137234026857
527969578398742
181695834029676
206109036686358
863498918249220
683114113374106
924109324535810
979619401441041
391680733986945
376692411383325
292749059473196
571763066753670
231920789387609
462365129773654
712494075960058
299398442696408
743232599272997
631820146670629
221126578676581
143129887191776
741483189262653
589751629142426
391083899427719
882949661926097
877158436637513
654732354848387
520033831522640
285392885776494
936483863814886
549656052467568
991172539580444
900132359793996
936911947577284
299685488760158
404073739136469
471272660915643
843136868779032
938455050205064
177935548987085
484037373104341
377003825598136
118966128897902
861505465601236
938493559552921
486664065432017
251888765106635
291578947606778
926704973766346
262167105312420
288342976786979
807487961350866
188709582838796
506901006336251
839489836910979
468300569893367
266032497887865
398098938826541
872188790207224
383376612430477
321065786627527
371873761195990
132462269860149
192053507456941
309869966734369
332771565363561
644930959988438
621176011645899
945793336715598
470808699344334
401978304148795
541885058674984
914949624651639
520003905335215
731197684644710
171219001279807
695151217330990
977588964384335
195109695915327
404090534305647
130191849329153
456999451050500
917298705100910
524253450319996
940552278983191
584733338268127
514913809613968
813690013789668
132969657780764
628786589561698
167395173949500
992911405653475
171657566421036
668691861881106
383168078859167
431494634821646
988866855642726
388277957960250
544042737165001
470944418653970
670773872684759
103565579546786
416151736434095
121568630388278
109861517804805
287550591244013
239285980170606
918451479602857
422177355771723
994591923118505
960592739394635
903483833086055
657877193342640
843049311050879
962594277587627
131951644415657
741288624351795
913821050042613
857144230269217
320062958096809
848888242476789
185073520982397
527495596928871
262472275292566
280568027608897
515203082912622
839462830127673
317072024332670
203937669288548
885875892521929
213509102396190
820900817126874
535804618373736
401492160260506
770271360725501
258462516333820
304685019457766
777733420647254
797086848539312
263775486963093
428939471807497
961188890305442
215330704465198
343392907886589
756481618147900
655234594198904
122179402041821
928277618602769
726096842839193
832770040031167
281557789418839
296118135074448
547681521391691
525850303679886
843840611520003
530351164277666
870472522241535
875264649604899
280062413272827
532632041826601
874484488044901
460655974055570
123682801466821
390096605684858
585176715066562
667177784816190
815696182864346
635727686198503
266912192014168
676651312570988
623158354048702
490972722255308
832867431132934
382831873758260
190766717264871
904298029105967
834954806023821
705907481231524
135700826299393
790596682868048
463497803601647
312689820206102
697158606487016
200859945885681
756695539421462
205480257508124
132999169154614
495879603999860
417872914504601
505351685660265
776661869609658
563282806821749
283032573939529
126503033695735
281180617851682
102071279613709
856261801449688
615144186209195
773401125911559
193558297364656
820571560423638
867470836572480
458786800190050
592929787992884
421181942316381
533924879552723
158911286747758
247012903156845
195012811174081
762744008368749
216150503580439
375031154981138
162494753921460
873709272169938
988361976512227
666893995753927
703103566454201
165906093119911
408062541415846
312463720147290
360946897661663
598822503431746
297497101523613
501081327204239
148823851722412
967487159114642
819174622317815
736419073137846
605592568627829
598117003604130
313933945626074
583772820783640
207662181864680
839859613478168
506173344429265
907098881468926
944013697741027
312399873499909
418164857754683
561357523616849
924166579048687
489920671932055
883883992283441
259389005305080
859569045303069
123921403089168
514933006599128
352999803035638
490932014221827
609607473303957
982664561700514
415778950376698
663399666870970
645686421540326
216800209910537
803307304585384
673459950627031
739186574362317
310295011941500
772079711230924
397877875607792
550183735855971
228209103627977
891162889747741
820270627137117
322473050669198
550819988590266
339200928564754
378298597443108
612960995434989
652275165126692
114896085949738
531008269198105
453273750787050
899829691266280
756460245059185
160017585643727
952012057473098
935502268771238
961786195101497
467013810124842
153088663888593
664604090290937
206403303716703
264882799523804
128189408500694
425962936786899
794000589943282
293834942409837
505404030781215
456500246092706
205606650812751
792194014851151
534484595242654
331285866287695
292099574962838
356018845064346
302373252787511
483037048161583
426752359194744
824702978450666
782160640161669
210829125937075
949855985989699
236899966408662
904884906522898
518957627445005
720299896902595
380954571038588
995600887055951
384663124988627
638395832154915
976396576818027
402300514278113
557531105693226
724318249357719
806765322211889
581910849901073
518919648744628
132564504228699
951717356504468
186012113585415
428560338373015
955933555344737
548606912226618
629282237368948
469145870940435
915549502861077
952874479574034
519307025957614
748878297645955
129850561609446
817891355871238
182695968499468
741032187914719
959365487987686
631040233106930
446756803685074
351397938958887
204882940198536
305913418519568
295889276288850
638151353764603
922284626031134
