740170174132093
859706533412079
811787075516217
489844216764365
482749449211810
642437271947899
673784422680305
922088718321139
706986996616213
943273947631716
847751842209911
758674617359541
130592273667942
707140889670758
549998443262195
413023843229729
973373596648148
414976769423678
734593996662663
197188617973644
860596962654847
801019506693095
780590787795481
760848924736993
597858025197302
663959653284936
833594841730084
842821605709107
598758285476698
324204862557648
510966530347157
600897037822842
459199198892045
839461292908501
790709524613424
555612829850018
506725545981521
410891721461107
398487495894885
120774956184513
461370048082394
999886101438976
516248674137314
392936744687872
326497445064661
805113889590945
662887378895283
591932596972911
138212280105247
520946235265710
463386186759994
643939285692645
890852413488499
959278360577474
824376801298560
772851407194937
387890284793957
424950811852343
535590599904418
597807619913287
884097886708124
675871188319479
392601668410612
706171064931486
480382723243066
152878365654672
330959145345279
382050316352066
876695245221209
736586372870968
471181560008009
373365891709034
926619997754877
168833730335566
859953835856736
593396808864903
422879454520321
362893967685846
959060395079635
844819708193307
757593718852167
253797014350750
800701488935534
847675668837337
269136468431829
524244520452797
357198103697945
586297426254899
613685226736883
106394804706706
485480789244349
398687846072946
693835679011968
806980748297367
378497062988291
806677623576783
775365092521948
518841856876867
841871752688373
729358296945606
946253174382471
806807116154080
131914969497275
313457861307123
245876849799050
695095523937546
504500367654767
645388773417730
261879704824938
409671282486505
422490288811965
849759633744467
371037576944184
969590263356076
404035222496765
883373890940706
787523234977210
555378945089683
464017984390082
949066903404937
590169574237050
323580318311538
998319078975239
937419441852841
680414752424645
666552469246324
570950989974645
416099602164678
719589471876099
567273798907315
771604210704884
752465910401653
732637385916757
159113986796839
658417899668680
301017648967366
619298879179671
796927080161923
456211855617276
213050229345700
144297956894634
162959657465707
983978864007268
401501795185837
891919055172064
339784259613365
214141221984795
358561131271617
195373529867736
533134799120293
564668668987736
772769009099847
425226742772181
350474810006589
214580237423605
395147921026895
235271798818378
491067135873249
732173020793771
121370396404607
461302267048934
652361943193089
352397447248625
838893822197828
614957495119092
775079972481881
589910217236262
826506239873856
370286651475938
265981645972819
986516943548779
192820124528949
435819683521968
340674667035641
705870385964799
158969431791938
179798678898675
877795706574164
780485435887839
892064195812308
293843698120169
696018826790816
728790307760703
696515622633676
409309048884137
745173994577849
470467044527676
642323269919283
193356690755781
503034039528838
263585211273425
871306196515800
949730290799921
620041517869545
106158701967760
985131241902736
314382072964063
124879962718591
403949380498347
395951583388402
847691477669602
723481490697218
231826425275960
466030346306439
139455042270798
602781879679644
461267593855732
337256337556222
658172091773251
148121572384997
600287727351849
962185343129386
185287770214313
902852583326626
144615421015667
820820590550460
498783351575559
601024877969740
705936729414994
642407371020847
985034913726371
545750713453857
513598308452467
953238326068338
329057349058190
816999514655332
324209395399677
647399775736847
137282270220696
830874229671243
616077600449035
366974714766787
203274411132482
435925955126710
992198428291365
842175520546818
599111860082468
468429920322216
877484406886951
573831893562385
684249872495480
859597336236825
614520501329859
191280978831203
115119550014630
961880455859889
128797538678368
615048619596072
318508596084742
560826651641996
504052963417436
548283080983703
982775618498848
203495532583592
341561842359099
187028875975131
224129035054945
492847755993505
874975462843798
478877319905872
507061761682314
105021974317064
376483903495129
119276183700244
190957233218488
723111259098171
151806931299192
826460627397788
714957236292549
921282720580785
229842202112010
775146740045774
244957414827403
721017450159619
868160623423752
508700500192576
851497933038756
689189470189209
609950766750623
323038872101701
577713361301878
283496625306567
652906772992083
175463134152957
511644450745711
679295646577488
856248860345620
350741218400811
973809482174873
679585834335334
512499876646859
459290072695936
559962277800166
451970360112334
852698001123594
550126133339307
668371153449531
635377716327515
946938118498492
680557601861515
737293639107340
343171845165733
423149266460793
863964960075175
504275713396050
223960518152502
403149950733704
226882607763507
878018018500476
885687187103137
765953069303563
800887188516660
270032473415545
188383372197514
285859057012395
250820031033668
837170115910102
557285068422863
470701221486163
622000309686320
707078497116829
173489851395042
943990422192586
610819193774439
262899269731260
355186892394686
349460015881535
184757805622798
315788440759497
160882094902528
658826561073962
911396487048648
363268104057915
397831998063721
545696203161179
539843778385748
308700508223506
284098547193089
632961767226633
892397014754129
499900569803634
561877899736589
313161353454897
712902129806930
640312104568512
745472608821061
254047736686546
168799188710703
710292666969051
357390957917943
277174459431271
509901715413075
234081752862973
666097782120587
177166758567076
710965652279516
484092621834465
458457020590328
547291754298600
430971295916045
286286627927840
940262373273087
741889895794642
316969558134135
950699772489551
129061529826785
516054439871948
999782142537930
589920799046795
733254846106408
842549696914891
669151236727247
507915785110164
950454748884905
941792914744582
943892506434993
339251470906150
319808699250222
973789744964626
414850848434807
768861483376583
722287440311774
383582075763692
235282589667876
130863440457829
337472555680190
830399411677710
564572830001682
461956666512774
414573744580047
648071276637438
543839049072651
370461623583625
319852872721420
288988521719317
701860427902612
390050184724794
158899241397826
327995085892447
686396517491061
325251611563742
543304232080828
623390697441070
906508433302057
766069271217510
991027386987048
854792139470228
114621476436151
285263032765728
800497040452436
658939942842101
194456810764122
100186656018677
630713861968186
292561989635530
430178326692865
987765238620783
288853614519666
315492234513522
724273049440290
289624355461251
526693474018703
408797140673971
375385221270265
183788043373632
980768121595698
295258786415874
717586784373712
124137578737698
247955775013899
579698357124367
748703597349153
198068166212432
724970963026808
972673893470811
624574760590969
777777416780256
471944412966167
446181555994168
729012402012636
371192988322495
258508771693714
518016623228329
481887851816610
869108501494215
160054519188847
156181368910293
245372890339812
757490003731266
530345693166274
601260057119248
762784403771747
162842419468272
856863984521921
277563755999091
713219122521861
792039277925640
563089765190210
744810876893467
392010261245414
945067832864227
170322445601980
576269371420526
215041042818887
896555372264558
766549566951358
756785745560923
399153591732792
298971793854389
600282765747715
579061027010146
790217123070603
232907492954207
785365143941997
797057039863782
484932051785698
388943781051678
283939012748009
424003757178117
725963143561760
847952289296286
723758148967176
386288753263100
897957451868686
954502025302587
772145681201603
359291973781887
200801140843967
433582310248117
375740240531695
647624479301541
789289790493358
327800987667365
120120823162117
746807038352084
293781194622661
925602865143704
718799894252546
726244273266934
832083159631076
417456446068061
348192039429461
534354568244901
848048023812066
756778053180261
424068544808165
258459910358559
544047721353012
730494965747077
267857833610191
883175558042784
963806082179901
160688872068273
642660360885780
884279158588247
289170359508831
640984575382356
330792794298796
684182245700060
383787202037890
285910992307300
674285156652231
216057462699829
714290738712978
791843357121841
938566130693646
550109017727269
573221675440508
530033920569169
690892815647551
414286314910987
570046333093661
844799786593336
916480403246490
955093607523516
872680044027165
929280024245143
762842787624950
295187460083349
203222907369348
677691004854451
997119304704673
204757273333904
387012918656084
454812567094950
207964117677957
171031903135833
555180686185340
604376344939541
367261507592858
867814619199000
250050202971534
991950915977046
581452838082157
853288130283565
928228789896981
407412713704144
315964530707673
191201714981093
922189081500514
253666587539561
398771833334480
938573379940947
663400859169406
221492739401729
373531886795843
332511428967886
227672168501836
276782675061698
707298497868381
617183002588149
761230934829461
269911392616494
518799010901896
885387916602737
199257497347683
582937403795702
322704993352247
681779035878021
523782551290741
605693737709393
871580972828405
949006777038973
517696251203009
268257460666643
234926859482921
986123001625891
364850064408189
663196122612667
345815777764514
744484085947094
978835995491619
816407152653310
321362209857034
586598833287837
856891187521972
100511311979523
476983937527516
579179099259714
106874912855809
593696747923297
190576371357280
736857081050439
865611019366028
261691493163394
418301114928797
310172258155886
346281802292870
346249533151933
298085775573243
467280146290462
607870569061679
136845006568179
756282259454162
964061559293079
130886495384928
212748154264483
879186932315129
659707134109369
777588826016337
603010643717667
216836863222939
329815778981236
992212450408796
907066164477685
984177293446859
864709398957948
876044289100825
926009906236685
166036503801966
694685320232607
657391885740379
721355156604171
723174910627496
432556290145010
609291049310335
670087729948632
948590759478962
737637810973726
966259157304506
105278059575518
157687282905058
864209635605980
952970791338076
962967883077035
400964131944797
249880995944349
631916972887182
873389730645818
953205449471077
987847801073018
400052818219189
504654940935055
509163030946948
597274430386920
910033294846532
397040543500385
975061816698484
415457664552140
398877827593572
601956104561510
404999800816497
661039462447265
648864937816558
508490727073135
265365727687682
103299680754940
664194872555759
227677633026640
661599560834548
428253605843916
340118657935888
570164103521572
820648959351791
798037201229915
778215059294900
143704697675279
939439511209120
804959796266739
241492929732726
882876917134205
672813200774468
539870633159265
280383788229333
404821281632897
142331239015680
156933359568065
794857833392883
910038146357316
945998437233074
808890559361066
188298006164669
823953776429237
297660027965170
908185931493605
341993948214808
576595779134696
102056041576928
767980537407558
646295160342732
954141171996937
214460538095751
613275315841601
363799375799777
231372501324777
272180708377487
169948724388578
872000799108594
827049641550247
442761592297813
787763326736776
999887837986399
927756307529166
497899523002503
121198329377865
699153331929494
895023722610721
247809706952831
689783826572887
316593298735701
833100102898463
924788592613584
182427609325216
907238464408477
366815575732901
123940716172788
740589250279046
198916745622827
326683680440949
486461144031246
670394843509765
124959233570028
760775140335714
620934900102749
458032169758611
562393671138937
345108781111444
201582611160775
734470585566502
163226410351750
675581901419410
629590315960500
254406527032915
854826716459991
319962339874277
827989458767259
835979589051737
209214428791149
275781967490429
960308175875929
718957849716857
878288218288080
448868366471336
580358694014270
150873299876457
644235789528408
229902937864379
409951032907529
757269384223690
574390074539502
149823215213583
155699178314552
813670636623187
626048780917423
306403009385918
649972230745902
789069489026087
811393382313723
244141873275709
449302969111849
236160047309278
117432196472999
927882353346088
511611664991395
825309360787367
667176833353956
273474579615816
817878818361902
688408401878658
566219710373011
434907165206570
566372754454611
382842057912669
149021474155017
489173137201099
715767739058674
490769266857766
704603172339599
808940360881654
416275829384321
772703719984608
216954203588394
493064208482437
325343347335649
916783534387558
881575063749027
623999706158611
394098689573737
242002123350821
595053980974683
915104910310993
727831482159202
621638812405933
107895023283670
259397431964842
484190817699616
282182536072494
245789560854798
752947079905850
327812797331510
812848158199999
757872375144852
623866560229073
941919441192669
684012888016316
870094852598104
541873524629502
928864075467300
632305936655527
160959670924415
750013449692188
593698205235649
345064897234317
936293493638498
178726813310379
581155415645757
200575293828888
326770134730149
228752613049301
666857185836823
640778718264820
953809620468820
190984586684627
700350661999320
758597447763083
589189082148794
415136467138610
727368797013534
387879308825627
424483158319951
554984584026933
360209620001071
338718375539167
975080787039977
870786617891777
331939700002442
626941756238710
272897958982424
900890610405022
256867240256272
459286963151425
739339533270921
462684262590127
313789602334812
638594317222851
632073528562458
628943447476183
253834604658946
596493305475230
916281432544947
995461751982905
911041383428729
927119129779332
198158213816707
614862133690378
107151562747092
578182123762406
485420346781433
852111116593741
473954059814954
503385642896754
526731749416709
270899774486341
790437740654920
630965563474855
612877565521265
680793985713478
817398653243956
628033462085777
553788716342610
879161908822954
522989651512875
811793061099970
824894908658177
626405176661602
739133657394056
814093585278367
916883862006216
960062731295772
238826017469345
650696419613640
587956024926347
442133574098072
931694735940023
677872152237581
787198007956138
168686214037616
428897743752277
545497580612638
731950815326800
739024599957658
674695216899819
509991493642059
210812922221679
953774340308799
569920422280138
794998018845690
465700300629817
624884902491619
513050763444181
881584830804823
251063223471817
239832809870016
182220523267929
632257836502593
632662989555899
813602420426733
428798639221837
969864375430785
606363965022616
309739953295952
921379526972798
926156084074691
260080241638391
460692690956846
216999567144807
536078728472917
355788576763228
283989521755647
769285133959300
194005012122947
964155991761906
825140082374744
422968948213508
783287391440474
785736173366950
340125535209331
907667194030432
716886324613754
380950295327796
846062553310071
586882863782162
