748218080771617
413984720524131
996400022956945
456826057984852
331822386861752
764909756861226
998074117051512
892931341893374
304958437798688
593783765300629
300815857148186
575020299127748
795212835169090
547119518890628
324951505172549
950064083539513
