204778611940976
102071279613709
638477337813562
935502268771238
116187746236500
609607473303957
240857142300275
200862428737975
572568164040549
206403303716703
352841314166713
456879229040787
473292118623713
291952721651525
236899966408662
885875892521929
900132359793996
773185448934784
880107637114369
190766717264871
743080181721236
592140642021038
465992195677311
940968814050946
130191849329153
867171535830764
216800209910537
623158354048702
748749645460617
550183735855971
753899499358604
555004948412366
115936959338749
109683772555740
356018845064346
949957539038587
519307025957614
664604090290937
875264649604899
121568630388278
489596347298055
732987552661616
533929180697311
181585785708820
467101128630398
722207296465586
839462830127673
591009603500675
470808699344334
285392885776494
320062958096809
887290593114769
425962936786899
544869552287145
469145870940435
227177810512757
397070704194549
142951340244527
402951502373531
959365487987686
794000589943282
444706815126513
521176677865805
724318249357719
134154583743560
855145308199422
820270627137117
148419200551350
977588964384335
936483863814886
833823160079225
995600887055951
877158436637513
772079711230924
632463948133148
264882799523804
791061818932417
228209103627977
558259201709084
427396909724611
129498760791339
216150503580439
391083899427719
832770040031167
560802921829857
200750912772463
402300514278113
448800827593982
988866855642726
317579973169114
452813484777471
181695834029676
322473050669198
871890849061316
816752666022082
605592568627829
181654479163720
406951075097786
666893995753927
682550184098265
879262085012474
581910849901073
362072365615355
944013697741027
330393612588584
904096918542867
739186574362317
376692411383325
647299094651164
657877193342640
153088663888593
649479177130737
739389067055759
645686421540326
221126578676581
979619401441041
280062413272827
666266002965207
967894858827472
655234594198904
422177355771723
641974912419200
587266684564734
955933555344737
954092999210497
200979495027988
721051738413724
589751629142426
652275165126692
736572942239248
123682801466821
924166579048687
835492656068501
281180617851682
478942022857932
615144186209195
478721570918515
972167506709747
447980600003237
404073739136469
585176715066562
187810582406947
118966128897902
473961672276879
518957627445005
755758786134388
628176709585831
547681521391691
200581186758187
648823539494889
931954056686631
861505465601236
464123487777766
701597346455279
702545446986289
756481618147900
936700936818304
489920671932055
182775791374978
379399131884836
292749059473196
530695542632829
563282806821749
266032497887865
163133871254635
667164198059846
904298029105967
154037295349278
514913809613968
404090534305647
317072024332670
379098725538780
721858301879053
676798836705348
453163867211117
961384995179158
533924879552723
550812896977813
562157507569763
592929787992884
847173939788550
474144454953586
549656052467568
488784143887806
388277957960250
563897691357310
449490830468795
462365129773654
697158606487016
758111321084898
283480510017332
567890670759502
826074344904612
289801194274544
806765322211889
694557989036785
558252365584249
431494634821646
283032573939529
171254571304794
377003825598136
598187748259916
251888765106635
857181531980934
784580913425192
504021427679949
705776266586715
123921403089168
279716731139465
925061259741827
949855985989699
160764796919077
133589280302818
408062541415846
130158218787572
132564504228699
486664065432017
832867431132934
157966696413899
760195553579064
380954571038588
324856322250337
182695968499468
874484488044901
297497101523613
349814681353023
790596682868048
390096605684858
204882940198536
951190325484459
231920789387609
839859613478168
383376612430477
820571560423638
820900817126874
904884906522898
202027993770219
618751288978979
309869966734369
994591923118505
463497803601647
465680851404170
377837786921480
988361976512227
394199277874837
193558297364656
355669918933611
472956916795712
131951644415657
302373252787511
535804618373736
590802026433895
589944740499604
218052319638343
843840611520003
344002511700535
959791362252567
490932014221827
615108488018669
524253450319996
894875318799756
326756659153918
843407321316895
687795040751967
563691678466807
797086848539312
453273750787050
506901006336251
426752359194744
124021656696778
738074149885877
272157356621340
401885860772963
611786522263332
843850639698945
680690576236828
984562951495770
792194014851151
914949624651639
571763066753670
332771565363561
414398035304633
704948362736936
122179402041821
351898741040587
990958704083143
351397938958887
112638647745772
297860825512426
720500742701092
770271360725501
938455050205064
885122736931616
654732354848387
612960995434989
748878297645955
525850303679886
973430306605785
195109695915327
293834942409837
676651312570988
873767307644511
312463720147290
797961503401529
527495596928871
188709582838796
633067024971004
132999169154614
216886713010380
598117003604130
531008269198105
991565999190535
952874479574034
529052652964073
647954859973782
663671250727077
633567322637174
236455877637816
772888781985640
112269138516124
291578947606778
801877252353669
393107930361976
534484595242654
368880381590749
990527644621539
583772820783640
288342976786979
887378050733253
846790785862697
952012057473098
239285980170606
669244625365082
796941601080507
277967068307266
561357523616849
305913418519568
683452548129940
575877395173827
242979954823296
300597415813038
460655974055570
325779744676029
756460245059185
683114113374106
883883992283441
817891355871238
938168655393908
673459950627031
526701149234919
960592739394635
192053507456941
156473501545406
629282237368948
118866366127629
186012113585415
318480351758548
818270267769378
873709272169938
343392907886589
167395173949500
339200928564754
645192005303336
445774805281770
417872914504601
115166750902714
639800655102034
621176011645899
249462014342833
467400711340381
916046522435677
836300425262484
147466180981160
666385883285664
266207954603778
824702978450666
145668536217645
799901619296373
391895715028208
381301037869337
335837051392295
518919648744628
415778950376698
907098881468926
134491377784904
870042079790712
843049311050879
600492125415740
976396576818027
121147165578011
870075180552390
791697590973913
259389005305080
881351203678520
460072279505965
544042737165001
940552278983191
589497140195927
530351164277666
720203699982430
385842463182741
487274044862861
279186152858666
992854911780799
321962379022303
456500246092706
468300569893367
649682497036451
147189578002860
782009424721508
596989828300398
673781240998146
257469389814980
535129033371979
351393908099275
635727686198503
324929894113516
192899735471706
720299896902595
382831873758260
705059021752445
873106611348679
541885058674984
928277618602769
292099574962838
109861517804805
282876932628045
160017585643727
360946897661663
982664561700514
341684010047925
213509102396190
800982818752249
861687930831780
736419073137846
967487159114642
807487961350866
612887365294535
846867513824419
641315515472215
210829125937075
868496504708518
959040691630058
705776271674847
819174622317815
610157923248867
523399602177470
588045950647799
554596466431706
519393181514989
273135588016220
638395832154915
514933006599128
383168078859167
262472275292566
430301284419695
273070615783197
636118051522316
753168672345957
973544407533197
621919573805693
696776113382563
877932113131716
776661869609658
667177784816190
548606912226618
249938510372413
450995983699928
773401125911559
484037373104341
428939471807497
689280929798530
186836425049879
968195248255622
224419486693864
867235641888956
635182588097678
848888242476789
217823481059464
867470836572480
100876488379669
136781154140467
470944418653970
271585359492755
416151736434095
129153078546104
872704031737880
401978304148795
938493559552921
425899359126612
863498918249220
505351685660265
171219001279807
242613685648600
873212922003577
271071725596978
834954806023821
782160640161669
397877875607792
992911405653475
598787135082803
428560338373015
488093726133001
583857375580369
889038688259230
527969578398742
602469655934628
731197684644710
591869256367649
195012811174081
730007860307025
171657566421036
378063983448802
471272660915643
803899892052174
924109324535810
644930959988438
913821050042613
926704973766346
331285866287695
579789133755921
664380258675401
177358742293678
262167105312420
495492116566760
958869391585849
280568027608897
272167966612191
398098938826541
170856589965721
159502851588334
418164857754683
378298597443108
629169451583985
870472522241535
217468024633188
401492160260506
375031154981138
892487780079067
258462516333820
628786589561698
205606650812751
581860388337987
856023991613253
500921650607053
712494075960058
792679877420621
664493828277890
135700826299393
663592837976072
916605992651273
278888297351750
743232599272997
490972722255308
472079930277219
465509667840962
467013810124842
318911608667052
891068552294817
312689820206102
679102960555918
129850561609446
207662181864680
185073520982397
266912192014168
917298705100910
310295011941500
670773872684759
103565579546786
856261801449688
945793336715598
411048117138929
718570949556365
610684319271728
891162889747741
977756275867755
859569045303069
384663124988627
615953060254376
495879603999860
304685019457766
505404030781215
100019986551443
941561876896723
392205799213565
848845978355673
925261792059126
342014011450515
803307304585384
418882082211350
