369955163224721
857046444368476
394838988161757
290463502051503
533092272662994
693287391354872
705784938575913
225775258171387
342208650312395
433059461559148
313459179081971
309480077244214
455065028244140
947965909977664
493815557725315
563038375916070
983257009987303
520801624550120
110690605196794
582831902869458
262604037747876
403384937653650
734394944625019
780998416729586
431951006360793
233185193014340
610667629086718
906677074195563
134887515582062
528891005293342
717115989514187
227817147520796
799307076797986
534569193796132
499198222179187
722014942643456
679356848681229
620930827119206
293078863861099
750361837541120
478119023710132
557206739114969
662121864710203
486645539892902
989704580680596
310674674661735
656066728401235
442144306961483
655994653817026
529987022883920
405948249677678
879958982516587
984832204960514
864685856388967
995882297792774
311456705724077
361000684580497
921673778289025
791876448915786
650669322721904
939094986315038
522180560255007
612227146152725
509077197732787
814413998332379
243729810487249
934874175913851
285616028017974
249290543709194
192011882897359
631920950209256
953798836256929
841085035540160
362881615019558
958494339572677
975329017844574
314068531184787
470584364385644
302892006870591
178469624167045
318957450180620
819283393127593
253291508356672
624399673965508
370763258416947
608877311267490
947069351010577
928300191069488
583596313086868
928897992605804
534474632690489
202936538221840
939879860000278
788962064736467
421590769561524
441975583534610
329110371368600
505959749278248
144017767502476
576078875623496
156691610377354
383118574754828
405562660319663
141807735009702
328779625807678
148773431708849
237764832555561
820606370878088
220959795959310
523803718158546
385949315894523
703561341162532
340689172740087
259887485301368
752516973691821
326050710135610
281395515719826
360287871945371
278693469081483
955880169022537
792974643220766
826832368889116
310688124377612
119152872335782
770697243409021
325608812202056
570498531399691
580379262290209
681857996115307
960677064624518
151022831672337
447934818686869
831308735852833
732803090359711
127912787289146
279592542563715
518689774731324
434037023870888
397418122384577
881132352859576
929666134670385
209478590893607
418899450915348
818478505249295
823699412979534
718647913579189
613908049482923
654763058501749
683749061981992
216033617953714
254689099198981
726930663747288
832492123569720
480561513919529
278518467014034
697185618145822
252899781648503
394282662459045
570478406838525
547959577960182
830093618192204
467002930953182
836391594000877
438822237078702
916864394669195
340913209179801
290517898332641
608041737831783
660152935137449
921304702431623
562670582752639
586281534289135
631964119192249
153695069308156
851058507353893
483368100864981
668508032423218
655559407340046
755439198256985
781333810667619
858186141362852
334669238879993
582933678311785
122685828728148
388190589957621
793708638096605
601584130169586
340561442500878
652297741279777
669963662062611
961813442256150
634916415899346
858734474042514
419159221445238
167237848456462
651906941448997
248086818995659
867014906094771
181159531364400
469176025375519
208693784895426
871817977571074
410961351405624
221052409116818
575876366085794
447227549685890
322584514781062
358255286643673
617483961919827
280113594242393
450300328059469
384032973844702
241773042785507
152291415775219
445941168229141
309084502056170
865496643966413
929782215476557
571877841291715
441759940634838
985696734190424
539843174252360
706839564199993
785961284156689
255837402772704
318579984947867
432399152325581
192794608141561
249679257765035
187827153742091
797698319159939
557182942650138
211702843608878
765154976536672
886131267403718
468179006521439
954389467030247
380208282609958
315598345544906
591720948640747
647271304285728
273393560144733
216015856919016
237204608455060
941954115695960
123493457430178
414199685881454
886273844836600
384763462211958
395283143384807
734810650780547
543392597205677
278042312141411
595499506068754
530981611499617
195275820117798
556542078931239
127580986681136
279203012708157
931664286891046
683412406831309
408324557020146
687956009404639
560487555317885
539975282988915
512088239100684
177496090983915
186030367182839
711374253752746
624585557055081
914051133698912
328698631053299
410301778569278
295868220460733
924762105324047
152394969672851
798974738943677
931469356916828
407187820539421
178039843905293
466957633716757
703956382308724
980108696113498
797494479273849
213840655929660
272166904697618
974299727137039
920027711221045
596051737859412
476537598846450
903105851147068
465160094444908
136009344575389
236785524175322
522923770287699
885608785978758
879391019654989
661089730058480
796019026936600
828911284455335
840003091180977
537878293371979
347621870318635
320390762588727
397188481524906
728081682436236
533514183216799
648275124822046
177914755329988
645987010284120
389785072519796
796095927446294
272673857273763
591264807838258
480265881265584
409182667259579
977089629666359
621504053904835
470954913125427
940277862586683
917786680558592
723757635056022
139709282487793
920628283148389
169883629346976
769848449599213
569939675762639
666159512225602
103036075659866
305092881357468
391939795922735
651661427242402
832916050293667
196522915540228
107845138387982
495296003042945
496725370819331
279504279988211
258582939110144
772794852479001
269119535918985
579198780639547
737506041886769
674282942253937
496089111662444
755387940135038
499960116707236
655482671815959
158173281744778
788155024397204
887068767595839
796939048113158
385861951616931
800335894263080
737101126557911
683298309514861
921678162259570
207284612517734
662061373512399
601812511276709
359973860402647
190410797922973
729774219774726
326590112262607
262881387971755
842999994105480
262038708300901
548947466789905
272148237714693
244187296658939
717385335282028
640557643860380
571403700144152
571988451837831
359492684581479
722948209282609
333710139804001
382474516966537
922792740164366
887383484794039
866109668772128
380108620245394
323088775271659
863340593768713
166697105023741
223911431037598
916070056454309
587806819429291
841173861454852
923802130178992
355668881205534
219878523849730
405184919039315
529604503058717
873707149699455
763595265940503
613875036044926
885583154952618
662571593676905
715677525378451
632582017049269
161569048474400
713463813566925
238995831029977
564880690291669
454894612969435
639675861926960
797843143276323
851877255682441
217862553373850
373338569339689
831651889584943
664048642214132
170780079067207
395794980953913
407212643330806
695053543125673
943118811545538
716075670242244
617300440654615
721681491860896
482972204286203
905694801026726
593898792363419
332501784022199
895771947327777
618362847073747
160103239268536
354283679756996
923968291591742
520463212749277
594461475646945
339392370811637
119494890293771
587890838692673
713238159880926
516937126514524
669456618398400
855597471635038
998909571948310
801913968762135
795121101663620
133164614081565
106690574248074
216393572173850
680776786437813
566862827910106
689680557206629
437191906297677
636044954965737
130183862616097
537018418772449
758202230027877
305951244394195
183180070528968
307243708650548
406709899834623
696077324190096
463818741909865
735153412505886
487884245406540
599717634334199
286275482136837
634488956972406
683773934000793
934962611258844
530702193572153
709357913002674
616674226083703
331394028090522
261695617952064
970598148660574
294760822431267
967171960619498
703534357842832
416008805341459
448560088068044
708102758793972
232185896136787
953270545862705
403063863582014
428054067359966
567873778658522
191598927845127
238999127726073
888382076077667
465866989272674
312394606219698
565003780332372
650867826684603
178877359791251
963128524065780
800172323483684
768820822260996
430875544481663
888357970802887
663174296240430
381188560459653
952090283078885
217682644777897
791032166487904
674196845570438
161080988275109
940702127983549
289397314832873
506380967973103
535844959773974
516169199869316
106362531085274
467978086476147
115744118146858
666363755478426
413049865577037
293057542514751
309017710329488
964862076960516
100265041485404
272597338393112
282323388459532
240667006040437
451661966227066
893069769606543
934102780579128
153016530537087
631497741614695
794062140867760
624165202835770
353275605152723
932411180620283
742494860130018
299598899019896
734899499768556
966426925533077
101062488304370
478773384308876
374588977516519
494498140412728
302208780329287
769189543980758
490223859415781
846877111580705
584613316670917
373498476990991
593287873757736
798926265368000
741657025261844
179898969591889
966064824981563
772782605437985
707051764100406
484949466698363
660284780273965
960697488973158
