407831700379628
671031159853258
590200582004355
159209285169529
936373374839637
612502470513713
397098383037039
491689309435784
116019291120730
262906073887637
133855055832593
150569909321879
218953361743907
901810745414736
869581036590701
774828595182217
564799490505197
330508365660094
559039783499141
308586968815858
489118346799878
