364723627079671
282227484533138
824797871531229
966149805023590
281017010011238
254754444144178
695392294656771
271980405503688
618040177819347
843377858190581
763958480544552
927517536747893
573823401628601
597385162339717
937571274082425
285940025183537
748218080771617
828952704387444
746129508269999
750578763261792
288835402118893
303796485199306
619277255314742
755780445813464
631552307597937
312063095673712
213293209059497
307343205713897
667171455650982
148055505434754
525776169635409
410541265084844
539132932951579
199953825764986
378463881614102
374622140525846
621294485332835
377496233280449
477090727644316
965217035137436
647498308986570
999417357963793
537017161560045
227872391529224
422609375789781
359675056176167
132147380800915
914259905790928
259889227406614
173594289552229
612068839000399
677109334931470
223055242978354
660186177765263
816512087947651
680032438423289
957814901979497
743153308647014
520754124435226
292318433272042
207266439647465
441078803174732
775919394048518
248979235090369
561400440873588
365956953520571
201136550719198
763717333896687
655708457810634
751815861050414
152409877280166
417902858677806
230046146539328
277892559778096
233996932237547
486162587526718
637814908045648
166803560654717
604727571320090
913892535993089
853292670515882
625297539255583
954244001410236
332852656535686
901150029684726
343865501398235
184771333115875
875831904696139
190663544713385
435482127227034
275995974824368
138069716232046
956771834786644
721961510921643
981369386430709
672449155642610
432177379028990
128330824543350
650176405966723
480956604426884
948391606054863
942843616551525
659175423529626
842063846393525
239858876382391
432385989880610
742937750332710
672868567974500
876711414749673
847560247931300
498145950553491
490066746566658
109986721740548
702165360678564
425115578121850
374844968854520
839392705558887
852313739634602
799949842556122
151232093785559
336058698023794
877919474406541
390139682237742
558834095439686
129691784290071
251378128169984
242205793994678
307299952400875
379283599436670
513950959072753
335071200497047
206814449887731
114764218263586
851148101584702
113477203887111
838780400268691
102903842971408
997928976809191
362875004089046
638776981561035
430673826497866
500496421271569
301275820244400
600882686993523
590253076709582
213908068959409
460018854052387
222287886501400
856456311136913
232859851655320
108296539786284
126865837474532
178033082643526
508400432561465
721649693555014
545805866714302
863729499336198
814775544826268
508570331979228
254486628482087
214297831168714
154492966046661
135264075004418
924117906745678
109152850224811
164759885492731
790176789929899
592141473066901
608832413498471
598887074424809
842166536114423
766265476029613
812784203522975
629699757093492
637303448060643
798195938225262
814782553849955
957772968496965
108018383521869
703395548561642
572086920632004
136324823945130
938009317708834
639251801778098
993040344678619
504972862218212
456200624846956
673382608553232
513596672388961
825608237016744
792770621322691
296000376704277
108600064283575
116601562922367
862934455707103
961026673012296
507094943924233
243009169512768
984923285042465
235168658563106
524938483336395
108091911719807
661696825074618
722052815402383
190148978397447
482692422102218
575387590063973
745285650167926
681818034632759
398678126001059
441382319598440
902171927703393
616664662326791
184058785687576
728713251559707
674136466518086
709298918600101
421342142014076
533843083206555
299026282175638
818265075628766
312798181793362
480926858036300
140846027887052
810741084906519
727946461930945
786960583640625
267660966852727
525045264417069
806596631221668
965046402771018
553874577312190
762980060166472
310796348649995
297774597702994
279966386289656
269226226827794
843933343545781
251899586511199
742927039300931
599432102085953
614936209121150
804681060765194
434711279976779
367080299210264
973041969404983
722044127521405
658866641864949
269891841052304
954286688864195
373980949768719
584163041693586
385997904693760
864210230578683
187217906242271
855141748066650
276620573790439
579963290425684
922103898004778
990618251351997
434205974454844
806176748607982
689782329517172
374168719164693
146597566194984
875494916531234
185351431810085
626254388365852
745042653859919
636123431115968
227346702972000
611949909885089
322183551319661
235555002626079
268656167823177
239707437201277
955511330626502
626181513116820
655113257945197
794981249680419
358839677828452
988349476163736
998230282399990
464915917675068
977151074606083
751262370780319
316039325505605
750967454424541
623677899165739
814968310900228
749442332547176
599405666518745
623730154146994
936145619607868
881278636832003
914696820640769
371228443444811
871982493939565
424041552845488
921870267045775
762330643783887
683210346804511
204077938522211
101852196735504
513793112620675
160289657086582
699069449525227
426187016999578
618382395699127
322209009310518
450284667325638
840820877743978
590470927042990
659170339423077
387109994058305
133651028933944
884949880534327
809031049661094
972097124181650
235757078816356
881143197429126
382843200610020
266842203226694
801177088842062
619958035350510
376810837910257
491497455792167
917132121226219
291025619917589
245111714541837
677175965101749
199208751258455
690181722468873
160875772865529
807289750572351
969280563573293
819056103550253
195226975616477
596692810619695
436603172251220
624043308163381
164343855971893
718060508486571
524771907532649
819729747709654
577287069956345
384899689451503
612136865430985
121225062607874
958846420431117
448686688547847
414168215442945
427039902683042
121177786875716
755407186910962
907077439140213
907405781191950
695745016501793
827149490105470
429274903158299
428591310233752
677056439410950
559244120865566
593142067510497
212648414856898
522988765681899
173986588192961
103963861398006
993848600925520
447939031929823
398595795641066
950534134854885
978771455844050
829845738195969
727247668809514
376860107676205
331838342834373
946807475524978
538840048008974
534690475843600
187754134584762
302800195133329
696927561844670
629953258642988
178373774472764
547695859051097
102385521729368
292046003083667
559299805873427
821740391456046
637057671575231
615898398772985
829957220860380
499666414109963
501765976420307
341612633310276
626085320753506
866626935000436
122022915158630
783709568014018
840932233133617
813496041579776
631774821862159
761565515224107
971954372375278
132099397388822
947398592156599
856049470873868
257852276739322
678759016943427
326949085669221
844916062456777
509636375331645
967875632809671
990021274119526
148878612933247
579341774527275
765375148888483
712659558804522
948794343026378
677716056914710
478690332488150
462852414753311
252163163610741
917202934385168
610955963807640
920912448573083
447050446388098
545935910316247
551213282635487
704937575827833
171605563434957
478744888380929
660153101066023
731989145451327
245651626440254
717186311358706
161103068585625
886989470372263
662036935781224
187923550598579
159770165753925
132960000381035
705780459564052
602233899796805
504778371125363
758026791492939
470903077578927
182968576591670
100265015601744
823049672139428
976928303893856
761715786533553
332575373745843
444797817528162
673712915854825
387799434744646
996086010271951
194259691439709
842208987180690
198938073236620
200757188595279
866690429369543
632400715136159
360590111367488
540746241142749
698926001400778
766396881422739
370919789798392
685394088832393
583095820350271
720017690233064
457142295416196
393244260234591
973574729287080
353812888568561
464600118153706
428822934245027
867595032885527
177187682081153
248078730860737
378618206611743
249344653773713
525374743012622
786393277637632
134062778093999
370747938488475
569003060932068
340823986374983
130590892939659
202213265885276
401171693934941
984381955594349
678391812576858
572186249819641
543976059362515
725090206054937
538905792169226
326966143660085
890859117604604
399238807756122
768355446930273
171704626536735
680756082314573
577080371516245
103141978417035
681729668501701
141208018148652
737221328078661
773187976944249
205884843954979
201734542388842
266753108088165
626514374382008
275829871306884
214172291349204
748947152600304
752219198849504
166041441840549
741761298405534
482248768262944
315812295614161
391456680469520
344870168665301
801205328508372
793493932660514
516400221445823
233939413213862
315630652195495
840475556237293
216364817845696
155898416844323
971923784121398
318072521076950
561818869170362
202484679542296
219116091010793
207855648891050
648490504946038
667163950734986
896910042513099
572813115101938
239957486902334
190180730791550
106941754539800
804938310998619
914953799930347
612625629671710
205882524991280
667682748327844
888478098520262
770073585372806
620988387307469
113420772134281
225392543558877
465191089700583
136952821714726
894719626195458
441032990442716
171861624765918
466306778443587
348077075968949
328812184204602
328172361287791
650588919677995
278318642166052
955862270710475
791882437234740
499131958917057
633105697778890
242504997952403
556661082160241
868296932568926
482035234514716
776808493705741
529253611562035
291490624588605
759768916031059
428825595262616
710797265861637
906813728529788
514298817489947
438991313034156
506773221830570
813031027261413
432605936139685
483791444249147
777928355722677
778465762494909
828888458767288
241507675142341
664506812074287
361376563045779
627273850635722
247037245374801
591457634582572
477098496754672
122599138552044
112898282857586
539810663171952
524887097634067
893217425002881
160084732391144
812953915732796
220217273952742
990206682368197
393591723488879
224953191066474
969323812760180
173709223097805
146576525785524
539483747369586
368657774421012
199010878613598
569977528229032
382698224208558
514853535319486
820517003021232
387756782374315
426263570130391
451888020512012
842526081232060
903173867533767
316344556744834
173988461585049
252865295478999
892858742460103
566210511637010
277876607920556
935815585057944
634616524467996
677039359150762
723609987896516
663013061193738
371009039810777
786275508502348
255871464017641
295942533509987
384999769951734
738288841460969
255049888067459
458889241069765
239212030366450
245258034815749
494941865521736
710384150248932
639131192621571
963522369448123
991751143401814
293131685608246
215635473443010
248859231035412
106453729424735
988784687902352
830968816028974
354773933001130
813085211324152
768027725568650
692963323618791
913972145252557
859036490432609
968551676605552
203928097330467
730935839317690
785605527669551
484179221735010
518031480224526
537061911246684
662863826777131
629076029112055
290309185021987
126787841928664
966326601322436
408283149010660
406402435364823
749963314687027
387187067158751
399742276142991
830195957766877
918124017953678
751842341881465
248633984147095
963061040936361
697901955993488
444138650288918
679946879423344
697286814421189
777010803870519
691981464842478
968090076936707
161634247710713
787930489172510
701289636453548
424056729695820
438770032111069
969953598625045
542959832554380
824616290532475
835050624173058
442807386475690
192167873031644
831399704483244
957561712310383
139071741608206
854700842852832
231718628469292
275751636901624
748983559115470
336054953673660
286864257673434
339993997207927
392798403202297
684876973914038
339738076738903
715187705154014
285065288409461
884250135227590
157943576655805
852395060959485
721816689409557
384453674364225
740706509651321
778717095928222
419810019722093
368701302101605
382908157883925
435866064532845
390495626145079
404556683767619
750324080044540
352845363118438
925764278863747
494789221411852
472931515376707
143617398045292
698337277772752
246342282511324
563229085212055
546068400077464
682785884548808
937283181389300
237300321114919
283626768583256
875770614934264
457694984639165
687465776597684
894199693802518
283060897665263
513267511349677
345842216184713
685604102861226
815111024808130
396402099904999
986513994260995
917591682713957
877757518434557
838375387254461
159164854429495
580842895005839
267328543731382
256882520609821
920310283367087
394693714309328
146463705078573
894759232949593
529010211577274
991642062094658
479893746472760
438391631097708
137045575966726
184197650430613
187605693573299
202226964124294
393322068012136
950746642755771
624309357883675
331846692293697
245240746917706
879796329777046
187752733142377
610099758041062
712217225937915
571917921210446
842465098358509
830020684475928
152173397915857
490346532744052
310295203431128
293253007443293
152811955029526
450287202601956
410354671165859
800334845491132
961918702364280
243232676309293
201606229027586
959938801382208
902185498917359
871153195343250
457887623343379
715923451795754
320388071285899
294493953278957
251691503948416
622854287353946
719542842270386
889241379067533
112084991701703
741990427107326
379029206719339
996319491871225
236866420735399
913293197956248
822960465028462
768049945369358
530198594963546
649463071669574
310041120919244
595129966181589
636212014805239
440130160018247
620485304593508
534086834771127
119652466638853
493060720681531
839152501277516
817128186823638
401042847737619
442508364285373
410917747975170
675981271877929
909156817343612
561926586305967
274358147511614
165956874485710
763516848877435
362286300382371
294917947165097
192908611920124
412212524510665
709270368741305
602349137665742
660921941773655
774304420432782
106167414471631
644005973148506
746289848815319
248609967193435
238081013026877
676069729307334
858167180943092
214195025932866
191637279788177
149317320971015
846214142643032
791164915889765
973476747565797
138752088909618
745749626467559
133711832843991
787484505877622
479881190885227
424453302118714
656159856351928
409595436947039
417809484376378
749284449849781
476128563730882
889846425159730
253010111495945
879172120744667
927709482765435
466137184227442
490162117580870
932899729092673
232656280585323
532914738568227
761969047227478
336133161608444
671023567352981
558583251796264
680169454352089
365699400664715
702502016884932
752251261546637
111709970486326
744462436511450
904098635829559
259392281572010
512070322466440
537891457194224
888471023889601
404170906527577
520594992521534
698300880132434
911304018156241
618404340643344
779156558328036
600946352757361
422308341356968
791818332778446
602602432766615
930146231553460
349500021103823
497625419510962
626493026163370
797862537951154
342717568358035
455892290973989
873826869889116
455068096405127
898161414337066
660700955971517
654158129329165
496134639087666
103500451907267
805795182157987
798964128111779
410269276003554
683873008432995
990376397506210
656701771879255
522671393605928
225203918913761
139158624054965
653921005112006
272605960521113
912854280665266
730937563379149
153912926318174
480786377843533
558290988214494
655948166307570
210844051556440
214396771995447
750165872923795
229022567582543
642151313297616
478910276891057
921850847516024
735818954363701
445310570903887
625875814470567
829267361899032
246188548251257
708742262963837
233151467962405
782148000137431
672319176732441
818916631562248
427726870085414
301966246101723
501495170522057
626982832970473
765148436851739
389841451741658
277110412717336
878237036887745
687690049471552
696140397461461
742391448017747
642812937914159
449881175183576
747308696813108
598794828259193
493853571837360
483937233893340
164827831921567
761235101747697
732931807905677
784121172187576
707249597845101
203318619046298
791036987830956
715909145302427
399378343789026
224159586512514
550303015954687
481968172109662
854477101811095
985199250936806
562888958425838
151789008439534
209260441304047
475751067790143
214846785334512
936826109638510
362901986672889
408855857136773
680360642829176
512172616579695
911935261028784
587045896627506
437701148272443
917483528924744
968360118163307
981900912820185
328401730359138
972028340324050
269867251189069
584383657166866
122076453883927
492058598280869
916770788444425
403083915646085
139969803503493
904848069230737
835352522883988
732948523442520
622048910319244
724175325824716
445419573435661
239872866570276
798317120544976
301834788537837
538460856901339
887960655044659
499020506053545
821999693350902
435098485896429
772335007641998
266791159877805
763579066973519
805386413661421
264590311049879
820376690164153
131887693102152
122773024121678
339901505358869
436947005974096
729612427559768
753794715815838
779728208017419
987675041015407
449864845480168
713127868983404
643928038023339
434602971917985
841023640797872
860139619214755
112852709208666
596469347617880
290391993198132
244118091121218
649576485821800
161897072597588
686294259763546
217718993152495
863127466521119
530413493924396
259675452537950
251971642456492
353554158515653
629841844151511
825484055703458
271170096796749
308888404059945
876864391584849
552826107150946
289952959293819
304958437798688
833732868218393
315859940767889
802065627380156
325272034694006
923303237359775
562365247886489
782707742858660
199939765056986
483060226804310
264103556539063
597762147847037
304202528370076
788915092574243
270732977172930
625392051081952
413754532167577
122881613260666
528259541002685
312568665614166
588691808687900
558950711335687
822936971730750
596966937749720
348181741258878
782307032849415
622499796157831
231351979192478
883869472652520
501273006233620
661127947118344
948252911577131
802003058543057
536097756269227
111883252330200
107150957109508
675294975629518
140925762622888
508387247814794
819167884888313
845901844300339
602604852582872
810832316640363
183231512006714
946714093321291
985814139190472
220900682712302
633506146908492
351728961905398
244478999974255
799117536015304
144595022052928
595113373386327
832813662936120
894763337292296
443269801433193
571209705877028
783164238128802
295741110767027
668031724705939
107215541453809
111491823907115
159071782596156
873612006314128
873319382492961
482843517960283
196288255837044
477233072465668
744971692945153
511001533299600
503810377850082
629846128084628
885062596477528
540180207706166
327854798589285
127243509725102
430188240150093
975590557486926
472376748824682
241595928815004
234156665268124
354837446808130
339762503072291
313280925537522
254039530156536
920967619880916
626506657447291
169836518917232
599272260621021
865386940662005
767131044007087
501088507387471
110514644616939
894855601389655
103920637377911
598100690194245
520260271951205
482370482562296
884206603792926
514884274961759
394362988914884
947790465615265
726019200915630
814979103851022
224265477343831
753308161488796
316753891017730
715399741870887
729945957222449
312753656056629
601311807580502
527928384647835
834719777637367
247085005445902
381168536593727
726827192562243
617401162519798
890784696035611
479550935849713
140956164035783
745159197023646
524089620780413
590675476903812
602949720464251
416373695358845
839270028228354
295393446811289
125256545761715
859932347971496
542869595649039
809250577473557
299067336697145
874169410680486
158585812141639
180063931876199
993960479189499
199842618957904
934172848359487
694266883808777
887937869717636
741627317999038
583720848147697
578583499248933
892596007601977
469266075323365
632733450407341
791275353103756
677124108527489
109685685488476
105262381253291
518688761248822
652187681545270
258129922862501
568076474912522
743844709866297
280778172444249
345413131848028
439867786928780
146720226584228
620826999640399
272833072730782
876832105068667
391372335375307
678594009810272
895123810634551
277183049955311
407472451006638
601652408771632
849990371595345
522030978033971
214113118124021
617138715913993
384873267271707
102151055456226
640776664007056
840357660187716
293515774034542
226205747944791
225317583278131
397018004051606
783140457187603
169252311501652
722069588403509
968064247003566
106672445522073
592295822677631
128142059611878
237261677240712
820698751609971
618079478217046
330938907161318
347277373881887
447273039811884
677493043860318
205587736279682
752226985491223
401211986718684
538912160198001
780180291329740
680935521930232
859874881825500
316485470699404
973253339824647
843538532012468
508940726889927
391784231596003
181015685907238
720298277389330
739483194310388
130685171812490
686026228859281
607595357638029
955987698683636
317398580034915
275045870911611
795508842978915
958092574289480
904276545320885
516048147623850
807646185841998
636070039525532
519988307659736
277940048956810
393584247109047
185255062702387
864893047158157
132847611960129
297167628933527
341573403689913
287852958823863
867019521526810
880994555738382
498579954799189
456122649948358
394870988742924
538611150492171
163257890667946
183709829829030
109645320260961
415907170887403
219483110707313
664007557354257
997903658403606
255698969540109
762789194065072
535266884233195
828751072285803
319592615182896
962743716927576
130394352947524
174898685856823
172302631878253
305879469456521
575818371706359
752849565458907
520370695295610
884453499677860
484491576304542
406363686483309
174710267317893
197088515150742
258860767923812
885037585184530
859560666874668
898519252341544
628672080480427
765310325057826
119206371485866
737888573495358
337053229326539
300201603978689
588595849853192
653411881611637
517815824516421
616865273451237
873616589101270
156508904300346
199817022219107
975683321888127
750137727451488
109029036016270
677101566399861
396132533445288
724353877057342
613992387980458
890177321305711
978955186352408
121014958871193
126161918303931
297397499212682
506814272624786
942685835356602
874917935364570
210257960098945
966873660995778
592412374209552
674031173361016
856293071354288
441898196583485
224111022689177
261108769269524
506179372449410
456826057984852
826058848174701
186542732052640
129276219440959
507072647896343
535252782524321
926411441421271
899051045431741
656058479788380
486857196676362
462484534640115
351676597996082
150800274550686
380465519353608
727587413625914
315010959271258
644978260071380
539079903391356
748209245595695
336878274620274
423154897044821
958983773143758
812397463241632
997482704165417
517288271580395
928594804866916
424847392541615
428867120970082
941959818891463
393527062307996
356891085943397
314474583257034
602253521112941
399536865835589
583129815074125
623487899595355
155164462139823
395177647508071
743842666854494
527740938146774
978174177117021
470090422230306
781891744874357
473926898083853
677967466099147
880137848255974
794676312845703
715142272654350
181608733986120
951392970198737
422050647437540
138282615946851
805819359347632
202292427910403
721381369846295
592679805358267
234850430374369
535303912726425
271950539145607
339874047269078
727726226430377
616945783635931
861197567913941
410608328363694
390772129446921
384469330306311
681690370786055
257240911443134
910092344749985
689846766608756
817834334840740
414262271057574
419144954683585
250567377414448
600046677907193
471337638897131
281855567836746
665171099021356
384988114853858
420166825511908
773131203429641
768977612113958
209481085730759
240753196839226
384097845395201
218058790826993
750472927148057
999685269283978
936201861982884
351190446216233
303249277096650
366602204386804
417042080087590
542391174927564
212728172786543
785832088539349
553910543730572
256861885419786
770849793014119
132779268406089
564045936510656
573152809633793
906846996613243
729913237898713
645283685092371
618091725134431
766758265680102
232079873543430
831826110796061
805369924314449
795212835169090
881249327928828
380140210467594
959697022455731
779262996328299
552940032867198
732010282616919
817020203805368
441831270910696
583040571595348
499025023969981
676008387609248
415840612220521
121817399441289
185847587062171
497577803768955
876593002030812
969881730702991
627258849687088
457001159646959
267897702305515
705355547722244
501937037111807
861960773203436
239675729473183
144765090722503
822887818194900
670392869924635
441399439158136
858374778836766
885392200081740
195862806414585
719880690324316
162644331653575
875150438271832
983387542924925
326597781574922
220856048278946
106401400751867
931078039069295
828790421474711
723201632262728
338242544750236
388056596004935
734118543358592
518689108103511
930976406684477
159899005504093
992474276785035
263239922330941
345496670976136
987931937598397
330218745162921
967056194948746
118229176050494
959592680856860
800738913518008
814102936987046
633677949807962
242079353638183
446061222944499
597463723517834
171807746706740
130502268971189
711085963350956
792149690652118
881460201982871
788992158723545
118643324278342
925713098395516
609618875934431
619070575020907
446031510660775
496090888797606
982702905079418
577404756867160
670003076602994
264219627492288
479489067881350
965171694811191
630752457955348
331694391585323
601776633858082
714838048435325
805834289328631
434693312566896
737098443496164
795397324702498
789950563039012
956939403873505
785930001777431
603206299291574
830891624566848
305902777177394
992874017857317
877065574508783
960862736281017
415184584105440
171250742226230
337052836170332
473217489898717
236955021792524
989710961097153
417358599190502
370767230161869
832347339495387
976388560132025
984388218747726
222310640527516
198749661436870
