709594805710298
374844968854520
983802971329219
393591723488879
610099758041062
904276545320885
759174221653534
753878574230435
119491635631211
279948134711949
285940025183537
462036905846186
907983999676326
128565443175081
816967558038138
430043512553876
806596631221668
739706709454554
575020299127748
540396712934125
479550935849713
304012924252389
428017981560530
733698261246409
427829049543171
758026791492939
716309983752877
222287886501400
688967021236388
157943576655805
277397173815405
492058598280869
941858450190554
182968576591670
975065787602165
524771907532649
667163950734986
697486290857681
495798720015929
414168215442945
465189786213164
259889227406614
501273006233620
940861632021515
810176262988170
477967972954003
578583499248933
996400022956945
187971990812072
429274903158299
994464395390385
603595068483252
856496873252418
766396881422739
302793941595856
991909696981151
933914891329087
623152496818583
973574729287080
485119045745894
658988986086624
956585125728239
986577941052135
214909787501445
729612427559768
985857029160343
739971947063003
570010500407427
233040071824787
533015518814250
452860516370679
837174687334018
571209705877028
171793007854561
829267361899032
640776664007056
777943512584259
296000376704277
293515774034542
112910717529371
610863455444407
534958802752699
604032833915455
610172500208389
488853551926161
121014958871193
674888734740586
126161918303931
781058209580346
337022798643406
342696995704485
876578522438860
813250995922363
773115983369844
677085884887863
595491148352733
631276359263360
510493356365584
803183832659745
811931810787371
407292112694735
980780125432827
826058848174701
779262996328299
648176678720946
425873973135186
152863992727336
