657591451221125
679182514035538
187804760778839
137282270220696
896555372264558
745185933004247
699153331929494
899877348575565
652805706543196
954784599885919
880854908145908
298971793854389
949381962896011
316593298735701
229032245422020
716872366884050
581690174289451
614520501329859
196159755247988
427281568015608
107889465174959
381846623507506
271881910903472
343899581652610
414976769423678
326060493830160
326683680440949
745307693203038
997492759318152
670394843509765
760775140335714
131618578943600
134043182945524
547959036976066
163226410351750
675581901419410
826460627397788
459199198892045
775146740045774
683032932932581
410393671983794
597297997149937
508700500192576
258459910358559
850037993549924
424068544808165
352780270558233
930394168015206
911696142754043
949698053132063
961298574473250
832277983231829
538038193105980
286037995867838
512499876646859
523066336230845
684182245700060
939288366696867
293173634144913
539275194982695
668371153449531
542192833522191
817574694659419
946938118498492
665027252375132
737685644601158
354586235576625
905309246374389
567065609594576
586482057286253
830936154753733
222393342513587
192963231314353
685113983029514
814137284730102
736586372870968
677691004854451
472561949252540
471181560008009
808940360881654
370793878303582
252492864061234
329010606942068
109394169877190
270032473415545
216954203588394
454812567094950
709953057862093
171031903135833
526574480310674
547292854451698
250820031033668
581452838082157
437972761565695
975975432327777
445567608444183
766395553387831
206475600735613
974355684304551
779103984029529
269136468431829
623646715941404
716808662039665
221492739401729
303051557564622
832954079424515
812848158199999
782843847723392
293260719239652
126356438820090
896488006484885
134108828453841
735098554309251
668024944812779
268257460666643
303484790494153
412391686238148
909299758060382
215430262827459
625356045296047
892397014754129
561877899736589
729364243102921
590007828772594
168619430626470
883373890940706
727368797013534
338718375539167
246979492644336
111959123952259
382594361947480
435990892495219
146160560989046
998319078975239
607385891045399
609676794472204
364407874867559
613399833494617
192352110507078
215759767790659
524245159800678
916281432544947
155083955950094
173137740317073
578182123762406
284599252372755
475875757616230
659707134109369
856776994174569
373006621955578
301117934864580
876665427447432
603010643717667
503385642896754
127957335341038
450396608132980
960053587846723
426495916920232
329815778981236
214141221984795
144297956894634
162959657465707
552027543005962
460958196457238
480699078428407
319808699250222
564668668987736
328772422889704
396807483636094
625394448326423
564572830001682
605962118420230
811793061099970
814093585278367
105634096816563
615955931711824
950279946493103
937473527315734
423867927134446
168187496996773
544033085841100
625965937541850
986516943548779
986516010029012
726967684314266
545497580612638
352773416067367
365155030931687
158969431791938
340674667035641
355377888726494
695049830897481
953205449471077
100186656018677
400052818219189
582385747891946
877795706574164
696515622633676
234691001844353
298936037785459
714687154455340
378014657463751
793850982029065
916392703867853
547287417933895
940911764534592
935282732515796
632662989555899
637318503866917
225383440763740
205881423670848
820648959351791
798037201229915
291201206021005
231826425275960
352963422146635
478757613048095
461267593855732
361875021241722
280383788229333
829497805130835
908185931493605
102056041576928
277563755999091
426121174447865
412475712242811
785736173366950
215874428311964
277397539812160
126467009930318
605959650587771
411774927366270
272180708377487
231372501324777
990882600750755
778568156058455
576269371420526
