{
	"dataconfig": {
		"datasets": [
			{
				"name": "data001",
				"title": "Images 150x150 RGB",
				"width": 150,
				"height": 150,
				"type": "RGB",
				"force": "no"
			},
			{
				"name": "data002",
				"title": "Images 299x299 RGB",
				"width": 299,
				"height": 299,
				"type": "RGB",
				"force": "no"
			}
		]
	}
}