.---. .-..-. .--.       .-. .-----..---.        .--.  .--. .---. .-..-..-. .--.  .--. 
: .  :: :: :: .--'      : : `-. .-': .; :      : .--': .--': .; :: :: :: :: .--': .--'
: :: :: :: :: `;  _____ : :   : :  :   .' _____`. `. : `;  :   .': :: :: :: :   : `;  
: :; :: :; :: :__:_____:: :__ : :  : :.`.:_____:_`, :: :__ : :.`.: `' ;: :: :__ : :__ 
:___.'`.__.'`.__.'      :___.':_;  :_;:_;      `.__.'`.__.':_;:_; `.,' :_;`.__.'`.__.'
                                                                                      
                                                                                      