{
    "level": 1, 
    "cost": 0, 
    "children": [
        {
            "level": 0, 
            "cost": 187, 
            "children": [], 
            "id": 4, 
            "period": 250
        }, 
        {
            "level": 0, 
            "cost": 311, 
            "children": [], 
            "id": 1, 
            "period": 1400
        }, 
        {
            "level": 0, 
            "cost": 209, 
            "children": [], 
            "id": 0, 
            "period": 7000
        }, 
        {
            "level": 0, 
            "cost": 0, 
            "children": [], 
            "id": 3, 
            "period": 3500
        }, 
        {
            "level": 0, 
            "cost": 0, 
            "children": [], 
            "id": 2, 
            "period": 7000
        }
    ], 
    "id": 5, 
    "period": 1
}