{
    "level": 1, 
    "cost": 0, 
    "children": [
        {
            "level": 0, 
            "cost": 59, 
            "children": [], 
            "id": 3, 
            "period": 125
        }, 
        {
            "level": 0, 
            "cost": 188, 
            "children": [], 
            "id": 1, 
            "period": 525
        }, 
        {
            "level": 0, 
            "cost": 446, 
            "children": [], 
            "id": 2, 
            "period": 2625
        }, 
        {
            "level": 0, 
            "cost": 0, 
            "children": [], 
            "id": 4, 
            "period": 5250
        }, 
        {
            "level": 0, 
            "cost": 0, 
            "children": [], 
            "id": 0, 
            "period": 14000
        }
    ], 
    "id": 5, 
    "period": 1
}