{
    "level": 2, 
    "cost": 0, 
    "children": [
        {
            "level": 1, 
            "cost": 149, 
            "children": [
                {
                    "level": 0, 
                    "cost": 151, 
                    "children": [], 
                    "id": 3, 
                    "period": 300
                }, 
                {
                    "level": 0, 
                    "cost": 0, 
                    "children": [], 
                    "id": 4, 
                    "period": 25
                }, 
                {
                    "level": 0, 
                    "cost": 0, 
                    "children": [], 
                    "id": 0, 
                    "period": 200
                }
            ], 
            "id": 7, 
            "period": 300
        }, 
        {
            "level": 1, 
            "cost": 181, 
            "children": [
                {
                    "level": 0, 
                    "cost": 319, 
                    "children": [], 
                    "id": 5, 
                    "period": 500
                }
            ], 
            "id": 6, 
            "period": 500
        }, 
        {
            "level": 1, 
            "cost": 53, 
            "children": [
                {
                    "level": 0, 
                    "cost": 47, 
                    "children": [], 
                    "id": 1, 
                    "period": 100
                }, 
                {
                    "level": 0, 
                    "cost": 583, 
                    "children": [], 
                    "id": 2, 
                    "period": 1500
                }
            ], 
            "id": 8, 
            "period": 375
        }
    ], 
    "id": 9, 
    "period": 1
}