{
    "level": 1, 
    "cost": 0, 
    "children": [
        {
            "level": 0, 
            "cost": 127, 
            "children": [], 
            "id": 4, 
            "period": 200
        }, 
        {
            "level": 0, 
            "cost": 73, 
            "children": [], 
            "id": 2, 
            "period": 200
        }, 
        {
            "level": 0, 
            "cost": 0, 
            "children": [], 
            "id": 1, 
            "period": 375
        }, 
        {
            "level": 0, 
            "cost": 0, 
            "children": [], 
            "id": 0, 
            "period": 3000
        }, 
        {
            "level": 0, 
            "cost": 0, 
            "children": [], 
            "id": 3, 
            "period": 700
        }
    ], 
    "id": 5, 
    "period": 1
}