{
    "level": 1, 
    "cost": 0, 
    "children": [
        {
            "level": 0, 
            "cost": 411, 
            "children": [], 
            "id": 3, 
            "period": 700
        }, 
        {
            "level": 0, 
            "cost": 47, 
            "children": [], 
            "id": 1, 
            "period": 150
        }, 
        {
            "level": 0, 
            "cost": 209, 
            "children": [], 
            "id": 2, 
            "period": 2100
        }, 
        {
            "level": 0, 
            "cost": 0, 
            "children": [], 
            "id": 0, 
            "period": 1500
        }, 
        {
            "level": 0, 
            "cost": 0, 
            "children": [], 
            "id": 4, 
            "period": 3500
        }
    ], 
    "id": 5, 
    "period": 1
}