{
    "level": 2, 
    "cost": 0, 
    "children": [
        {
            "level": 1, 
            "cost": 403, 
            "children": [
                {
                    "level": 0, 
                    "cost": 38, 
                    "children": [], 
                    "id": 4, 
                    "period": 75
                }, 
                {
                    "level": 0, 
                    "cost": 271, 
                    "children": [], 
                    "id": 2, 
                    "period": 3000
                }, 
                {
                    "level": 0, 
                    "cost": 0, 
                    "children": [], 
                    "id": 0, 
                    "period": 1200
                }
            ], 
            "id": 7, 
            "period": 1000
        }, 
        {
            "level": 1, 
            "cost": 47, 
            "children": [
                {
                    "level": 0, 
                    "cost": 103, 
                    "children": [], 
                    "id": 5, 
                    "period": 150
                }
            ], 
            "id": 6, 
            "period": 150
        }, 
        {
            "level": 1, 
            "cost": 851, 
            "children": [
                {
                    "level": 0, 
                    "cost": 23, 
                    "children": [], 
                    "id": 1, 
                    "period": 60
                }, 
                {
                    "level": 0, 
                    "cost": 333, 
                    "children": [], 
                    "id": 3, 
                    "period": 1000
                }
            ], 
            "id": 8, 
            "period": 3000
        }
    ], 
    "id": 9, 
    "period": 1
}