{
    "level": 1, 
    "cost": 0, 
    "children": [
        {
            "level": 0, 
            "cost": 73, 
            "children": [], 
            "id": 4, 
            "period": 120
        }, 
        {
            "level": 0, 
            "cost": 37, 
            "children": [], 
            "id": 3, 
            "period": 100
        }, 
        {
            "level": 0, 
            "cost": 13, 
            "children": [], 
            "id": 0, 
            "period": 600
        }, 
        {
            "level": 0, 
            "cost": 0, 
            "children": [], 
            "id": 1, 
            "period": 6000
        }, 
        {
            "level": 0, 
            "cost": 0, 
            "children": [], 
            "id": 2, 
            "period": 1400
        }
    ], 
    "id": 5, 
    "period": 1
}