{
    "level": 1, 
    "cost": 0, 
    "children": [
        {
            "level": 0, 
            "cost": 467, 
            "children": [], 
            "id": 4, 
            "period": 750
        }, 
        {
            "level": 0, 
            "cost": 217, 
            "children": [], 
            "id": 1, 
            "period": 600
        }, 
        {
            "level": 0, 
            "cost": 47, 
            "children": [], 
            "id": 2, 
            "period": 3000
        }, 
        {
            "level": 0, 
            "cost": 0, 
            "children": [], 
            "id": 3, 
            "period": 500
        }, 
        {
            "level": 0, 
            "cost": 0, 
            "children": [], 
            "id": 0, 
            "period": 250
        }
    ], 
    "id": 5, 
    "period": 1
}