{
    "level": 1, 
    "cost": 0, 
    "children": [
        {
            "level": 0, 
            "cost": 91, 
            "children": [], 
            "id": 4, 
            "period": 100
        }, 
        {
            "level": 0, 
            "cost": 9, 
            "children": [], 
            "id": 1, 
            "period": 100
        }, 
        {
            "level": 0, 
            "cost": 0, 
            "children": [], 
            "id": 2, 
            "period": 2800
        }, 
        {
            "level": 0, 
            "cost": 0, 
            "children": [], 
            "id": 3, 
            "period": 2100
        }, 
        {
            "level": 0, 
            "cost": 0, 
            "children": [], 
            "id": 0, 
            "period": 40
        }
    ], 
    "id": 5, 
    "period": 1
}