{
    "level": 1, 
    "cost": 0, 
    "children": [
        {
            "level": 0, 
            "cost": 161, 
            "children": [], 
            "id": 4, 
            "period": 250
        }, 
        {
            "level": 0, 
            "cost": 1163, 
            "children": [], 
            "id": 2, 
            "period": 3500
        }, 
        {
            "level": 0, 
            "cost": 83, 
            "children": [], 
            "id": 3, 
            "period": 3500
        }, 
        {
            "level": 0, 
            "cost": 0, 
            "children": [], 
            "id": 0, 
            "period": 200
        }, 
        {
            "level": 0, 
            "cost": 0, 
            "children": [], 
            "id": 1, 
            "period": 500
        }
    ], 
    "id": 5, 
    "period": 1
}