{
    "level": 1, 
    "cost": 0, 
    "children": [
        {
            "level": 0, 
            "cost": 461, 
            "children": [], 
            "id": 2, 
            "period": 1000
        }, 
        {
            "level": 0, 
            "cost": 74, 
            "children": [], 
            "id": 1, 
            "period": 175
        }, 
        {
            "level": 0, 
            "cost": 813, 
            "children": [], 
            "id": 3, 
            "period": 7000
        }, 
        {
            "level": 0, 
            "cost": 0, 
            "children": [], 
            "id": 0, 
            "period": 3000
        }, 
        {
            "level": 0, 
            "cost": 0, 
            "children": [], 
            "id": 4, 
            "period": 75
        }
    ], 
    "id": 5, 
    "period": 1
}