{
    "level": 1, 
    "cost": 0, 
    "children": [
        {
            "level": 0, 
            "cost": 3427, 
            "children": [], 
            "id": 4, 
            "period": 7000
        }, 
        {
            "level": 0, 
            "cost": 227, 
            "children": [], 
            "id": 2, 
            "period": 500
        }, 
        {
            "level": 0, 
            "cost": 79, 
            "children": [], 
            "id": 0, 
            "period": 1400
        }, 
        {
            "level": 0, 
            "cost": 0, 
            "children": [], 
            "id": 1, 
            "period": 1200
        }, 
        {
            "level": 0, 
            "cost": 0, 
            "children": [], 
            "id": 3, 
            "period": 875
        }
    ], 
    "id": 5, 
    "period": 1
}