{
    "level": 1, 
    "cost": 0, 
    "children": [
        {
            "level": 0, 
            "cost": 191, 
            "children": [], 
            "id": 4, 
            "period": 336
        }, 
        {
            "level": 0, 
            "cost": 49, 
            "children": [], 
            "id": 2, 
            "period": 125
        }, 
        {
            "level": 0, 
            "cost": 1661, 
            "children": [], 
            "id": 0, 
            "period": 42000
        }, 
        {
            "level": 0, 
            "cost": 0, 
            "children": [], 
            "id": 1, 
            "period": 1750
        }, 
        {
            "level": 0, 
            "cost": 0, 
            "children": [], 
            "id": 3, 
            "period": 250
        }
    ], 
    "id": 5, 
    "period": 1
}