{
    "level": 1, 
    "cost": 0, 
    "children": [
        {
            "level": 0, 
            "cost": 3523, 
            "children": [], 
            "id": 3, 
            "period": 8400
        }, 
        {
            "level": 0, 
            "cost": 109, 
            "children": [], 
            "id": 0, 
            "period": 350
        }, 
        {
            "level": 0, 
            "cost": 323, 
            "children": [], 
            "id": 1, 
            "period": 1200
        }, 
        {
            "level": 0, 
            "cost": 0, 
            "children": [], 
            "id": 2, 
            "period": 50
        }, 
        {
            "level": 0, 
            "cost": 0, 
            "children": [], 
            "id": 4, 
            "period": 700
        }
    ], 
    "id": 5, 
    "period": 1
}