{
    "level": 1, 
    "cost": 0, 
    "children": [
        {
            "level": 0, 
            "cost": 86, 
            "children": [], 
            "id": 4, 
            "period": 125
        }, 
        {
            "level": 0, 
            "cost": 39, 
            "children": [], 
            "id": 2, 
            "period": 125
        }, 
        {
            "level": 0, 
            "cost": 0, 
            "children": [], 
            "id": 0, 
            "period": 1000
        }, 
        {
            "level": 0, 
            "cost": 0, 
            "children": [], 
            "id": 3, 
            "period": 375
        }, 
        {
            "level": 0, 
            "cost": 0, 
            "children": [], 
            "id": 1, 
            "period": 150
        }
    ], 
    "id": 5, 
    "period": 1
}