{
    "level": 1, 
    "cost": 0, 
    "children": [
        {
            "level": 0, 
            "cost": 1477, 
            "children": [], 
            "id": 2, 
            "period": 2000
        }, 
        {
            "level": 0, 
            "cost": 523, 
            "children": [], 
            "id": 4, 
            "period": 2000
        }, 
        {
            "level": 0, 
            "cost": 0, 
            "children": [], 
            "id": 3, 
            "period": 500
        }, 
        {
            "level": 0, 
            "cost": 0, 
            "children": [], 
            "id": 0, 
            "period": 120
        }, 
        {
            "level": 0, 
            "cost": 0, 
            "children": [], 
            "id": 1, 
            "period": 6000
        }
    ], 
    "id": 5, 
    "period": 1
}