{
    "level": 1, 
    "cost": 0, 
    "children": [
        {
            "level": 0, 
            "cost": 2239, 
            "children": [], 
            "id": 4, 
            "period": 4200
        }, 
        {
            "level": 0, 
            "cost": 1961, 
            "children": [], 
            "id": 2, 
            "period": 4200
        }, 
        {
            "level": 0, 
            "cost": 0, 
            "children": [], 
            "id": 3, 
            "period": 2625
        }, 
        {
            "level": 0, 
            "cost": 0, 
            "children": [], 
            "id": 1, 
            "period": 21000
        }, 
        {
            "level": 0, 
            "cost": 0, 
            "children": [], 
            "id": 0, 
            "period": 1000
        }
    ], 
    "id": 5, 
    "period": 1
}