{
    "level": 2, 
    "cost": 0, 
    "children": [
        {
            "level": 1, 
            "cost": 317, 
            "children": [
                {
                    "level": 0, 
                    "cost": 383, 
                    "children": [], 
                    "id": 5, 
                    "period": 700
                }, 
                {
                    "level": 0, 
                    "cost": 0, 
                    "children": [], 
                    "id": 4, 
                    "period": 1500
                }
            ], 
            "id": 6, 
            "period": 700
        }, 
        {
            "level": 1, 
            "cost": 9173, 
            "children": [
                {
                    "level": 0, 
                    "cost": 49, 
                    "children": [], 
                    "id": 3, 
                    "period": 100
                }, 
                {
                    "level": 0, 
                    "cost": 1537, 
                    "children": [], 
                    "id": 2, 
                    "period": 21000
                }
            ], 
            "id": 7, 
            "period": 21000
        }, 
        {
            "level": 1, 
            "cost": 331, 
            "children": [
                {
                    "level": 0, 
                    "cost": 281, 
                    "children": [], 
                    "id": 0, 
                    "period": 600
                }, 
                {
                    "level": 0, 
                    "cost": 158, 
                    "children": [], 
                    "id": 1, 
                    "period": 375
                }
            ], 
            "id": 8, 
            "period": 3000
        }
    ], 
    "id": 9, 
    "period": 1
}