{
    "level": 1, 
    "cost": 0, 
    "children": [
        {
            "level": 0, 
            "cost": 287, 
            "children": [], 
            "id": 3, 
            "period": 500
        }, 
        {
            "level": 0, 
            "cost": 136, 
            "children": [], 
            "id": 1, 
            "period": 375
        }, 
        {
            "level": 0, 
            "cost": 19, 
            "children": [], 
            "id": 4, 
            "period": 300
        }, 
        {
            "level": 0, 
            "cost": 0, 
            "children": [], 
            "id": 2, 
            "period": 3000
        }, 
        {
            "level": 0, 
            "cost": 0, 
            "children": [], 
            "id": 0, 
            "period": 400
        }
    ], 
    "id": 5, 
    "period": 1
}