{
    "level": 1, 
    "cost": 0, 
    "children": [
        {
            "level": 0, 
            "cost": 91, 
            "children": [], 
            "id": 4, 
            "period": 150
        }, 
        {
            "level": 0, 
            "cost": 977, 
            "children": [], 
            "id": 3, 
            "period": 3000
        }, 
        {
            "level": 0, 
            "cost": 203, 
            "children": [], 
            "id": 2, 
            "period": 3000
        }, 
        {
            "level": 0, 
            "cost": 0, 
            "children": [], 
            "id": 0, 
            "period": 80
        }, 
        {
            "level": 0, 
            "cost": 0, 
            "children": [], 
            "id": 1, 
            "period": 250
        }
    ], 
    "id": 5, 
    "period": 1
}