{
    "level": 1, 
    "cost": 0, 
    "children": [
        {
            "level": 0, 
            "cost": 8, 
            "children": [], 
            "id": 2, 
            "period": 15
        }, 
        {
            "level": 0, 
            "cost": 583, 
            "children": [], 
            "id": 4, 
            "period": 1500
        }, 
        {
            "level": 0, 
            "cost": 39, 
            "children": [], 
            "id": 0, 
            "period": 500
        }, 
        {
            "level": 0, 
            "cost": 0, 
            "children": [], 
            "id": 1, 
            "period": 120
        }, 
        {
            "level": 0, 
            "cost": 0, 
            "children": [], 
            "id": 3, 
            "period": 125
        }
    ], 
    "id": 5, 
    "period": 1
}