{
    "level": 1, 
    "cost": 0, 
    "children": [
        {
            "level": 0, 
            "cost": 2489, 
            "children": [], 
            "id": 4, 
            "period": 3500
        }, 
        {
            "level": 0, 
            "cost": 1011, 
            "children": [], 
            "id": 3, 
            "period": 3500
        }, 
        {
            "level": 0, 
            "cost": 0, 
            "children": [], 
            "id": 2, 
            "period": 150
        }, 
        {
            "level": 0, 
            "cost": 0, 
            "children": [], 
            "id": 0, 
            "period": 1200
        }, 
        {
            "level": 0, 
            "cost": 0, 
            "children": [], 
            "id": 1, 
            "period": 7000
        }
    ], 
    "id": 5, 
    "period": 1
}