{
    "level": 1, 
    "cost": 0, 
    "children": [
        {
            "level": 0, 
            "cost": 3, 
            "children": [], 
            "id": 4, 
            "period": 4
        }, 
        {
            "level": 0, 
            "cost": 1, 
            "children": [], 
            "id": 0, 
            "period": 4
        }, 
        {
            "level": 0, 
            "cost": 0, 
            "children": [], 
            "id": 2, 
            "period": 200
        }, 
        {
            "level": 0, 
            "cost": 0, 
            "children": [], 
            "id": 3, 
            "period": 75
        }, 
        {
            "level": 0, 
            "cost": 0, 
            "children": [], 
            "id": 1, 
            "period": 375
        }
    ], 
    "id": 5, 
    "period": 1
}