{
    "level": 1, 
    "cost": 0, 
    "children": [
        {
            "level": 0, 
            "cost": 181, 
            "children": [], 
            "id": 2, 
            "period": 300
        }, 
        {
            "level": 0, 
            "cost": 119, 
            "children": [], 
            "id": 4, 
            "period": 300
        }, 
        {
            "level": 0, 
            "cost": 0, 
            "children": [], 
            "id": 3, 
            "period": 1500
        }, 
        {
            "level": 0, 
            "cost": 0, 
            "children": [], 
            "id": 0, 
            "period": 500
        }, 
        {
            "level": 0, 
            "cost": 0, 
            "children": [], 
            "id": 1, 
            "period": 600
        }
    ], 
    "id": 5, 
    "period": 1
}