{
    "level": 1, 
    "cost": 0, 
    "children": [
        {
            "level": 0, 
            "cost": 121, 
            "children": [], 
            "id": 4, 
            "period": 200
        }, 
        {
            "level": 0, 
            "cost": 79, 
            "children": [], 
            "id": 2, 
            "period": 200
        }, 
        {
            "level": 0, 
            "cost": 0, 
            "children": [], 
            "id": 1, 
            "period": 8400
        }, 
        {
            "level": 0, 
            "cost": 0, 
            "children": [], 
            "id": 3, 
            "period": 280
        }, 
        {
            "level": 0, 
            "cost": 0, 
            "children": [], 
            "id": 0, 
            "period": 30
        }
    ], 
    "id": 5, 
    "period": 1
}