{
    "level": 1, 
    "cost": 0, 
    "children": [
        {
            "level": 0, 
            "cost": 157, 
            "children": [], 
            "id": 1, 
            "period": 300
        }, 
        {
            "level": 0, 
            "cost": 151, 
            "children": [], 
            "id": 3, 
            "period": 400
        }, 
        {
            "level": 0, 
            "cost": 119, 
            "children": [], 
            "id": 4, 
            "period": 1200
        }, 
        {
            "level": 0, 
            "cost": 0, 
            "children": [], 
            "id": 2, 
            "period": 750
        }, 
        {
            "level": 0, 
            "cost": 0, 
            "children": [], 
            "id": 0, 
            "period": 24
        }
    ], 
    "id": 5, 
    "period": 1
}