{
    "level": 1, 
    "cost": 0, 
    "children": [
        {
            "level": 0, 
            "cost": 23, 
            "children": [], 
            "id": 4, 
            "period": 40
        }, 
        {
            "level": 0, 
            "cost": 367, 
            "children": [], 
            "id": 0, 
            "period": 1200
        }, 
        {
            "level": 0, 
            "cost": 143, 
            "children": [], 
            "id": 1, 
            "period": 1200
        }, 
        {
            "level": 0, 
            "cost": 0, 
            "children": [], 
            "id": 2, 
            "period": 2800
        }, 
        {
            "level": 0, 
            "cost": 0, 
            "children": [], 
            "id": 3, 
            "period": 105
        }
    ], 
    "id": 5, 
    "period": 1
}