{
    "level": 1, 
    "cost": 0, 
    "children": [
        {
            "level": 0, 
            "cost": 524, 
            "children": [], 
            "id": 4, 
            "period": 875
        }, 
        {
            "level": 0, 
            "cost": 131, 
            "children": [], 
            "id": 2, 
            "period": 500
        }, 
        {
            "level": 0, 
            "cost": 487, 
            "children": [], 
            "id": 3, 
            "period": 3500
        }, 
        {
            "level": 0, 
            "cost": 0, 
            "children": [], 
            "id": 0, 
            "period": 15
        }, 
        {
            "level": 0, 
            "cost": 0, 
            "children": [], 
            "id": 1, 
            "period": 1000
        }
    ], 
    "id": 5, 
    "period": 1
}