{
    "level": 1, 
    "cost": 0, 
    "children": [
        {
            "level": 0, 
            "cost": 207, 
            "children": [], 
            "id": 1, 
            "period": 400
        }, 
        {
            "level": 0, 
            "cost": 46, 
            "children": [], 
            "id": 3, 
            "period": 125
        }, 
        {
            "level": 0, 
            "cost": 229, 
            "children": [], 
            "id": 4, 
            "period": 2000
        }, 
        {
            "level": 0, 
            "cost": 0, 
            "children": [], 
            "id": 2, 
            "period": 525
        }, 
        {
            "level": 0, 
            "cost": 0, 
            "children": [], 
            "id": 0, 
            "period": 400
        }
    ], 
    "id": 5, 
    "period": 1
}