{
    "level": 1, 
    "cost": 1, 
    "children": [
        {
            "level": 0, 
            "cost": 0, 
            "children": [], 
            "id": 1, 
            "period": 14000
        }, 
        {
            "level": 0, 
            "cost": 0, 
            "children": [], 
            "id": 0, 
            "period": 375
        }, 
        {
            "level": 0, 
            "cost": 0, 
            "children": [], 
            "id": 2, 
            "period": 4200
        }, 
        {
            "level": 0, 
            "cost": 0, 
            "children": [], 
            "id": 3, 
            "period": 500
        }
    ], 
    "id": 4, 
    "period": 1
}