{
    "level": 1, 
    "cost": 0, 
    "children": [
        {
            "level": 0, 
            "cost": 843, 
            "children": [], 
            "id": 3, 
            "period": 1400
        }, 
        {
            "level": 0, 
            "cost": 51, 
            "children": [], 
            "id": 4, 
            "period": 175
        }, 
        {
            "level": 0, 
            "cost": 149, 
            "children": [], 
            "id": 1, 
            "period": 1400
        }, 
        {
            "level": 0, 
            "cost": 0, 
            "children": [], 
            "id": 0, 
            "period": 1000
        }, 
        {
            "level": 0, 
            "cost": 0, 
            "children": [], 
            "id": 2, 
            "period": 2800
        }
    ], 
    "id": 5, 
    "period": 1
}