{
    "level": 1, 
    "cost": 0, 
    "children": [
        {
            "level": 0, 
            "cost": 349, 
            "children": [], 
            "id": 3, 
            "period": 750
        }, 
        {
            "level": 0, 
            "cost": 97, 
            "children": [], 
            "id": 2, 
            "period": 250
        }, 
        {
            "level": 0, 
            "cost": 11, 
            "children": [], 
            "id": 1, 
            "period": 75
        }, 
        {
            "level": 0, 
            "cost": 0, 
            "children": [], 
            "id": 4, 
            "period": 7000
        }, 
        {
            "level": 0, 
            "cost": 0, 
            "children": [], 
            "id": 0, 
            "period": 1000
        }
    ], 
    "id": 5, 
    "period": 1
}