{
    "level": 1, 
    "cost": 0, 
    "children": [
        {
            "level": 0, 
            "cost": 92, 
            "children": [], 
            "id": 3, 
            "period": 175
        }, 
        {
            "level": 0, 
            "cost": 111, 
            "children": [], 
            "id": 2, 
            "period": 250
        }, 
        {
            "level": 0, 
            "cost": 53, 
            "children": [], 
            "id": 1, 
            "period": 1750
        }, 
        {
            "level": 0, 
            "cost": 0, 
            "children": [], 
            "id": 4, 
            "period": 1500
        }, 
        {
            "level": 0, 
            "cost": 0, 
            "children": [], 
            "id": 0, 
            "period": 1200
        }
    ], 
    "id": 5, 
    "period": 1
}