{
    "level": 1, 
    "cost": 0, 
    "children": [
        {
            "level": 0, 
            "cost": 1133, 
            "children": [], 
            "id": 2, 
            "period": 2100
        }, 
        {
            "level": 0, 
            "cost": 427, 
            "children": [], 
            "id": 1, 
            "period": 1000
        }, 
        {
            "level": 0, 
            "cost": 703, 
            "children": [], 
            "id": 4, 
            "period": 21000
        }, 
        {
            "level": 0, 
            "cost": 0, 
            "children": [], 
            "id": 0, 
            "period": 350
        }, 
        {
            "level": 0, 
            "cost": 0, 
            "children": [], 
            "id": 3, 
            "period": 15
        }
    ], 
    "id": 5, 
    "period": 1
}