{
    "level": 1, 
    "cost": 0, 
    "children": [
        {
            "level": 0, 
            "cost": 423, 
            "children": [], 
            "id": 2, 
            "period": 1000
        }, 
        {
            "level": 0, 
            "cost": 259, 
            "children": [], 
            "id": 0, 
            "period": 750
        }, 
        {
            "level": 0, 
            "cost": 139, 
            "children": [], 
            "id": 4, 
            "period": 600
        }, 
        {
            "level": 0, 
            "cost": 0, 
            "children": [], 
            "id": 3, 
            "period": 175
        }, 
        {
            "level": 0, 
            "cost": 0, 
            "children": [], 
            "id": 1, 
            "period": 150
        }
    ], 
    "id": 5, 
    "period": 1
}