{
    "level": 1, 
    "cost": 0, 
    "children": [
        {
            "level": 0, 
            "cost": 51, 
            "children": [], 
            "id": 2, 
            "period": 100
        }, 
        {
            "level": 0, 
            "cost": 17, 
            "children": [], 
            "id": 1, 
            "period": 40
        }, 
        {
            "level": 0, 
            "cost": 13, 
            "children": [], 
            "id": 3, 
            "period": 200
        }, 
        {
            "level": 0, 
            "cost": 0, 
            "children": [], 
            "id": 4, 
            "period": 500
        }, 
        {
            "level": 0, 
            "cost": 0, 
            "children": [], 
            "id": 0, 
            "period": 100
        }
    ], 
    "id": 5, 
    "period": 1
}