{
    "level": 1, 
    "cost": 0, 
    "children": [
        {
            "level": 0, 
            "cost": 13, 
            "children": [], 
            "id": 4, 
            "period": 25
        }, 
        {
            "level": 0, 
            "cost": 2969, 
            "children": [], 
            "id": 2, 
            "period": 10500
        }, 
        {
            "level": 0, 
            "cost": 2071, 
            "children": [], 
            "id": 3, 
            "period": 10500
        }, 
        {
            "level": 0, 
            "cost": 0, 
            "children": [], 
            "id": 1, 
            "period": 1500
        }, 
        {
            "level": 0, 
            "cost": 0, 
            "children": [], 
            "id": 0, 
            "period": 2100
        }
    ], 
    "id": 5, 
    "period": 1
}