{
    "level": 1, 
    "cost": 0, 
    "children": [
        {
            "level": 0, 
            "cost": 179, 
            "children": [], 
            "id": 2, 
            "period": 300
        }, 
        {
            "level": 0, 
            "cost": 121, 
            "children": [], 
            "id": 4, 
            "period": 300
        }, 
        {
            "level": 0, 
            "cost": 0, 
            "children": [], 
            "id": 3, 
            "period": 150
        }, 
        {
            "level": 0, 
            "cost": 0, 
            "children": [], 
            "id": 0, 
            "period": 400
        }, 
        {
            "level": 0, 
            "cost": 0, 
            "children": [], 
            "id": 1, 
            "period": 80
        }
    ], 
    "id": 5, 
    "period": 1
}