{
    "level": 1, 
    "cost": 0, 
    "children": [
        {
            "level": 0, 
            "cost": 47, 
            "children": [], 
            "id": 2, 
            "period": 100
        }, 
        {
            "level": 0, 
            "cost": 193, 
            "children": [], 
            "id": 3, 
            "period": 500
        }, 
        {
            "level": 0, 
            "cost": 18, 
            "children": [], 
            "id": 0, 
            "period": 125
        }, 
        {
            "level": 0, 
            "cost": 0, 
            "children": [], 
            "id": 4, 
            "period": 420
        }, 
        {
            "level": 0, 
            "cost": 0, 
            "children": [], 
            "id": 1, 
            "period": 560
        }
    ], 
    "id": 5, 
    "period": 1
}