{
    "level": 1, 
    "cost": 0, 
    "children": [
        {
            "level": 0, 
            "cost": 923, 
            "children": [], 
            "id": 2, 
            "period": 1200
        }, 
        {
            "level": 0, 
            "cost": 67, 
            "children": [], 
            "id": 4, 
            "period": 300
        }, 
        {
            "level": 0, 
            "cost": 3, 
            "children": [], 
            "id": 0, 
            "period": 400
        }, 
        {
            "level": 0, 
            "cost": 0, 
            "children": [], 
            "id": 3, 
            "period": 50
        }, 
        {
            "level": 0, 
            "cost": 0, 
            "children": [], 
            "id": 1, 
            "period": 14000
        }
    ], 
    "id": 5, 
    "period": 1
}