{
    "level": 1, 
    "cost": 0, 
    "children": [
        {
            "level": 0, 
            "cost": 333, 
            "children": [], 
            "id": 2, 
            "period": 700
        }, 
        {
            "level": 0, 
            "cost": 41, 
            "children": [], 
            "id": 1, 
            "period": 100
        }, 
        {
            "level": 0, 
            "cost": 4, 
            "children": [], 
            "id": 0, 
            "period": 35
        }, 
        {
            "level": 0, 
            "cost": 0, 
            "children": [], 
            "id": 4, 
            "period": 300
        }, 
        {
            "level": 0, 
            "cost": 0, 
            "children": [], 
            "id": 3, 
            "period": 3000
        }
    ], 
    "id": 5, 
    "period": 1
}