{
    "level": 2, 
    "cost": 0, 
    "children": [
        {
            "level": 1, 
            "cost": 53, 
            "children": [
                {
                    "level": 0, 
                    "cost": 47, 
                    "children": [], 
                    "id": 2, 
                    "period": 100
                }, 
                {
                    "level": 0, 
                    "cost": 0, 
                    "children": [], 
                    "id": 4, 
                    "period": 21000
                }, 
                {
                    "level": 0, 
                    "cost": 0, 
                    "children": [], 
                    "id": 1, 
                    "period": 2000
                }
            ], 
            "id": 7, 
            "period": 100
        }, 
        {
            "level": 1, 
            "cost": 191, 
            "children": [
                {
                    "level": 0, 
                    "cost": 547, 
                    "children": [], 
                    "id": 0, 
                    "period": 1200
                }, 
                {
                    "level": 0, 
                    "cost": 973, 
                    "children": [], 
                    "id": 3, 
                    "period": 6000
                }
            ], 
            "id": 8, 
            "period": 500
        }, 
        {
            "level": 1, 
            "cost": 11, 
            "children": [
                {
                    "level": 0, 
                    "cost": 114, 
                    "children": [], 
                    "id": 5, 
                    "period": 125
                }
            ], 
            "id": 6, 
            "period": 125
        }
    ], 
    "id": 9, 
    "period": 1
}