{
    "level": 1, 
    "cost": 0, 
    "children": [
        {
            "level": 0, 
            "cost": 169, 
            "children": [], 
            "id": 4, 
            "period": 200
        }, 
        {
            "level": 0, 
            "cost": 31, 
            "children": [], 
            "id": 1, 
            "period": 200
        }, 
        {
            "level": 0, 
            "cost": 0, 
            "children": [], 
            "id": 3, 
            "period": 10500
        }, 
        {
            "level": 0, 
            "cost": 0, 
            "children": [], 
            "id": 2, 
            "period": 5250
        }, 
        {
            "level": 0, 
            "cost": 0, 
            "children": [], 
            "id": 0, 
            "period": 400
        }
    ], 
    "id": 5, 
    "period": 1
}