{
    "level": 2, 
    "cost": 0, 
    "children": [
        {
            "level": 1, 
            "cost": 4313, 
            "children": [
                {
                    "level": 0, 
                    "cost": 179, 
                    "children": [], 
                    "id": 4, 
                    "period": 350
                }, 
                {
                    "level": 0, 
                    "cost": 817, 
                    "children": [], 
                    "id": 3, 
                    "period": 10500
                }, 
                {
                    "level": 0, 
                    "cost": 0, 
                    "children": [], 
                    "id": 2, 
                    "period": 5250
                }
            ], 
            "id": 7, 
            "period": 10500
        }, 
        {
            "level": 1, 
            "cost": 527, 
            "children": [
                {
                    "level": 0, 
                    "cost": 1223, 
                    "children": [], 
                    "id": 5, 
                    "period": 1750
                }
            ], 
            "id": 6, 
            "period": 1750
        }, 
        {
            "level": 1, 
            "cost": 121, 
            "children": [
                {
                    "level": 0, 
                    "cost": 401, 
                    "children": [], 
                    "id": 1, 
                    "period": 1050
                }, 
                {
                    "level": 0, 
                    "cost": 33, 
                    "children": [], 
                    "id": 0, 
                    "period": 100
                }
            ], 
            "id": 8, 
            "period": 420
        }
    ], 
    "id": 9, 
    "period": 1
}