{
    "level": 1, 
    "cost": 0, 
    "children": [
        {
            "level": 0, 
            "cost": 12, 
            "children": [], 
            "id": 2, 
            "period": 25
        }, 
        {
            "level": 0, 
            "cost": 113, 
            "children": [], 
            "id": 4, 
            "period": 250
        }, 
        {
            "level": 0, 
            "cost": 17, 
            "children": [], 
            "id": 0, 
            "period": 250
        }, 
        {
            "level": 0, 
            "cost": 0, 
            "children": [], 
            "id": 1, 
            "period": 1200
        }, 
        {
            "level": 0, 
            "cost": 0, 
            "children": [], 
            "id": 3, 
            "period": 250
        }
    ], 
    "id": 5, 
    "period": 1
}