{
    "level": 1, 
    "cost": 0, 
    "children": [
        {
            "level": 0, 
            "cost": 843, 
            "children": [], 
            "id": 4, 
            "period": 1750
        }, 
        {
            "level": 0, 
            "cost": 9, 
            "children": [], 
            "id": 1, 
            "period": 25
        }, 
        {
            "level": 0, 
            "cost": 277, 
            "children": [], 
            "id": 3, 
            "period": 1750
        }, 
        {
            "level": 0, 
            "cost": 0, 
            "children": [], 
            "id": 0, 
            "period": 15
        }, 
        {
            "level": 0, 
            "cost": 0, 
            "children": [], 
            "id": 2, 
            "period": 500
        }
    ], 
    "id": 5, 
    "period": 1
}