{
    "level": 1, 
    "cost": 0, 
    "children": [
        {
            "level": 0, 
            "cost": 1088, 
            "children": [], 
            "id": 4, 
            "period": 2625
        }, 
        {
            "level": 0, 
            "cost": 93, 
            "children": [], 
            "id": 3, 
            "period": 250
        }, 
        {
            "level": 0, 
            "cost": 1121, 
            "children": [], 
            "id": 1, 
            "period": 5250
        }, 
        {
            "level": 0, 
            "cost": 0, 
            "children": [], 
            "id": 0, 
            "period": 2000
        }, 
        {
            "level": 0, 
            "cost": 0, 
            "children": [], 
            "id": 2, 
            "period": 350
        }
    ], 
    "id": 5, 
    "period": 1
}