{
    "level": 1, 
    "cost": 0, 
    "children": [
        {
            "level": 0, 
            "cost": 431, 
            "children": [], 
            "id": 4, 
            "period": 750
        }, 
        {
            "level": 0, 
            "cost": 91, 
            "children": [], 
            "id": 3, 
            "period": 300
        }, 
        {
            "level": 0, 
            "cost": 61, 
            "children": [], 
            "id": 2, 
            "period": 500
        }, 
        {
            "level": 0, 
            "cost": 0, 
            "children": [], 
            "id": 0, 
            "period": 200
        }, 
        {
            "level": 0, 
            "cost": 0, 
            "children": [], 
            "id": 1, 
            "period": 400
        }
    ], 
    "id": 5, 
    "period": 1
}