{
    "level": 1, 
    "cost": 0, 
    "children": [
        {
            "level": 0, 
            "cost": 769, 
            "children": [], 
            "id": 4, 
            "period": 1050
        }, 
        {
            "level": 0, 
            "cost": 743, 
            "children": [], 
            "id": 2, 
            "period": 3500
        }, 
        {
            "level": 0, 
            "cost": 83, 
            "children": [], 
            "id": 3, 
            "period": 1500
        }, 
        {
            "level": 0, 
            "cost": 0, 
            "children": [], 
            "id": 1, 
            "period": 200
        }, 
        {
            "level": 0, 
            "cost": 0, 
            "children": [], 
            "id": 0, 
            "period": 3000
        }
    ], 
    "id": 5, 
    "period": 1
}