{
    "level": 1, 
    "cost": 0, 
    "children": [
        {
            "level": 0, 
            "cost": 72, 
            "children": [], 
            "id": 4, 
            "period": 125
        }, 
        {
            "level": 0, 
            "cost": 327, 
            "children": [], 
            "id": 1, 
            "period": 1000
        }, 
        {
            "level": 0, 
            "cost": 97, 
            "children": [], 
            "id": 2, 
            "period": 1000
        }, 
        {
            "level": 0, 
            "cost": 0, 
            "children": [], 
            "id": 3, 
            "period": 1000
        }, 
        {
            "level": 0, 
            "cost": 0, 
            "children": [], 
            "id": 0, 
            "period": 6000
        }
    ], 
    "id": 5, 
    "period": 1
}