{
    "level": 1, 
    "cost": 0, 
    "children": [
        {
            "level": 0, 
            "cost": 696, 
            "children": [], 
            "id": 4, 
            "period": 875
        }, 
        {
            "level": 0, 
            "cost": 179, 
            "children": [], 
            "id": 0, 
            "period": 875
        }, 
        {
            "level": 0, 
            "cost": 0, 
            "children": [], 
            "id": 3, 
            "period": 875
        }, 
        {
            "level": 0, 
            "cost": 0, 
            "children": [], 
            "id": 2, 
            "period": 1400
        }, 
        {
            "level": 0, 
            "cost": 0, 
            "children": [], 
            "id": 1, 
            "period": 210
        }
    ], 
    "id": 5, 
    "period": 1
}