{
    "level": 1, 
    "cost": 0, 
    "children": [
        {
            "level": 0, 
            "cost": 444, 
            "children": [], 
            "id": 1, 
            "period": 875
        }, 
        {
            "level": 0, 
            "cost": 5429, 
            "children": [], 
            "id": 3, 
            "period": 14000
        }, 
        {
            "level": 0, 
            "cost": 1467, 
            "children": [], 
            "id": 2, 
            "period": 14000
        }, 
        {
            "level": 0, 
            "cost": 0, 
            "children": [], 
            "id": 4, 
            "period": 3000
        }, 
        {
            "level": 0, 
            "cost": 0, 
            "children": [], 
            "id": 0, 
            "period": 300
        }
    ], 
    "id": 5, 
    "period": 1
}