-------------- DataInterpreter Logfile --------------
Date and time of logging: Tue Mar 15 16:35:38 2022
Amount of channels in dataset: 4
Time not yet calibrated; Timestamps logged in amount of ticks.
-----------------------------------------------------


Start of log:

Datachannel ID: 5, AD Converter 1
-----------------------------------------------------
0 ticks - 15.8 
113 ticks - 11.1 
227 ticks - 7.1 
340 ticks - 4.4 
453 ticks - 2.1 
566 ticks - 1.1 
680 ticks - 1.1 
793 ticks - 1.9 
906 ticks - 3.9 
1019 ticks - 6.8 
1133 ticks - 10.5 
1246 ticks - 15.1 
1359 ticks - 20.4 
1473 ticks - 26.2 
-----------------------------------------------------


Datachannel ID: 6, AD Converter 1
-----------------------------------------------------
0 ticks - 32.8 
113 ticks - 31.9 
227 ticks - 31.5 
340 ticks - 31.1 
453 ticks - 30.7 
566 ticks - 30.7 
680 ticks - 30.7 
793 ticks - 30.8 
906 ticks - 31.0 
1019 ticks - 31.4 
1133 ticks - 31.7 
1246 ticks - 32.7 
1359 ticks - 33.2 
1473 ticks - 33.5 
-----------------------------------------------------


Datachannel ID: 8, AD Converter 1
-----------------------------------------------------
0 ticks - 85.3 
113 ticks - 85.0 
227 ticks - 88.7 
340 ticks - 88.7 
453 ticks - 2.3 
566 ticks - 36.0 
680 ticks - 36.1 
793 ticks - 10.6 
906 ticks - 10.6 
1019 ticks - 74.9 
1133 ticks - 74.8 
1246 ticks - 57.4 
1359 ticks - 97.8 
1473 ticks - 97.8 
-----------------------------------------------------


Datachannel ID: 9, AD Converter 1
-----------------------------------------------------
0 ticks - 44.6 
113 ticks - 45.1 
227 ticks - 45.4 
340 ticks - 45.4 
453 ticks - 35.5 
566 ticks - 37.7 
680 ticks - 37.8 
793 ticks - 35.6 
906 ticks - 35.6 
1019 ticks - 44.0 
1133 ticks - 44.5 
1246 ticks - 43.6 
1359 ticks - 45.7 
1473 ticks - 45.7 
-----------------------------------------------------


