id,grupo,status
,Aminoglicosídeo,
,Beta-lactâmicos,
,Cloranfenicol,
,Daptomicina,
,Estreptograminas,
,Glicopeptídeos ,
,Macrolídeos,
,Oxazolidinonas,
,Polimixinas,
,Quinolonas,
,Sulfonamidas,
,Tetraciclinas,
