1;Galletas Coronita;3.30
2;Galletas Oreo;0.80
3;Galletas Tentacion de Vainilla;1.00
4;Galletas Tentacion de Chocolate;1.00
5;Galletas Soda V;1.20
6;Galletas Coronita;3.30
7;Galletas Oreo;0.80
8;Galletas Tentacion de Vainilla;1.00
9;Galletas Tentacion de Chocolate;1.00
10;Galletas Soda V;1.20
11;Galletas Coronita;3.30
12;Galletas Oreo;0.80
13;Galletas Tentacion de Vainilla;1.00
14;Galletas Tentacion de Chocolate;1.00
15;Galletas Soda V;1.20
16;Leche Gloria;5.00
17;Azucar;6.00
18;Arroz;4.00
