id;first_name;last_name;email;company;skill
1;Katlin;Glasbey;kglasbey0@cornell.edu;Donnelly-West;Vector Illustration
2;Jaymee;Oatley;joatley1@noaa.gov;Rodriguez, Rice and Bednar;GPCRs
3;Janna;Jeannin;jjeannin2@cnbc.com;Crona Inc;Network Design
4;Evelyn;Askaw;easkaw3@slideshare.net;MacGyver and Sons;Nitrous Oxide
5;Melody;Bax;mbax4@springer.com;Ondricka, Tillman and Ward;OSHA 30-Hour
6;Hillary;Huddy;hhuddy5@hugedomains.com;Huel Group;SCADA
7;Roselle;Glabach;rglabach6@princeton.edu;Simonis Group;PBS
8;Corrina;Bloyes;cbloyes7@addthis.com;Keeling-King;IRI
9;Egor;Frow;efrow8@oaic.gov.au;Gibson, Kozey and Schmidt;Renewable Energy
10;Junette;Huburn;jhuburn9@google.ru;Boyle-Gerlach;iPhone Support
11;Philbert;Riccio;priccioa@cloudflare.com;Kohler-Yundt;CTIOS
12;Elfie;Pettipher;epettipherb@eepurl.com;DuBuque, Schmeler and Nicolas;GBA
13;Jayson;Usher;jusherc@google.ca;West-Dicki;"Mac &amp; PC platforms"
14;Cathy;Pinnere;cpinnered@google.com.au;Larson and Sons;Biblical Studies
15;Demetria;Walsh;dwalshe@tinyurl.com;Littel LLC;Kanban
16;Leupold;Jagger;ljaggerf@virginia.edu;Weber Inc;Web Content
17;Masha;Filipowicz;mfilipowiczg@themeforest.net;Koepp, Stark and Welch;CXO level engagement
18;Maynard;Farnorth;mfarnorthh@bizjournals.com;Carroll-Ledner;MFS
19;Callean;Hartas;chartasi@sina.com.cn;Hyatt, Parisian and Pfannerstill;Loans
20;Orin;Shovelin;oshovelinj@japanpost.jp;Koss-Quigley;Rhino
21;Rodrigo;Henniger;rhennigerk@infoseek.co.jp;Pouros, Weimann and Connelly;WWAN
22;Emylee;Laddle;eladdlel@hhs.gov;Jacobson Inc;YUI
23;Nomi;Pleuman;npleumanm@slideshare.net;Hoppe Inc;Cycling
24;Liva;Goldring;lgoldringn@marriott.com;Kiehn-Weissnat;FDS
25;Adoree;Coleman;acolemano@umich.edu;Wiegand, Corwin and Douglas;PBS
26;Leanna;Cleaton;lcleatonp@utexas.edu;Beer-Pouros;Biochemistry
27;Alverta;Beauchop;abeauchopq@vinaora.com;Pagac-Dibbert;Operational Due Diligence
28;Fanya;Gudgin;fgudginr@opera.com;Ward LLC;SSL
29;Connie;McDuffie;cmcduffies@about.com;Koepp, Hand and Cormier;Smart TV
30;Madeleine;Boick;mboickt@tiny.cc;Prosacco LLC;Fermentation
31;Martie;Humfrey;mhumfreyu@icio.us;Koepp Inc;XLSTAT
32;Esther;Dreghorn;edreghornv@about.me;Russel, Cremin and Johns;MCSA + Messaging
33;Hildagard;Wooller;hwoollerw@home.pl;Mosciski, Marks and Gorczany;NDA
34;Myranda;Helliar;mhelliarx@boston.com;Prohaska Group;Talent Booking
35;Diannne;Gaine of England;dgaineofenglandy@creativecommons.org;Schoen, Davis and Emmerich;Xcart
36;Lulita;Mizen;lmizenz@epa.gov;Kozey, Harber and Swaniawski;Python
37;Beryl;Zecchinelli;bzecchinelli10@surveymonkey.com;Schowalter-Jast;European Union
38;Nolana;Arzu;narzu11@free.fr;Nikolaus, Lynch and Bernier;Performance Tuning
39;Nerty;Trevance;ntrevance12@dedecms.com;Haley Group;"SG&amp;A"
40;Tyson;Hyatt;thyatt13@hibu.com;Kuhn LLC;Architectural Drawings
41;Porty;Couroy;pcouroy14@pen.io;Donnelly, Terry and Lehner;XML-RPC
42;Yalonda;Touson;ytouson15@imdb.com;Kling, Stoltenberg and Glover;LS-DYNA
43;Son;Creevy;screevy16@hc360.com;Kertzmann-Jerde;Twitter API
44;Trenna;Larmouth;tlarmouth17@chicagotribune.com;Pfannerstill Group;Sports Management
45;Donnamarie;Benedyktowicz;dbenedyktowicz18@paypal.com;Fritsch Inc;WinForms
46;Casandra;Earie;cearie19@census.gov;Haley and Sons;Hypnotherapy
47;Vincenz;Boston;vboston1a@opensource.org;Larson Inc;AP Style
48;Dori;Sickamore;dsickamore1b@china.com.cn;Sawayn-Collier;Computer System Validation
49;Gun;Pyzer;gpyzer1c@istockphoto.com;Roberts, Kshlerin and Brakus;FSCM
50;Marni;Kaesmakers;mkaesmakers1d@nbcnews.com;Homenick and Sons;OxMetrics
51;Latrina;Birdis;lbirdis1e@washington.edu;Stanton-Greenfelder;Move Up Buyers
52;Paulie;Cornfield;pcornfield1f@google.de;Hickle, Leuschke and Tromp;Musical Theatre
53;Cheslie;Cadore;ccadore1g@pinterest.com;Gibson, Breitenberg and Gusikowski;Oil Industry
54;Sephira;Seniour;sseniour1h@bandcamp.com;Swaniawski-Schneider;Aerial Silks
55;Sibel;Pridding;spridding1i@pcworld.com;Cormier, Brakus and Schaefer;NGP
56;Casper;Dodsley;cdodsley1j@harvard.edu;Herman, Fay and Treutel;Jewish Studies
57;Julie;De Lasci;jdelasci1k@dagondesign.com;Bauch, Strosin and Frami;DMC
58;Roman;Bladen;rbladen1l@paginegialle.it;Dach-Schoen;Cisco VPN
59;Rich;Grube;rgrube1m@cocolog-nifty.com;Hilpert, Kassulke and Predovic;PDM
60;Tracie;Vanstone;tvanstone1n@about.me;Reynolds and Sons;Church Events
61;Jenn;Christofol;jchristofol1o@msu.edu;Dickens, Harris and Hintz;Integrated Marketing
62;Patsy;Moulds;pmoulds1p@shop-pro.jp;Lebsack and Sons;CNN Pathfire
63;Sallie;Summerson;ssummerson1q@sphinn.com;Fisher Group;TDMoIP
64;Wendall;Thistleton;wthistleton1r@statcounter.com;Beer and Sons;Swing
65;Remington;Elmer;relmer1s@amazon.co.jp;VonRueden-Macejkovic;Design of Experiments
66;Genia;Becerro;gbecerro1t@sourceforge.net;Renner-Schmeler;HD Camera Operation
67;Darci;Lisle;dlisle1u@cafepress.com;Toy Inc;Business Rules
68;Lida;Gibbins;lgibbins1v@soup.io;Hoeger, Buckridge and Gutkowski;ERP
69;Elbertine;Fines;efines1w@sogou.com;Weimann-Littel;Branch Banking
70;Borg;Croal;bcroal1x@dion.ne.jp;Harvey, Jakubowski and Powlowski;Environmental Awareness
71;Thorstein;Markussen;tmarkussen1y@walmart.com;Yost, Gaylord and Stehr;Presentation Skills
72;Bethanne;Arbuckle;barbuckle1z@usda.gov;Blick LLC;VLC
73;Shawn;Dennehy;sdennehy20@dropbox.com;Padberg-Crona;Radiology
74;Calley;Bathoe;cbathoe21@army.mil;Schinner, Tremblay and Schmeler;Lunix
75;Erminie;Gorick;egorick22@wufoo.com;Bartoletti Inc;Pharmacy Benefit Management
76;Darn;Wilby;dwilby23@mlb.com;Jenkins, Gorczany and Cruickshank;Demand Generation
77;Granthem;Osmint;gosmint24@themeforest.net;Abbott, Swift and Jerde;Wheat
78;Deerdre;Lies;dlies25@istockphoto.com;Cartwright and Sons;American English
79;Darline;Bruffell;dbruffell26@guardian.co.uk;O'Conner, Toy and Turcotte;Criminal Justice
80;Krispin;Locksley;klocksley27@cnet.com;Walter, Kozey and Larkin;Weapons
81;Traci;Kepling;tkepling28@privacy.gov.au;Wiegand, Hand and D'Amore;CVIS
82;Rebeka;Harflete;rharflete29@howstuffworks.com;Huel, Lowe and Toy;Solar PV
83;Naomi;Maggill'Andreis;nmaggillandreis2a@guardian.co.uk;Littel LLC;Assisting Others
84;Halley;Llorente;hllorente2b@nasa.gov;Ebert-Waelchi;CWSP
85;Callean;Blitz;cblitz2c@123-reg.co.uk;Dare Inc;SAP EBP
86;Fairlie;Beglin;fbeglin2d@buzzfeed.com;Kuhic LLC;AHA
87;Damara;Hugues;dhugues2e@cbslocal.com;Boehm LLC;Genomics
88;Malissa;Drennan;mdrennan2f@chron.com;Schinner, Beer and Torphy;Active Directory
89;Gale;Oboy;goboy2g@comsenz.com;Murazik Group;CTD
90;Candy;Gouth;cgouth2h@skype.com;Hayes, Stehr and Rohan;Access
91;Eddi;Stean;estean2i@spotify.com;Dare, Leffler and Mitchell;"SR&amp;ED"
92;Burke;Blodget;bblodget2j@huffingtonpost.com;Wisoky-Gottlieb;Time-efficient
93;Ray;Cleef;rcleef2k@latimes.com;Jacobs and Sons;Database Marketing
94;Aggi;Rignold;arignold2l@marriott.com;Sawayn Inc;Knowledge Sharing
95;Theodor;Harmar;tharmar2m@tumblr.com;Hauck Group;Change Orders
96;Jacquetta;Wightman;jwightman2n@army.mil;McCullough, Keebler and Witting;Aircraft Maintenance
97;Bordy;Cason;bcason2o@zdnet.com;Herman LLC;Driven By Results
98;Mallory;Schuricht;mschuricht2p@timesonline.co.uk;Hickle LLC;Environmental Awareness
99;Ruthi;Clearie;rclearie2q@earthlink.net;Bechtelar-Rohan;OMT
100;Ignace;Gable;igable2r@wikimedia.org;Gerlach Group;MFG-Pro
