{
  "users": [
    {
      "id": 1,
      "username": "anna",
      "password": "psst",
      "displayName": "Anna Conda",
      "age": "46",
      "female": true,
      "birthDay": "2019-12-24",
      "profileImage": "https://randomuser.me/api/portraits/women/68.jpg"
    },
    {
      "id": 2,
      "username": "nisse",
      "password": "tjabba",
      "displayName": "Nisse Hult",
      "age": 52,
      "female": false,
      "birthDay": "2020-08-05",
      "profileImage": "https://randomuser.me/api/portraits/men/52.jpg"
    }
  ],
  "products": [
    {
      "id": 1,
      "name": "Smoked Paprika",
      "price": 8.19,
      "count": 13,
      "image": "https://picsum.photos/id/1/200/200"
    },
    {
      "id": 2,
      "name": "Vinegar - Balsamic",
      "price": 98.09,
      "count": 5,
      "image": "https://picsum.photos/id/2/200/200"
    },
    {
      "id": 3,
      "name": "Soda Water - Club Soda, 355 Ml",
      "price": 97.67,
      "count": 21,
      "image": "https://picsum.photos/id/3/200/200"
    },
    {
      "id": 4,
      "name": "Potatoes - Pei 10 Oz",
      "price": 47.22,
      "count": 0,
      "image": "https://picsum.photos/id/4/200/200"
    },
    {
      "id": 5,
      "name": "Pastry - Apple Muffins - Mini",
      "price": 7.03,
      "count": 17,
      "image": "https://picsum.photos/id/5/200/200"
    },
    {
      "id": 6,
      "name": "Shrimp - Black Tiger 6 - 8",
      "price": 70.94,
      "count": 1,
      "image": "https://picsum.photos/id/6/200/200"
    },
    {
      "id": 7,
      "name": "Carbonated Water - Blackcherry",
      "price": 35.38,
      "count": 8,
      "image": "https://picsum.photos/id/7/200/200"
    },
    {
      "id": 8,
      "name": "Veal Inside - Provimi",
      "price": 76.7,
      "count": 3,
      "image": "https://picsum.photos/id/8/200/200"
    },
    {
      "id": 9,
      "name": "Southern Comfort",
      "price": 26.88,
      "count": 8,
      "image": "https://picsum.photos/id/9/200/200"
    },
    {
      "id": 10,
      "name": "Bread - Sour Sticks With Onion",
      "price": 98.76,
      "count": 23,
      "image": "https://picsum.photos/id/10/200/200"
    },
    {
      "id": 11,
      "name": "Langers - Mango Nectar",
      "price": 40.75,
      "count": 23,
      "image": "https://picsum.photos/id/11/200/200"
    },
    {
      "id": 12,
      "name": "Wine - Barolo Fontanafredda",
      "price": 78.73,
      "count": 15,
      "image": "https://picsum.photos/id/12/200/200"
    },
    {
      "id": 13,
      "name": "Beets - Golden",
      "price": 75.77,
      "count": 23,
      "image": "https://picsum.photos/id/13/200/200"
    },
    {
      "id": 14,
      "name": "Pomegranates",
      "price": 80.55,
      "count": 21,
      "image": "https://picsum.photos/id/14/200/200"
    },
    {
      "id": 15,
      "name": "Vinegar - Champagne",
      "price": 34.69,
      "count": 18,
      "image": "https://picsum.photos/id/15/200/200"
    },
    {
      "id": 16,
      "name": "Muffin - Banana Nut Individual",
      "price": 60.36,
      "count": 2,
      "image": "https://picsum.photos/id/16/200/200"
    },
    {
      "id": 17,
      "name": "Wine - Harrow Estates, Vidal",
      "price": 25.83,
      "count": 2,
      "image": "https://picsum.photos/id/17/200/200"
    },
    {
      "id": 18,
      "name": "Pepper - Cubanelle",
      "price": 62.38,
      "count": 12,
      "image": "https://picsum.photos/id/18/200/200"
    },
    {
      "id": 19,
      "name": "Scallops 60/80 Iqf",
      "price": 19.86,
      "count": 11,
      "image": "https://picsum.photos/id/19/200/200"
    },
    {
      "id": 20,
      "name": "Praline Paste",
      "price": 70.86,
      "count": 12,
      "image": "https://picsum.photos/id/20/200/200"
    },
    {
      "id": 21,
      "name": "Parsley Italian - Fresh",
      "price": 36.45,
      "count": 18,
      "image": "https://picsum.photos/id/21/200/200"
    },
    {
      "id": 22,
      "name": "Cheese - Brie, Cups 125g",
      "price": 98.93,
      "count": 22,
      "image": "https://picsum.photos/id/22/200/200"
    },
    {
      "id": 23,
      "name": "Bread - Pullman, Sliced",
      "price": 23.97,
      "count": 14,
      "image": "https://picsum.photos/id/23/200/200"
    },
    {
      "id": 24,
      "name": "Apple - Fuji",
      "price": 69.3,
      "count": 10,
      "image": "https://picsum.photos/id/24/200/200"
    },
    {
      "id": 25,
      "name": "Sobe - Tropical Energy",
      "price": 64.23,
      "count": 14,
      "image": "https://picsum.photos/id/25/200/200"
    },
    {
      "id": 26,
      "name": "Plasticforkblack",
      "price": 78.24,
      "count": 18,
      "image": "https://picsum.photos/id/26/200/200"
    },
    {
      "id": 27,
      "name": "Broom And Brush Rack Black",
      "price": 29.33,
      "count": 6,
      "image": "https://picsum.photos/id/27/200/200"
    },
    {
      "id": 28,
      "name": "Yeast Dry - Fermipan",
      "price": 53.18,
      "count": 18,
      "image": "https://picsum.photos/id/28/200/200"
    },
    {
      "id": 29,
      "name": "Nutmeg - Ground",
      "price": 19.96,
      "count": 10,
      "image": "https://picsum.photos/id/29/200/200"
    },
    {
      "id": 30,
      "name": "Lotus Root",
      "price": 17.39,
      "count": 18,
      "image": "https://picsum.photos/id/30/200/200"
    },
    {
      "id": 31,
      "name": "Shark - Loin",
      "price": 2.01,
      "count": 8,
      "image": "https://picsum.photos/id/31/200/200"
    },
    {
      "id": 32,
      "name": "The Pop Shoppe Pinapple",
      "price": 4.96,
      "count": 15,
      "image": "https://picsum.photos/id/32/200/200"
    },
    {
      "id": 33,
      "name": "Wine - White, Mosel Gold",
      "price": 3.46,
      "count": 23,
      "image": "https://picsum.photos/id/33/200/200"
    },
    {
      "id": 34,
      "name": "Beef - Bresaola",
      "price": 94.51,
      "count": 13,
      "image": "https://picsum.photos/id/34/200/200"
    },
    {
      "id": 35,
      "name": "Juice - Grape, White",
      "price": 51.4,
      "count": 21,
      "image": "https://picsum.photos/id/35/200/200"
    },
    {
      "id": 36,
      "name": "Pepper - Jalapeno",
      "price": 6.2,
      "count": 13,
      "image": "https://picsum.photos/id/36/200/200"
    },
    {
      "id": 37,
      "name": "Raspberries - Fresh",
      "price": 92.95,
      "count": 22,
      "image": "https://picsum.photos/id/37/200/200"
    },
    {
      "id": 38,
      "name": "Pie Filling - Cherry",
      "price": 87.44,
      "count": 2,
      "image": "https://picsum.photos/id/38/200/200"
    },
    {
      "id": 39,
      "name": "Rabbit - Saddles",
      "price": 22.94,
      "count": 18,
      "image": "https://picsum.photos/id/39/200/200"
    },
    {
      "id": 40,
      "name": "Onions - Red Pearl",
      "price": 54,
      "count": 13,
      "image": "https://picsum.photos/id/40/200/200"
    },
    {
      "id": 41,
      "name": "Ginger - Ground",
      "price": 41.86,
      "count": 22,
      "image": "https://picsum.photos/id/41/200/200"
    },
    {
      "id": 42,
      "name": "Syrup - Monin - Blue Curacao",
      "price": 30.42,
      "count": 1,
      "image": "https://picsum.photos/id/42/200/200"
    },
    {
      "id": 43,
      "name": "Pasta - Penne Primavera, Single",
      "price": 50.07,
      "count": 8,
      "image": "https://picsum.photos/id/43/200/200"
    },
    {
      "id": 44,
      "name": "Appetizer - Crab And Brie",
      "price": 71.83,
      "count": 14,
      "image": "https://picsum.photos/id/44/200/200"
    },
    {
      "id": 45,
      "name": "Vinegar - Tarragon",
      "price": 89.38,
      "count": 19,
      "image": "https://picsum.photos/id/45/200/200"
    },
    {
      "id": 46,
      "name": "Jolt Cola",
      "price": 53.29,
      "count": 18,
      "image": "https://picsum.photos/id/46/200/200"
    },
    {
      "id": 47,
      "name": "Cattail Hearts",
      "price": 95.41,
      "count": 22,
      "image": "https://picsum.photos/id/47/200/200"
    },
    {
      "id": 48,
      "name": "Parsley - Dried",
      "price": 48.96,
      "count": 20,
      "image": "https://picsum.photos/id/48/200/200"
    },
    {
      "id": 49,
      "name": "Baking Soda",
      "price": 14.4,
      "count": 4,
      "image": "https://picsum.photos/id/49/200/200"
    },
    {
      "id": 50,
      "name": "Tomatoes - Grape",
      "price": 15.38,
      "count": 17,
      "image": "https://picsum.photos/id/50/200/200"
    },
    {
      "id": 51,
      "name": "Hinge W Undercut",
      "price": 41.95,
      "count": 2,
      "image": "https://picsum.photos/id/51/200/200"
    },
    {
      "id": 52,
      "name": "Veal - Striploin",
      "price": 5.63,
      "count": 16,
      "image": "https://picsum.photos/id/52/200/200"
    },
    {
      "id": 53,
      "name": "Beans - Kidney White",
      "price": 78.87,
      "count": 3,
      "image": "https://picsum.photos/id/53/200/200"
    },
    {
      "id": 54,
      "name": "Energy Drink - Redbull 355ml",
      "price": 32.97,
      "count": 22,
      "image": "https://picsum.photos/id/54/200/200"
    },
    {
      "id": 55,
      "name": "Wine - Shiraz South Eastern",
      "price": 9.84,
      "count": 24,
      "image": "https://picsum.photos/id/55/200/200"
    },
    {
      "id": 56,
      "name": "Pork - Sausage, Medium",
      "price": 71.17,
      "count": 0,
      "image": "https://picsum.photos/id/56/200/200"
    },
    {
      "id": 57,
      "name": "Scallops - Live In Shell",
      "price": 68.83,
      "count": 15,
      "image": "https://picsum.photos/id/57/200/200"
    },
    {
      "id": 58,
      "name": "Dome Lid Clear P92008h",
      "price": 93.02,
      "count": 5,
      "image": "https://picsum.photos/id/58/200/200"
    },
    {
      "id": 59,
      "name": "Butter - Unsalted",
      "price": 71.82,
      "count": 17,
      "image": "https://picsum.photos/id/59/200/200"
    },
    {
      "id": 60,
      "name": "Lentils - Green, Dry",
      "price": 81.87,
      "count": 13,
      "image": "https://picsum.photos/id/60/200/200"
    },
    {
      "id": 61,
      "name": "Apples - Sliced / Wedge",
      "price": 99.56,
      "count": 13,
      "image": "https://picsum.photos/id/61/200/200"
    },
    {
      "id": 62,
      "name": "Bok Choy - Baby",
      "price": 15.72,
      "count": 18,
      "image": "https://picsum.photos/id/62/200/200"
    },
    {
      "id": 63,
      "name": "Tarragon - Primerba, Paste",
      "price": 86.96,
      "count": 7,
      "image": "https://picsum.photos/id/63/200/200"
    },
    {
      "id": 64,
      "name": "Scotch - Queen Anne",
      "price": 96.8,
      "count": 9,
      "image": "https://picsum.photos/id/64/200/200"
    },
    {
      "id": 65,
      "name": "Gatorade - Fruit Punch",
      "price": 93.32,
      "count": 15,
      "image": "https://picsum.photos/id/65/200/200"
    },
    {
      "id": 66,
      "name": "Chocolate Bar - Coffee Crisp",
      "price": 93.8,
      "count": 24,
      "image": "https://picsum.photos/id/66/200/200"
    },
    {
      "id": 67,
      "name": "Lemons",
      "price": 13.39,
      "count": 1,
      "image": "https://picsum.photos/id/67/200/200"
    },
    {
      "id": 68,
      "name": "Orange Roughy 4/6 Oz",
      "price": 12.05,
      "count": 23,
      "image": "https://picsum.photos/id/68/200/200"
    },
    {
      "id": 69,
      "name": "Bread - Italian Roll With Herbs",
      "price": 54.16,
      "count": 24,
      "image": "https://picsum.photos/id/69/200/200"
    },
    {
      "id": 70,
      "name": "Cheese - Boursin, Garlic / Herbs",
      "price": 50.64,
      "count": 1,
      "image": "https://picsum.photos/id/70/200/200"
    },
    {
      "id": 71,
      "name": "Pie Shell - 9",
      "price": 67.06,
      "count": 24,
      "image": "https://picsum.photos/id/71/200/200"
    },
    {
      "id": 72,
      "name": "Chocolate Bar - Reese Pieces",
      "price": 64.19,
      "count": 7,
      "image": "https://picsum.photos/id/72/200/200"
    },
    {
      "id": 73,
      "name": "Sauce - Ranch Dressing",
      "price": 2.64,
      "count": 5,
      "image": "https://picsum.photos/id/73/200/200"
    },
    {
      "id": 74,
      "name": "Soap - Mr.clean Floor Soap",
      "price": 24.85,
      "count": 24,
      "image": "https://picsum.photos/id/74/200/200"
    },
    {
      "id": 75,
      "name": "Cookies - Fortune",
      "price": 32.46,
      "count": 5,
      "image": "https://picsum.photos/id/75/200/200"
    },
    {
      "id": 76,
      "name": "Bread Bowl Plain",
      "price": 95.5,
      "count": 6,
      "image": "https://picsum.photos/id/76/200/200"
    },
    {
      "id": 77,
      "name": "Duck - Legs",
      "price": 2.88,
      "count": 10,
      "image": "https://picsum.photos/id/77/200/200"
    },
    {
      "id": 78,
      "name": "Beef - Flank Steak",
      "price": 65.47,
      "count": 4,
      "image": "https://picsum.photos/id/78/200/200"
    },
    {
      "id": 79,
      "name": "Compound - Mocha",
      "price": 77.2,
      "count": 15,
      "image": "https://picsum.photos/id/79/200/200"
    },
    {
      "id": 80,
      "name": "Napkin White",
      "price": 72.98,
      "count": 6,
      "image": "https://picsum.photos/id/80/200/200"
    },
    {
      "id": 81,
      "name": "Muffin - Carrot Individual Wrap",
      "price": 41.87,
      "count": 24,
      "image": "https://picsum.photos/id/81/200/200"
    },
    {
      "id": 82,
      "name": "Onions - Green",
      "price": 51.39,
      "count": 18,
      "image": "https://picsum.photos/id/82/200/200"
    },
    {
      "id": 83,
      "name": "Sugar - Palm",
      "price": 45.6,
      "count": 22,
      "image": "https://picsum.photos/id/83/200/200"
    },
    {
      "id": 84,
      "name": "Water - Aquafina Vitamin",
      "price": 78.98,
      "count": 21,
      "image": "https://picsum.photos/id/84/200/200"
    },
    {
      "id": 85,
      "name": "Vinegar - White",
      "price": 5.63,
      "count": 8,
      "image": "https://picsum.photos/id/85/200/200"
    },
    {
      "id": 86,
      "name": "Pancetta",
      "price": 37.43,
      "count": 20,
      "image": "https://picsum.photos/id/86/200/200"
    },
    {
      "id": 87,
      "name": "Pasta - Canelloni, Single Serve",
      "price": 21.59,
      "count": 1,
      "image": "https://picsum.photos/id/87/200/200"
    },
    {
      "id": 88,
      "name": "Skirt - 24 Foot",
      "price": 55.57,
      "count": 11,
      "image": "https://picsum.photos/id/88/200/200"
    },
    {
      "id": 89,
      "name": "Flour - Masa De Harina Mexican",
      "price": 49.65,
      "count": 10,
      "image": "https://picsum.photos/id/89/200/200"
    },
    {
      "id": 90,
      "name": "Soup - Beef, Base Mix",
      "price": 31.36,
      "count": 11,
      "image": "https://picsum.photos/id/90/200/200"
    },
    {
      "id": 91,
      "name": "Juice - Propel Sport",
      "price": 53.69,
      "count": 22,
      "image": "https://picsum.photos/id/91/200/200"
    },
    {
      "id": 92,
      "name": "Puree - Passion Fruit",
      "price": 36.87,
      "count": 14,
      "image": "https://picsum.photos/id/92/200/200"
    },
    {
      "id": 93,
      "name": "Lentils - Red, Dry",
      "price": 25.1,
      "count": 3,
      "image": "https://picsum.photos/id/93/200/200"
    },
    {
      "id": 94,
      "name": "Water - Aquafina Vitamin",
      "price": 49.9,
      "count": 3,
      "image": "https://picsum.photos/id/94/200/200"
    },
    {
      "id": 95,
      "name": "Chicken Giblets",
      "price": 33.98,
      "count": 25,
      "image": "https://picsum.photos/id/95/200/200"
    },
    {
      "id": 96,
      "name": "The Pop Shoppe - Cream Soda",
      "price": 60.67,
      "count": 25,
      "image": "https://picsum.photos/id/96/200/200"
    },
    {
      "id": 97,
      "name": "Eggplant - Baby",
      "price": 94.61,
      "count": 0,
      "image": "https://picsum.photos/id/98/200/200"
    },
    {
      "id": 98,
      "name": "Muffin Hinge 117n",
      "price": 43.91,
      "count": 6,
      "image": "https://picsum.photos/id/98/200/200"
    },
    {
      "id": 99,
      "name": "Cheese - Camembert",
      "price": 66.5,
      "count": 9,
      "image": "https://picsum.photos/id/99/200/200"
    },
    {
      "id": 100,
      "name": "Tendrils - Baby Pea, Organic",
      "price": 38.27,
      "count": 18,
      "image": "https://picsum.photos/id/100/200/200"
    }
  ]
}