{
  "users": [
    {
      "name": "Anna Conda",
      "age": 44,
      "id": 1
    },
    {
      "name": "Ana Gram X",
      "age": 46,
      "id": 4
    },
    {
      "name": "Justing Time",
      "age": 23,
      "id": 5
    }
  ]
}