id,name,price,itemsInStock,modificationDate
1,Integra,451.52,4,2018-09-20
2,Golf III,617.09,0,2018-05-16
3,Grand Marquis,314.08,8,2018-11-17
4,911,556.23,4,2018-10-27
5,GLC,335.42,3,2019-02-04
6,Caprice Classic,483.92,7,2018-09-10
7,Escort,478.58,6,2018-07-26
8,Ram 1500 Club,462.13,0,2018-04-17
9,M Roadster,504.33,2,2018-06-22
10,Neon,384.59,10,2019-01-04
11,F-Series,681.15,5,2018-08-05
12,Cirrus,450.54,7,2018-11-10
13,GTO,550.48,9,2018-07-04
14,Genesis Coupe,581.64,0,2018-08-17
15,GTI,371.61,8,2018-05-03
16,Savana 2500,471.38,1,2018-09-23
17,Eurovan,611.56,4,2019-03-24
18,G3,629.13,6,2018-09-27
19,Sprinter 3500,477.51,6,2019-02-06
20,C70,504.21,7,2018-06-28
21,Mirage,480.28,9,2019-01-21
22,Envoy,395.9,2,2018-12-06
23,Wrangler,605.74,3,2018-10-12
24,Probe,454.98,7,2019-01-29
25,RL,630.95,9,2018-12-05
26,Ram 1500 Club,427.2,4,2018-11-27
27,LTD Crown Victoria,384.75,8,2018-10-21
28,Stratus,492.77,7,2019-02-12
29,MX-3,462.81,8,2018-10-23
30,TT,118.2,10,2019-01-28
31,Skyhawk,590.86,7,2018-05-04
32,Sierra 1500,431.27,6,2018-08-22
33,Touareg,570.15,7,2018-06-04
34,Elan,657.67,9,2019-01-29
35,Range Rover Evoque,516.31,8,2018-04-24
36,C30,714.65,9,2018-04-21
37,TrailBlazer,478.83,6,2018-08-30
38,F350,499.55,9,2018-11-04
39,Riviera,410.78,7,2019-02-13
40,QX,253.93,6,2018-04-19
41,M5,603.42,6,2018-06-16
42,Ram 2500,422.17,3,2018-04-27
43,Prizm,606.65,8,2018-05-12
44,Prelude,503.1,4,2018-05-07
45,XJ Series,424.42,6,2018-05-29
46,Brougham,516.29,7,2018-07-22
47,Intrepid,615.32,10,2019-03-21
48,Prizm,431.44,1,2018-09-19
49,RX-7,576.31,4,2018-05-04
50,S-Series,330.62,7,2018-12-05
51,SC,360.42,0,2018-10-23
52,Canyon,470.33,9,2019-01-20
53,X5,425.82,7,2018-07-29
54,Sprinter 3500,418.3,6,2018-08-23
55,Continental GTC,523.42,1,2018-12-03
56,350Z,587.78,7,2019-01-21
57,JX,565.94,5,2019-01-01
58,Express,474.64,1,2018-09-28
59,del Sol,633.56,8,2018-10-03
60,CX-7,481.15,0,2018-09-03
61,Suburban 2500,545.68,10,2018-04-16
62,MR2,492.24,9,2018-05-07
63,XLR-V,534.14,2,2018-08-20
64,IS,501.4,3,2018-09-01
65,Galant,666.33,5,2019-01-18
66,Outlander,489.91,3,2018-06-16
67,911,471.6,6,2019-03-16
68,Cougar,462.2,10,2018-08-19
69,B-Series,529.94,4,2019-02-10
70,Relay,597.91,0,2018-05-10
71,Sedona,424.69,4,2018-08-15
72,Eldorado,428.19,1,2018-05-25
73,S-Type,384.35,0,2018-07-09
74,Grand Am,401.24,5,2019-01-13
75,3 Series,390.25,7,2018-05-25
76,M3,477.99,0,2018-07-29
77,Aspen,448.09,1,2018-10-14
78,Optima,525.71,5,2018-07-05
79,929,386.37,8,2018-05-15
80,Express 1500,378.26,7,2019-02-22
81,D150 Club,589.1,7,2019-01-26
82,Suburban 1500,653.12,6,2019-01-04
83,Freestar,529.22,10,2019-02-01
84,Continental,515.15,4,2018-07-08
85,TT,538.64,7,2019-02-27
86,E-Class,507.76,7,2018-11-06
87,Skyhawk,387.31,6,2018-10-13
88,Sierra 1500,569.47,5,2019-03-21
89,Summit,564.36,0,2019-03-22
90,LTD Crown Victoria,383.05,6,2018-10-08
91,Ranger,438.28,2,2018-04-22
92,850,475.9,9,2018-04-27
93,Bronco II,467.64,1,2018-08-28
94,Chariot,286.12,1,2018-10-19
95,Sentra,551.92,9,2019-01-07
96,Optima,611.46,8,2018-11-16
97,Cougar,604.53,2,2019-02-16
98,Venture,607.02,10,2018-12-20
99,Ram 1500 Club,597.75,5,2018-10-28
100,400SEL,431.89,6,2018-11-14
