name;price;items;modified
Wine - Shiraz South Eastern;914.49;9;2017-01-04 00:39:58
Pepper - Black, Ground;807.78;22;2017-11-10 03:45:15
Pomello;230.73;21;2017-02-24 07:36:18
Cheese - Pont Couvert;491.02;13;2017-04-03 00:13:36
Straws - Cocktale;650.97;12;2017-04-18 13:42:30
Bacardi Mojito;782.81;3;2017-05-20 16:24:20
Tart - Pecan Butter Squares;510.51;19;2017-09-29 22:59:28
Cilantro / Coriander - Fresh;262.06;24;2017-02-24 03:27:26
Pasta - Agnolotti - Butternut;957.72;13;2017-01-31 22:43:00
Shrimp - 16/20, Iqf, Shell On;663.35;21;2017-09-02 16:58:51
Oyster - In Shell;206.96;13;2017-02-09 03:50:20
Kirsch - Schloss;774.21;13;2017-02-27 19:33:25
Gatorade - Orange;315.33;18;2017-07-16 10:48:06
Beer - Sleemans Cream Ale;965.64;24;2017-07-13 05:26:09
Lamb - Whole Head Off,nz;247.32;0;2017-11-17 04:58:50
Jolt Cola;175.78;5;2017-09-18 17:39:41
Sauerkraut;179.03;23;2017-11-27 03:19:53
Beef - Kobe Striploin;625.23;18;2017-08-04 09:54:19
Flavouring - Raspberry;611.32;4;2017-06-17 17:03:46
Soup - Base Broth Beef;446.15;1;2017-05-24 07:03:18
Mousse - Mango;896.15;2;2017-11-01 03:28:51
Wine - Periguita Fonseca;238.69;10;2017-09-24 22:29:36
Pork Casing;516.80;6;2017-07-07 16:44:08
Rice Paper;710.01;4;2017-06-09 20:03:48
Olives - Kalamata;455.38;24;2017-11-07 01:48:32
Butter - Pod;215.44;0;2017-03-19 12:40:22
Shrimp - 16/20, Iqf, Shell On;421.03;24;2017-04-09 17:44:22
Pepper - Paprika, Spanish;384.52;20;2017-06-04 01:37:30
Uniform Linen Charge;950.83;19;2017-03-26 15:18:49
Knife Plastic - White;782.99;7;2017-02-01 17:00:31
Propel Sport Drink;176.79;1;2017-07-09 05:52:39
Steampan - Lid For Half Size;943.25;5;2017-04-01 12:43:52
Ham - Proscuitto;975.41;10;2017-09-03 21:52:54
Syrup - Golden, Lyles;156.72;18;2017-01-10 00:39:16
Appetizer - Cheese Bites;236.97;20;2017-09-17 21:22:23
Capicola - Hot;165.93;4;2017-07-26 15:13:06
Pasta - Fettuccine, Egg, Fresh;494.25;22;2017-11-17 01:47:23
Beef - Rib Roast, Capless;958.33;21;2017-10-20 12:57:10
Cake - Miini Cheesecake Cherry;695.32;3;2017-01-25 06:50:47
Pasta - Cannelloni, Sheets, Fresh;912.20;11;2017-10-07 10:27:06
Club Soda - Schweppes, 355 Ml;494.80;2;2017-07-17 21:13:33
Plastic Arrow Stir Stick;549.67;9;2017-11-24 03:30:14
Capon - Breast, Double, Wing On;181.28;2;2017-05-29 02:45:58
Crackers Cheez It;470.19;15;2017-05-27 14:41:20
Bread - Pullman, Sliced;385.17;19;2017-11-14 16:37:23
Beer - Pilsner Urquell;916.46;6;2017-03-19 11:14:53
Ham - Smoked, Bone - In;231.74;17;2017-04-05 21:23:15
Mustard - Seed;456.39;22;2017-05-25 17:15:29
Beets - Pickled;671.21;5;2017-10-31 10:16:26
Tomatoes;929.02;16;2017-05-04 10:32:34
Shrimp - 150 - 250;574.41;1;2017-04-09 12:41:40
Lid Coffee Cup 8oz Blk;350.53;9;2017-04-15 20:19:39
Longan;801.16;13;2017-01-22 23:08:47
Vinegar - Raspberry;384.43;22;2017-09-29 22:36:01
Wasabi Paste;545.58;11;2017-08-23 01:44:31
Bread - French Stick;708.80;20;2017-01-17 01:29:20
V8 - Tropical Blend;435.59;7;2017-07-04 18:21:39
Pork - Sausage Casing;292.78;1;2017-06-09 09:55:52
Bacardi Raspberry;772.48;8;2017-09-01 16:22:31
Coffee - Egg Nog Capuccino;344.31;0;2017-03-11 09:21:28
Bread - Pita, Mini;450.07;6;2017-09-06 23:39:14
Parsnip;536.75;17;2017-09-12 13:44:39
Lemonade - Strawberry, 591 Ml;759.77;10;2017-05-11 20:45:45
Milk - Chocolate 250 Ml;386.14;13;2017-05-08 12:21:58
Temperature Recording Station;166.58;5;2017-02-08 17:14:02
Champagne - Brights, Dry;733.30;17;2017-07-22 13:34:30
Veal - Heart;979.85;10;2017-08-22 19:26:34
Bread - Corn Muffaletta;173.35;12;2017-08-20 11:59:13
Chicken Breast Halal;450.94;4;2017-06-17 19:58:28
Thyme - Dried;586.53;1;2017-01-06 15:15:24
Devonshire Cream;347.97;21;2017-09-21 17:53:21
Doilies - 8, Paper;945.47;15;2017-11-25 11:40:16
Ice Cream Bar - Oreo Cone;431.53;12;2017-12-06 04:01:50
Wine - Soave Folonari;529.41;1;2017-08-27 19:30:04
Stainless Steel Cleaner Vision;214.75;14;2017-06-27 15:08:37
Cheese - Cheddar, Mild;959.11;0;2017-04-03 14:43:44
Pants Custom Dry Clean;707.73;14;2017-08-05 23:47:40
Nantucket - 518ml;385.06;20;2017-09-30 17:31:55
Wine - Crozes Hermitage E.;223.37;10;2017-10-23 14:21:07
Tea - Lemon Scented;467.60;6;2017-10-12 03:28:18
Chinese Lemon Pork;153.13;0;2017-12-29 12:19:59
Appetizer - Chicken Satay;682.01;3;2017-01-01 06:56:07
Butter Ripple - Phillips;261.18;13;2017-08-11 18:13:58
Ice Cream - Chocolate;114.92;19;2017-09-06 22:22:05
Fish - Halibut, Cold Smoked;914.77;2;2017-05-13 19:53:19
Nut - Walnut, Pieces;559.16;2;2017-08-03 14:48:23
Wine - Bouchard La Vignee Pinot;575.93;16;2017-12-04 13:16:32
Apple - Macintosh;388.45;14;2017-12-28 10:15:12
Sausage - Breakfast;122.12;25;2017-08-14 20:33:56
Lettuce - Romaine, Heart;749.88;6;2017-05-22 21:12:21
Soup Bowl Clear 8oz92008;537.04;18;2017-12-12 15:40:47
Lid - High Heat, Super Clear;145.02;6;2017-12-30 04:31:24
Corn - On The Cob;580.69;25;2017-05-19 10:00:55
Bread - Triangle White;238.68;18;2017-12-22 17:18:42
Yeast Dry - Fermipan;820.57;6;2017-05-01 06:36:06
Cinnamon - Stick;600.72;12;2017-03-06 05:42:00
Juice - Orange, 341 Ml;477.96;0;2017-08-21 05:52:45
Papadam;210.54;21;2017-07-10 02:22:32
Tomatoes Tear Drop Yellow;616.03;14;2017-03-04 04:37:01
Appetizer - Mini Egg Roll, Shrimp;375.18;18;2017-07-11 12:44:11
