name,gender,age,postcode
Christean Sparshett,Female,64,45474
Ricky Dyter,Male,44,52609
Allissa Whitley,Female,16,46133
Perceval Goundrill,Male,35,60963
Zeke Rentoll,Male,63,39872
Janis Postill,Female,35,54721
Joye Beadles,Female,80,77827
Valdemar Oakeby,Male,69,36493
Bettina Wardhaugh,Female,70,74198
Guillermo Brothers,Male,22,91180
Rutter Klos,Male,18,28653
Layne Riddett,Female,30,11369
Margy Lyddyard,Female,32,13197
Sarena Grigsby,Female,42,72355
Alayne Pyott,Female,20,46462
Brittaney Tiffin,Female,64,11297
Urbanus Dodwell,Male,76,70711
Debora De'Vere - Hunt,Female,78,82204
Hazel Lambdean,Female,72,42521
Godfry Knappitt,Male,44,94057
Marcel Judson,Male,62,55974
Ula Mathiot,Female,22,49860
Hiram Halladey,Male,16,41523
Salli Strickland,Female,75,80395
Jennifer Titcombe,Female,19,16331
Stacey Woodruffe,Female,65,19039
Ophelia Tomankowski,Female,29,29324
Carmon Adamowicz,Female,59,52732
Elwin Posselow,Male,56,18464
Spence Mepham,Male,39,74540
Jess Grills,Male,56,56081
Lancelot Malyj,Male,68,46013
Berk Limrick,Male,47,40009
Ainslie Alebrooke,Female,57,77594
Robinet Shirlaw,Female,23,80774
Murry Isakovitch,Male,77,95358
Evonne Pock,Female,53,31248
Kristoffer Colly,Male,20,36257
Rebe Hairsnape,Female,50,74362
Free Alexsandrov,Male,58,96650
Kally Staig,Female,67,65214
Katine Glaister,Female,39,67509
Binky Brasted,Male,79,31979
Bobbe Staries,Female,25,69767
Lonny Chant,Male,46,51607
Alfy Nutman,Female,19,96287
Royal Docker,Male,73,12231
Jerrylee Hammant,Female,26,99520
Donnamarie Laurent,Female,55,33946
Hinda Copnell,Female,35,91211
Kimberli Holtum,Female,18,69072
Katinka Alvis,Female,43,21933
Robenia Soan,Female,74,74042
Adella Privett,Female,27,98630
Inglebert Arderne,Male,26,35388
Cam Baruch,Male,35,98153
Arnie Piolli,Male,53,10851
Chiquita Alfonzo,Female,73,96809
Carleen Hatherall,Female,79,35250
Darrel McCarry,Male,69,55996
Giovanni Clougher,Male,46,49670
Jennica Syce,Female,62,10834
Karlene Triplet,Female,71,56567
Krissie Cruden,Female,57,47601
Alexi Lines,Female,57,82303
Felizio Burwood,Male,37,79333
Rici Haggish,Female,19,83373
Laural Marien,Female,29,23791
Hildegaard Killingworth,Female,52,16171
Saree Montez,Female,25,64690
Bucky Vanacci,Male,64,58960
Sanders Styche,Male,77,44993
Brannon Moughton,Male,58,68225
Torey Gabel,Female,46,11450
Roderic Coolahan,Male,18,89190
Gabe Postance,Male,62,39795
Prudence Norquoy,Female,69,67375
Susette Pargiter,Female,72,38598
Danny Clemenzo,Female,69,20415
Will Leeson,Male,28,43054
Zsa zsa Thurman,Female,55,33055
Miles Audley,Male,24,31210
Patton Petrelluzzi,Male,23,51017
Luelle Bavister,Female,71,95254
Chrysler Elsey,Female,59,73696
Brooke Penke,Female,53,91652
Annelise Shellibeer,Female,70,40139
Amberly Bunt,Female,75,81912
Clyde Fincken,Male,45,21966
Roselin Grasha,Female,22,51099
Corbin Glawsop,Male,18,22640
Frederica Aloshkin,Female,16,91544
Donella Gilardi,Female,16,76185
Joanna Fruish,Female,22,76008
Herrick Degan,Male,50,91681
Hercules Staton,Male,33,40758
Trudi Aggio,Female,41,63562
Corrianne Brodbin,Female,66,67974
Burgess Nashe,Male,72,26375
Greg Labuschagne,Male,58,92369
Fonz Jirus,Male,45,42546
Reinaldos Rapa,Male,57,13773
Dulcia Zorzutti,Female,31,32363
Warde Hawker,Male,74,54903
Ursola Batha,Female,53,32122
Norton Wilde,Male,61,88187
Gilligan Jarritt,Female,21,71896
Jedidiah Paulsen,Male,33,10484
Conny O'Logan,Male,74,80475
Madge Boribal,Female,65,57946
Maynard Agastina,Male,64,32991
Niki Hazle,Male,50,42894
Beverie Tether,Female,37,55835
Cloris Jellybrand,Female,51,60061
Merna Philpott,Female,34,95628
Betty Tuckwell,Female,61,43039
Estevan Pitford,Male,75,19945
Phebe Nower,Female,43,77718
Filmore Lea,Male,17,59592
Krishna Whiteoak,Male,65,64283
Aveline Mingus,Female,46,35062
Merrel Ghelardi,Male,74,16725
Dalia Izakof,Female,33,64622
Raquela Kesper,Female,35,18123
Tomasine Dacre,Female,18,27734
Anatollo Horry,Male,23,70302
Torry Kliemchen,Male,29,81796
Jerrilyn Golightly,Female,46,12005
Rupert MacAlpine,Male,36,49786
Erda Ducker,Female,64,45876
Mischa Ashbee,Male,44,79636
Kellsie Tonn,Female,50,15941
Patsy Endrizzi,Male,18,75195
Sandie Eversley,Female,70,94846
Saunders Patise,Male,30,97129
Beniamino Josskowitz,Male,35,22095
Poppy Lowers,Female,48,88246
Willi Saffon,Female,26,52330
Lauritz Bagott,Male,73,40783
Bear McDermott-Row,Male,61,42671
Reamonn Bester,Male,30,49151
Margery Petrillo,Female,44,71621
Tawsha Bernadzki,Female,64,19085
Hobart Howood,Male,74,75031
Bernie Norree,Male,48,42887
Fawnia Treleven,Female,53,95978
Sarene Creak,Female,24,99729
Maxwell Slaymaker,Male,72,12029
Federico Wickling,Male,38,87432
Vitoria Brinsden,Female,72,64484
Elliot Raylton,Male,27,86336
Jenilee Daniello,Female,65,48178
Berny Menault,Female,29,23683
Palm Dagger,Male,63,57887
Sal Leonard,Female,60,79829
May Hitscher,Female,30,43202
Darb MacAlaster,Male,64,97452
Sondra McTiernan,Female,58,44434
Aundrea Sibborn,Female,30,67985
Mattie Gitthouse,Male,50,70032
Briana Dring,Female,52,44516
Leela Martinets,Female,20,79151
Clayborne Wyman,Male,16,32560
Lowrance Ort,Male,31,20199
Brook todor,Male,63,77136
Sallyann Coldham,Female,23,79444
Massimiliano Dowson,Male,35,57877
Katinka Bartak,Female,77,35270
Gilbert Arthars,Male,61,22428
Jacqueline Salliss,Female,43,45496
Estele McEvoy,Female,50,82807
Petronille Polland,Female,16,48765
Giraud Loughran,Male,42,21667
Joyan Hullock,Female,65,73897
Rodina Lepper,Female,26,80906
Ravi Alchin,Male,68,45933
Moishe Dawkins,Male,30,60388
Susy Start,Female,60,55128
Wendye Ronchka,Female,78,34864
Ailis Pennycord,Female,37,83851
Donnajean Yielding,Female,76,79752
Galven Anwell,Male,60,92517
Jeno Craigmile,Male,69,25787
Fitz Dumingos,Male,26,60100
Jonas Cutcliffe,Male,30,38907
Jeanette Heeley,Female,53,16679
Laurent Meacher,Male,39,18624
Conrade Bush,Male,45,18871
Gunther Reame,Male,47,99608
Maddy Fletham,Male,30,80788
Aurelea Garshore,Female,31,31415
Arne Caisley,Male,43,29827
Goober McSporon,Male,47,72133
Luisa Skerritt,Female,56,72177
Trumaine Sweetnam,Male,48,11187
Mirabelle Radwell,Female,29,72870
Cortie Aldin,Male,76,35176
Donica Martinec,Female,25,17936
Clio Kopacek,Female,74,57546
Zacharie Rozzier,Male,20,66267
Pietro Pelcheur,Male,47,98989
Magdaia Braferton,Female,58,58419
Rainer Cowl,Male,21,78638
Micheal Yorkston,Male,38,37352
Annamarie Ickovits,Female,30,94779
Stevie Palmar,Male,26,92216
Kinsley Dore,Male,59,16528
Thurstan Banes,Male,30,97542
Kippar Langwade,Male,35,80407
Mariska McMychem,Female,37,78720
Arnaldo Giannotti,Male,58,75442
Deck Abrahamson,Male,31,80611
Olenka Pallesen,Female,72,44846
Jenn Scimone,Female,40,77095
Cybill Roback,Female,24,42884
Reese Atwel,Male,20,14317
Cole Winckworth,Male,66,98060
Maribelle Ganley,Female,61,43306
Barbara-anne Janak,Female,16,74004
Mireielle Lamplugh,Female,38,32679
Juline Burnet,Female,19,34857
Alberto Braidford,Male,26,41739
Prescott Rignall,Male,47,68790
Kennie Coward,Male,43,21113
Abrahan Shorland,Male,27,88547
Lina Bastable,Female,37,47366
Sanford Heinert,Male,32,14423
Doreen Beardsell,Female,50,71808
Elisha Kimbrough,Male,44,80089
Hermann Oldaker,Male,57,68931
Karney Trass,Male,49,84110
Alfy David,Male,27,78592
Dory Axup,Male,80,19343
Garwin Menghi,Male,68,44067
Fanchon Bennedsen,Female,73,43134
Wells Jeduch,Male,25,61250
Iver Ricioppo,Male,65,35172
Caressa Dowd,Female,51,70234
Glendon Hedgeley,Male,68,83521
Obadias Trask,Male,56,76998
Paulie Antoszewski,Male,39,77660
Sig Stanfield,Male,42,12705
Alfy O'Scully,Female,21,22777
Isabella Meletti,Female,20,56727
Emyle Mulvihill,Female,55,72446
Rayner Sharp,Male,39,43503
Daile Carvil,Female,32,30423
Nari Rowcliffe,Female,33,34208
Stepha Mallatratt,Female,33,99151
Brita Ashwin,Female,78,28902
Halie Bodega,Female,78,21631
Tedd Warlawe,Male,60,16531
Maurits Myhan,Male,72,73185
Florri Sutherby,Female,28,68739
Johannes Craigg,Male,66,45626
Arlan Peregrine,Male,67,70111
Ebonee Brugsma,Female,50,68536
Alvy Sedman,Male,75,84134
Bret Gellately,Male,59,58013
Kinna Alpes,Female,38,45924
Hoyt Nias,Male,18,67599
Wells Chastel,Male,40,35657
Hephzibah Drewitt,Female,53,63006
Gardiner Astling,Male,37,44135
Ray Grisard,Male,43,83117
Holly Rides,Female,73,55478
Malena O'Doghesty,Female,58,82598
Suzy Snoxall,Female,76,52984
Petey Gatiss,Male,29,55065
Victoria Chiplin,Female,78,90667
Leonidas Lafferty,Male,27,44270
Hynda Growcock,Female,37,77673
Dennie Bravery,Male,72,22685
Stevy Henningham,Male,54,46716
Palm Gregore,Male,26,80302
Karon Marcam,Female,41,60369
Osbert Wimsett,Male,17,33187
Denny Couthard,Female,37,29007
Salmon Denes,Male,16,45639
Alfie Kydde,Male,80,72004
Bertrando Rollett,Male,59,51383
Charley Biswell,Male,32,57285
Joella Wheatley,Female,51,32447
Quinn Domelow,Male,46,24329
Melvyn Huchot,Male,39,73270
Terra Spalton,Female,25,14482
Davidde Joskowitz,Male,17,31735
Veronike Tuttiett,Female,79,90783
Elvera Brigham,Female,45,54481
Udall Spellicy,Male,39,65777
Prince Rennox,Male,46,47079
Aeriela Ackenson,Female,61,39382
Graham Peabody,Male,58,55713
Kelsi Baulk,Female,57,40427
Whitney Winny,Male,68,26815
Galven Bendall,Male,51,97128
Rosamond Zanutti,Female,77,71218
Nickolas Manifield,Male,77,44379
Orelee Andreoletti,Female,63,14840
Eolanda Elstow,Female,55,12384
Claude D'Elia,Female,71,27936
Nerty Wherton,Female,19,42775
Omar Chard,Male,23,15255
Kathlin Steagall,Female,37,60034
Belicia Fausset,Female,53,94748
Bryce Labadini,Male,77,94463
Jorge Merali,Male,43,57310
Tarrance Greenhead,Male,23,48688
Charmian Swanson,Female,62,46423
Blinny Simoens,Female,48,97012
Netta Dreamer,Female,64,36937
Brand Denyukin,Male,22,78832
Dulcine Baume,Female,23,23073
Giacomo Peirone,Male,38,95487
Claudine Speedin,Female,73,88189
Laughton Tschirasche,Male,61,38186
Demetria Oddy,Female,72,73661
Roselin Connock,Female,60,71015
Claudian Polsin,Male,50,99652
Bev Kytley,Male,69,14248
Feodor Fero,Male,41,31650
Stafford Jellings,Male,76,34850
Alf Dight,Male,16,14212
Lorilyn Sill,Female,55,84751
Hoebart Postle,Male,42,89311
Lorine Wooding,Female,67,67322
Goddart McKintosh,Male,77,23761
Prinz Getcliffe,Male,74,48125
Malynda Blackaller,Female,17,70852
Hartwell Ranstead,Male,47,16763
Barton Olman,Male,62,77784
Garreth Sprankling,Male,36,97500
Damiano Skull,Male,42,29347
Gunner Bossel,Male,68,68749
Raina Sterricks,Female,70,64297
Eleni Moodie,Female,45,61091
Gusti Wakeford,Female,28,54733
Gustie Matterface,Female,63,13712
Waly Bembrick,Female,17,67391
Mandy Brahms,Female,39,59233
Burch Cameron,Male,37,30903
Emiline Castells,Female,26,39444
Klarika Van Leijs,Female,18,10940
Thorny Rendell,Male,33,28196
Sara-ann Smythin,Female,64,18886
Winnifred Goldine,Female,61,25969
Jacquie Carnegie,Female,31,60866
Lucie Gatherell,Female,17,60047
Julian Ellor,Male,72,42767
Casandra Brydson,Female,49,99905
Clemente Hasluck,Male,62,25656
Fonz Blaskett,Male,22,42273
Fergus Pepis,Male,76,85886
Maxy Frift,Female,41,50257
Carilyn Hars,Female,40,93219
Wynny Plesing,Female,77,67574
Goldia Marquot,Female,55,93218
Jonah Calles,Male,52,43131
Cobb Beecraft,Male,60,59919
Cody Tissell,Female,54,46390
Camala Carslake,Female,50,23150
Alina Acott,Female,75,32464
Page Bindin,Male,67,39105
Teddie Lippatt,Male,41,69042
Lurette Fabbri,Female,45,98718
Blisse Maric,Female,58,38510
Ivor Foxen,Male,33,85128
Loni Penhall,Female,66,13770
Dierdre MacClancey,Female,47,51075
Alleyn Nutter,Male,52,54434
Margaret Bohea,Female,76,87295
Hester Ramalhete,Female,70,73778
Maddie Sharnock,Male,30,93666
Willdon Cornely,Male,55,19434
Yuma Baal,Male,46,53957
Joe Sutterby,Male,17,37185
Dare Joynt,Male,57,97832
Hurleigh Brinson,Male,72,54738
Curtis Stockle,Male,79,12460
Dal Dreger,Male,33,59329
Rochester Jeanel,Male,51,35377
Sisile Abramowitz,Female,66,59654
Brittney Duerdin,Female,64,52903
Tamarra Kirstein,Female,46,22298
Francis Flewan,Male,80,18571
Frants Warlock,Male,79,95754
Karlene Huckstepp,Female,69,91990
Ezmeralda Nuss,Female,52,88476
Clemmy Dabell,Male,64,98160
Raquela Lindsey,Female,47,67280
Jake Fominov,Male,39,19836
Ignatius Zanetto,Male,41,59317
Trudie Saiger,Female,22,45066
Bartlet Shapira,Male,69,61015
Aubree Slot,Female,66,79838
Yancy O'Halloran,Male,74,23900
Lee Gabala,Female,52,11066
Lotta Thain,Female,75,24941
Lauretta Louch,Female,77,26595
Roda Enderby,Female,58,77755
Jermaine Danielski,Female,22,91057
Sauveur Reichert,Male,58,29619
Verge Pieters,Male,36,16406
Jecho Lauderdale,Male,33,23282
Carolin Eagers,Female,38,30458
Tedie O'Cuddie,Male,23,11137
Rodrigo Hancke,Male,69,72995
Dennis Brack,Male,41,14682
Duane Baldery,Male,29,49986
Lynn Di Ruggero,Female,39,89965
Katharine Casiroli,Female,39,26968
Tersina Cheese,Female,57,96220
Phip Fidler,Male,22,52789
Clevey Cavanagh,Male,25,24431
Karilynn Rubinfeld,Female,24,64118
Daveta Dunnett,Female,70,62925
Bride Dowdney,Female,68,59897
Noreen Prattington,Female,35,59068
Rickard Crosfield,Male,76,68472
Thomasina Fudger,Female,49,99476
Pooh Housbie,Male,49,20024
Myrta Gurley,Female,65,44039
Thurston Fidgin,Male,49,76155
Hobey Neicho,Male,55,41663
Corena MacTrustie,Female,68,76473
Chrystel Otterwell,Female,47,53498
Carlo Stockney,Male,24,18127
Ransell Keddey,Male,20,92563
Vivienne Spafford,Female,52,42782
Ollie Rackam,Female,48,91037
West Mauchlen,Male,56,18320
Evin Pinnion,Male,49,30298
Ahmed Harpur,Male,70,81649
Stephen Worthington,Male,24,64223
Cynthia Fredson,Female,19,48955
Ronni Pechacek,Female,37,27974
Dalila Rushbury,Female,48,58747
Carlos Yekel,Male,51,23356
Amie Degnen,Female,78,85774
Gail Atkyns,Female,66,27421
Nye Marjanski,Male,56,66014
Toddy Reeme,Male,75,15548
Bethina Cruickshanks,Female,69,84106
Garv Slobom,Male,50,42937
Tymon Radolf,Male,67,85758
Boony Torresi,Male,35,75505
Jana Junkinson,Female,67,18223
Jesse Langrick,Female,19,17908
Sibbie Eberst,Female,77,54187
Ivonne Eltun,Female,48,98269
Vittorio Hasely,Male,37,69800
Fulton Davidge,Male,26,38403
Riva Westfield,Female,68,33041
Gayel Turk,Female,28,39433
Ralina Tuxell,Female,70,33615
Gratiana Edmons,Female,74,86045
Liv Dougher,Female,29,13186
Gino Schuricke,Male,18,30042
Casey Basil,Female,53,76141
Glory Mitcham,Female,20,96660
Javier Edgeson,Male,56,98403
Silvie Gransden,Female,21,45194
Joe Gorusso,Male,78,57920
Graig Pley,Male,19,83285
Edita Satch,Female,16,54506
Hallsy Davydkov,Male,46,40015
Jonathan Wicklin,Male,63,89476
Ezechiel Mulligan,Male,65,50349
Gareth Bellay,Male,76,48819
Kevin MacCaughey,Male,73,21646
Helenka Belden,Female,23,75412
Ariana Chantillon,Female,36,16017
Ford Larrad,Male,69,19409
Gigi Duplain,Female,72,58364
Patrica Caunce,Female,24,23019
Kelby Stollenhof,Male,59,78004
Ania Felder,Female,18,70316
Ned Serjeant,Male,67,42580
Tuckie Idill,Male,48,19731
Gennifer Sercombe,Female,64,55622
Rolland Ivanchikov,Male,43,93912
Giovanni Halvosen,Male,51,92856
Calvin Gazzard,Male,26,35088
Adolphus Dracksford,Male,46,78033
Kippar Afonso,Male,47,88436
Ailene Sennett,Female,58,95245
Ofella Mergue,Female,48,41140
Zelda Reynish,Female,51,65679
Waring Doodney,Male,56,89844
Gawain Cowherd,Male,16,64019
Fowler Denmead,Male,26,94947
Veda Aishford,Female,47,49307
Stoddard Wallace,Female,66,79886
Beaufort Milsted,Male,59,80873
Brady MacRanald,Male,70,64129
Kelila Blowers,Female,43,99532
Marco Mattam,Male,75,25738
West Firpi,Male,57,52689
Tanney Sowman,Male,25,99106
Richie Boyett,Male,79,80235
Zane Lis,Male,28,13512
Jolyn Prime,Female,33,34234
Kerry Patis,Female,72,48175
Sukey Peron,Female,48,74337
Royall Sayers,Male,17,22631
Bria Mothersole,Female,56,65560
Chaddy Castagne,Male,17,33859
Judon Gonthier,Male,34,20939
Leopold Jadczak,Male,65,68726
Clare Widdows,Female,34,24335
Rosmunda Dashkovich,Female,57,44267
Quinn Maycock,Male,66,98595
Sonni Withey,Female,56,74571
Carlee Dacke,Female,32,44298
Heywood Greser,Male,71,90825
Garek Roke,Male,78,17331
Jennine Frick,Female,20,25129
Maris Bennie,Female,63,15529
Cam Fairhurst,Female,55,91310
Price Mirfin,Male,67,74830
Anne-corinne Grima,Female,78,21823
Cobb Surmon,Male,39,73032
Gaynor Paddison,Female,39,65819
Ethelind Sate,Female,73,27430
Erskine Pughe,Male,34,39486
Elana Canet,Female,42,16052
Pamela Bebbell,Female,44,95160
Hadlee Aguilar,Male,33,67170
Cecilla Draijer,Female,31,95207
Bonnie Jeffcoat,Female,53,11126
Ruttger Lowrance,Male,39,22711
Vale Garrie,Female,17,72235
Berton Hillam,Male,38,91353
Reinald Turbat,Male,47,15679
Elora O'Keevan,Female,23,77853
Essie Houlston,Female,32,97615
Rupert Moakes,Male,21,56249
Lesley Worsham,Male,70,30659
Therese Powter,Female,80,56251
Hakim Peachman,Male,40,25817
Finn Hubbart,Male,27,18252
Jordanna Blaschke,Female,58,21918
Bendicty Hillatt,Male,39,88076
Dorothea Tidy,Female,35,59705
Ekaterina Tull,Female,79,81262
Norry Byram,Male,63,35360
Gavan Giorgeschi,Male,18,70363
Alley Febry,Male,68,23473
Angie Caulcott,Male,70,58124
Weston Costley,Male,60,36631
Granville Shera,Male,55,28384
Phil Drivers,Male,54,60091
Urson Brummell,Male,30,36390
Tabb Schiersch,Male,59,47824
Thekla Tabbitt,Female,64,40144
Joel Mercey,Male,17,75237
Radcliffe Bravery,Male,49,34477
Craggy Fort,Male,24,75628
Crawford Babalola,Male,21,65322
Nikoletta Shemmans,Female,32,61703
Rivi Cowderoy,Female,27,55476
Yanaton Hutcheon,Male,26,58906
Ned Carnachen,Male,22,49842
Trumann Pipe,Male,24,49242
Kassia Knowlton,Female,25,55332
Rori Redgewell,Female,73,24316
Olivia Zealey,Female,65,33310
Carmine Woakes,Male,23,97457
Kessia Blowing,Female,50,11584
Brook Staveley,Female,58,89931
Merrel O' Timony,Male,48,38473
Kaela Bunyard,Female,44,69875
Devondra Felce,Female,34,47754
Alanson Hannen,Male,73,22008
Inness McRill,Male,76,72402
Sterne Errington,Male,37,64363
Sayer Spurden,Male,17,50900
Gino Gonnely,Male,65,46293
Lory Rubinchik,Female,72,17093
Dorie Barratt,Male,70,92384
Jae Frayling,Male,34,73553
Renault Tinner,Male,53,26910
Lucilia Steabler,Female,37,88351
Heloise Hulls,Female,16,12426
Halsy Pellington,Male,45,29819
Ethelda Errichelli,Female,50,49744
Kev Worwood,Male,61,77411
Sunny Tunnacliffe,Female,27,92324
Chev Dahlman,Male,80,87872
Syman Milner,Male,62,71702
Bryanty Folbig,Male,23,70933
Vivianna Rivlin,Female,43,66370
Jerrine Wallege,Female,23,98845
Micky Arndtsen,Male,44,80849
Dominick Harvett,Male,31,98905
Yurik Quadling,Male,56,99189
Annaliese Kensley,Female,50,60613
Aurel Bamling,Female,31,58572
Brittan Leek,Female,24,62041
Adham Piscopo,Male,68,79458
Ranique Dallimore,Female,44,11771
Alister Misson,Male,16,50443
Lainey Treadgold,Female,43,49945
Brandi Persicke,Female,60,72667
Kimbell Murphy,Male,26,11738
Hubie Biggs,Male,64,86404
Janaya Fetter,Female,79,47124
Andrea Patington,Male,72,41208
Othilia Soff,Female,39,93393
Koral Gocher,Female,17,97289
Brooke Domnick,Male,55,54311
Jacquette Nind,Female,44,74467
Maddie Saing,Female,25,49458
Montgomery Triggel,Male,31,45415
Trix Benedick,Female,37,54641
Mannie Culham,Male,70,14616
Armstrong Thornley,Male,18,45430
Jeannette Tenpenny,Female,71,64684
Lyon Crop,Male,19,40295
Trish Winthrop,Female,40,13248
Marta Twycross,Female,35,82157
Karissa Stangroom,Female,51,87856
Darby Deme,Male,62,27045
Toni Abernethy,Female,41,29015
Vin Musgrave,Male,35,92640
Jorgan Pezey,Male,71,13513
Latia Slaten,Female,62,25529
Kattie Eastup,Female,47,88570
Chadwick Holburn,Male,60,36019
Gabe Hounsom,Male,34,73102
Ray Crosse,Female,26,80708
Darbee Thorold,Male,44,15406
Ruttger Forrestall,Male,59,39470
Dulcy Sherewood,Female,58,68570
Quintus Pottie,Male,67,33345
Rasla Bernard,Female,29,86920
Berget Garbett,Female,70,57775
Lilian Rihosek,Female,43,42707
Ced Ambresin,Male,55,27614
Tobin Brimicombe,Male,75,50662
Elsworth Heibl,Male,19,96618
Kimble Morshead,Male,53,36892
Maggy Marquot,Female,76,74504
Madge Granleese,Female,64,16233
Gisele Noir,Female,55,54299
Dar Timmes,Male,27,91080
Claire Tydd,Male,38,88973
Tarra Trewin,Female,40,37662
Hilario Daglish,Male,41,12821
Katrine Stappard,Female,38,58858
Kingston Thunders,Male,52,59791
Lorri Rabidge,Female,57,93044
Tymon Odby,Male,19,42948
Maxim Shadfourth,Male,68,65516
Vinny Edgerley,Male,78,79458
Clare Ferries,Female,33,58227
D'arcy Powling,Male,44,82997
Lorrin Elphinstone,Female,29,67999
Bennett Takkos,Male,22,68014
Spencer McCarrick,Male,20,68671
Aylmer Keetch,Male,23,30308
Debbie Raycroft,Female,61,57832
Mehetabel Kears,Female,39,70133
Fredrika Bletso,Female,28,90004
Ag Dyka,Female,34,90595
Tonya Trenaman,Female,69,60250
Seline Blampied,Female,72,15741
Neddy Pfaff,Male,22,75864
Jonie Benadette,Female,57,77404
Jonis Gillino,Female,41,16919
Amalle Mochan,Female,72,76364
Kellby Finder,Male,17,94881
Blondie Fairlamb,Female,22,65696
Maureene Phillimore,Female,80,41697
Haroun Feitosa,Male,31,18007
Liz Gobell,Female,33,26460
Cally Pearse,Female,53,59638
Edyth Raffan,Female,51,67259
Germayne Arboin,Male,16,42619
Cinnamon Roscamps,Female,24,41627
Irwin Bowling,Male,23,99059
Veda Glader,Female,54,31925
Falito Staries,Male,73,22365
Peggy Theaker,Female,71,49375
Garik Mansford,Male,80,76308
Miguelita Sincock,Female,74,91818
Nadiya Commuzzo,Female,74,15324
Orren Kidson,Male,61,14839
Guido Bearman,Male,67,36489
Tamara Matterson,Female,63,78287
Melany Jerzak,Female,32,20987
Gwenni Thewles,Female,42,78237
Ara Haskayne,Male,62,78023
Oby Birchner,Male,53,46305
Salli Bonafacino,Female,23,41027
Isabelita Shewan,Female,35,23769
Leontine Rogeon,Female,21,80520
Sabrina Fairclough,Female,67,51698
Timmie Arthan,Female,49,62154
Bobbe Leglise,Female,38,15149
Ricky Smithers,Female,31,13327
Glad Waddilove,Female,26,45309
Kim Lopes,Female,47,95094
Barclay Simenel,Male,67,87082
Morissa Farra,Female,20,97690
Bald Edger,Male,46,65300
Misha Blackaller,Female,32,26592
Tully Coupe,Male,23,24364
Anthiathia Teare,Female,52,39457
Reba Jime,Female,47,53113
Velvet Youngs,Female,17,24827
Erin Henze,Male,50,44870
Meridith Kliner,Female,34,18886
Luca Bilton,Male,66,25256
Antin Wickersley,Male,69,30224
Franky Valentinuzzi,Male,61,59401
Fielding Turfrey,Male,72,26724
Dorey Kolodziej,Male,56,23041
Wallache Mugglestone,Male,28,99923
Prinz Nolleau,Male,49,10717
Gallard Lewty,Male,35,61506
Gerrard Saker,Male,37,17678
Shir Raisher,Female,79,77284
Elsbeth Mainz,Female,51,50542
Teressa Elliff,Female,29,70461
Duky Frensche,Male,49,99661
Sheree Walkden,Female,65,98629
Hedda Liddon,Female,45,30000
Morey Slott,Male,71,55696
Sybille Whittet,Female,40,95807
Murray Giovannoni,Male,57,39052
Larissa Shergill,Female,38,35973
Kip Worvell,Male,51,46071
Austen Leatham,Male,48,96315
Aviva Deftie,Female,23,77088
Boy Bernadot,Male,77,15121
Sibley Christmas,Female,42,85401
Hilary Birts,Male,34,94299
Lira Cogger,Female,53,77244
Valentino Foxhall,Male,40,55540
Hobard Haire,Male,62,73939
Beverlie Stanlick,Female,69,94816
Kathlin Bulbeck,Female,23,68727
Gisela Westlake,Female,25,13589
Davidson Forsaith,Male,50,24490
Beckie Hexham,Female,59,36947
Gwendolin Ferrea,Female,28,51826
Linnell de Guerre,Female,25,79175
Tedra Sawley,Female,68,68375
Cate Kohrt,Female,61,77558
Layton Boleyn,Male,30,83239
Korry Denyagin,Female,54,39875
Lucia Smaleman,Female,46,55289
Petronella Frostdicke,Female,37,27826
Dannel Moyle,Male,45,91949
Eldredge Saberton,Male,73,73411
Stanton Brosio,Male,48,40635
Feliks Thorpe,Male,64,39347
Ingeborg Inman,Female,78,19682
Josey Mangin,Female,65,63215
Joletta Statham,Female,23,73666
Gweneth Thrasher,Female,62,70403
Linette Kahane,Female,80,62446
Wiley Ready,Male,57,94309
Ellen Ansley,Female,50,13544
Madelon Hubble,Female,33,72965
Kleon Delicate,Male,35,80429
Vladamir Philpott,Male,67,10818
Rance Cocci,Male,27,99544
Elliot Browell,Male,74,18605
Basilius Sandiland,Male,38,23472
Arnie Robrose,Male,20,23858
Uta Edser,Female,54,92130
Petr Copnell,Male,63,66500
Neala Povlsen,Female,49,91456
Wes Blackborne,Male,34,85762
Clarisse Creamer,Female,68,97745
Tobey Piddletown,Female,55,98949
Thorpe Jan,Male,68,19242
Nollie Mazey,Female,22,75251
Hernando Rookwell,Male,45,89980
Emmie Tomkinson,Female,57,93396
Ynez Sansome,Female,31,80582
Davidson Skilbeck,Male,18,18032
Melisent Gwillim,Female,79,73803
Marvin Mouton,Male,70,58906
Lou Graveston,Male,64,81206
Allianora Milmore,Female,78,17528
Tate Burgot,Male,28,61123
Delia Donnell,Female,75,50850
Sidonia Widdicombe,Female,66,90651
Dara Livesey,Female,47,25964
Flor Klehyn,Female,78,91606
Claiborn Ondrus,Male,42,65904
Bear Sparway,Male,47,78379
Cleo Sturgis,Female,59,89340
Norene Rintoul,Female,64,52055
Torie Humpatch,Female,17,56670
Marcelle Ketteman,Female,79,35750
Gianina Aronow,Female,50,65571
Lethia Quibell,Female,19,27616
Demetris Micah,Male,46,73040
Sylas Toderbrugge,Male,70,60080
Lanae Bursnall,Female,66,65204
Appolonia Gorgl,Female,80,36238
Yasmeen Bovaird,Female,68,27844
Torrin Wesker,Male,78,80780
Kristy Linny,Female,73,82006
Mela Hallworth,Female,34,55108
Norris covino,Male,26,15034
Odell Nutbrown,Male,68,66553
Sarina Lerway,Female,78,40766
Joshua Messitt,Male,73,52794
Link Castella,Male,16,18416
Audrye Hrinishin,Female,16,67884
Grange Shobrook,Male,20,33491
Bernard Greated,Male,73,80556
Brody MacGinlay,Male,28,11752
Paloma Bauld,Female,69,35023
Lilian Harry,Female,52,32936
Jecho Withringten,Male,54,37309
Sylvester McAlroy,Male,78,78857
Emmy Trewhela,Male,53,31311
Piotr Timblett,Male,76,90404
Ingra Kittman,Male,20,31885
Lon Griswood,Male,28,45905
Cynthea De Pero,Female,17,97571
Ferdinand Stredder,Male,35,60434
Georgeanne Warbys,Female,28,79879
Heather Batchelor,Female,21,27799
Leigh Bazell,Male,49,13713
Harley Fathers,Male,31,64280
Dotty Bayly,Female,35,82370
Arty Jobke,Male,69,78790
Taddeusz Celle,Male,52,16582
Tarra Lattie,Female,77,95039
Shaw Andryszczak,Male,35,32196
Alfred Cristofvao,Male,47,45870
Devora Hanley,Female,56,39412
Willa Brignall,Female,53,92249
Rowan McQuarter,Male,37,97112
Fields Elderidge,Male,64,17082
Juliana Stukings,Female,21,90301
Aleda Game,Female,40,66474
Tove Heikkinen,Female,76,75816
Rhea Dockree,Female,48,55966
Sharity Matusiak,Female,79,98755
Licha Bagguley,Female,27,78922
Tymon Kersting,Male,60,35315
Kellina Volage,Female,52,58326
Leeanne Dimmer,Female,18,33641
Rolland Copas,Male,22,16632
Gallard Canland,Male,24,68833
Leighton Shurrocks,Male,67,84782
Tansy Kohneke,Female,65,47487
Hollie Bernade,Female,73,25327
Kesley Balwin,Female,74,88892
Julina Toulch,Female,58,35249
Dunc Blasdale,Male,71,26943
Hynda McCarl,Female,69,89488
Camellia McGauhy,Female,47,55108
Lynett Evetts,Female,78,65725
Berni Flintuff,Female,63,30292
Lacy Matiebe,Female,80,36778
Leola Breens,Female,52,70016
Emmalynn Gierhard,Female,59,96473
Dion Ginni,Male,60,53724
Kaja Batrick,Female,51,14505
Saunders McMennum,Male,66,84624
Norah Sutherden,Female,74,84030
Ab Butt,Male,27,19849
Humberto Weeke,Male,59,41550
Baillie Gadsden,Male,33,92304
Clayton Kment,Male,47,44107
Micah Butterworth,Male,44,60131
Aleda Vaan,Female,60,82936
Eadith Braunle,Female,41,15715
Friedrick Berney,Male,46,97530
Cecily Handrek,Female,37,53429
Alvan Scothern,Male,20,92745
Miguelita Dunsmuir,Female,24,44084
Hally Cadwaladr,Female,52,43323
Aarika Clemot,Female,55,63566
Salome Orneblow,Female,20,27431
Eugenius Vynehall,Male,73,40190
Maximo Pither,Male,45,84716
Humberto Le Surf,Male,34,90447
Gaven Ragge,Male,43,25003
Vere Standish,Female,47,64572
Nathan Dacre,Male,80,30172
Salvador Macellar,Male,37,81407
Claudius McCook,Male,30,78647
Davis Gregoriou,Male,56,48457
Bettye Scarce,Female,18,35304
Elora Pidduck,Female,41,41857
Stanfield Mullaney,Male,24,68324
Marrilee Agney,Female,63,98621
Nadia Ashbrook,Female,21,16769
Orion Simcoe,Male,64,86306
Kelly McMurty,Female,78,80938
Dulcia Malins,Female,61,66691
Conroy Smallthwaite,Male,79,70412
Mattias Weatherburn,Male,20,98198
Somerset Lillico,Male,32,76865
Sigmund Spencelayh,Male,51,59731
Jorry Fincham,Female,29,68827
Nicol Abbes,Female,16,27311
Auguste Duding,Female,61,16092
Ailee Bruneau,Female,62,21967
Renell De Bruyn,Female,80,69309
Genny Abazi,Female,17,80924
Trina Lighterness,Female,26,53612
Morna Ramel,Female,30,34580
Charmane Shobrook,Female,52,87127
Willi Lowrie,Male,27,93934
Ade McCraw,Male,46,71967
Samson Impleton,Male,50,68857
Dorothee Pates,Female,60,78637
Ben Keeting,Male,73,55177
Arch Bartholomew,Male,73,82789
Mil Gligori,Female,48,36357
Goldie Gibbonson,Female,72,60433
Casi Arnaudet,Female,57,20580
Elisha Peplay,Female,19,68636
Alvera Sinnatt,Female,60,80184
Cammie Taillard,Female,17,30125
Beatrix Calabry,Female,48,13811
Jeanne Errichi,Female,51,72801
Juliette Balke,Female,75,43531
Terri-jo Turner,Female,30,43763
Oralle Duddle,Female,30,51459
Denise Danbury,Female,45,51511
Dill Fishly,Male,76,58248
Poppy Jaeggi,Female,57,90926
Barri Minelli,Male,53,73086
Meir Stuckes,Male,54,72773
Mortimer Jagger,Male,57,37265
Judye Robinson,Female,62,96281
Waverly Railton,Male,45,62568
Dar Botwright,Male,48,51649
Aguste Fipp,Male,32,39330
Vladimir Midford,Male,56,50365
Abner Hallt,Male,22,20979
Shell Eagle,Male,42,55590
Caddric Kondratenko,Male,50,34693
Alaric Amyes,Male,77,98871
Lauretta Habbershon,Female,58,79327
Cati Bigmore,Female,59,70029
Maximilian Rayne,Male,38,83269
Zara Frankiewicz,Female,62,58180
Horace Haggas,Male,56,22245
Carlos O'Glassane,Male,64,34020
Karee Chater,Female,65,41392
Berte Drew,Female,54,57981
Welby Speake,Male,79,30584
Delores Miell,Female,50,93746
Anni Bollum,Female,68,86032
Tristan Pollicatt,Male,51,90123
Olympe Mohun,Female,22,40469
Wini Edwinson,Female,68,41102
Eldridge Ollivierre,Male,32,34344
Adrianne Caddell,Female,31,97248
Andrea Diggar,Male,68,78973
Kimball Dachey,Male,41,53342
Sherlocke Bresland,Male,62,91183
Matthaeus Warbeys,Male,50,19379
Dennet Triggs,Male,65,62540
Darrick Leishman,Male,27,73254
Danyelle Stork,Female,34,74752
Alasdair Lamswood,Male,53,10194
Peter Ferrer,Male,40,71613
Amabelle Mayou,Female,37,78330
Zolly Cellone,Male,67,52970
Elyn Hustler,Female,61,89987
Marjory Bullcock,Female,17,61388
Matthieu Chadwyck,Male,48,98232
Matti Plessing,Female,47,57608
Randi O' Quirk,Female,16,90094
Ellen Barde,Female,31,46457
Kettie Tonbye,Female,68,79187
Shea Spradbrow,Male,77,14055
Franky Gration,Female,75,52972
Corette Baccus,Female,48,34880
Julina Cartner,Female,52,51852
Pearl Doding,Female,22,99147
Bordy Warlawe,Male,17,77285
Jedediah Blankett,Male,68,17492
Patric Fernihough,Male,77,44344
Jackie Barrett,Female,57,96776
Querida Scogin,Female,32,85280
Thane Tollemache,Male,38,45635
Otho Corradino,Male,41,42139
Standford Knock,Male,25,48527
Tanny Rudderham,Male,80,78668
Sindee Dudmesh,Female,36,65160
Edna Kubera,Female,18,47529
Arch Pascall,Male,33,28801
Magdalen Chancelier,Female,32,37018
Dana Proffitt,Male,16,55981
Alistair Mitrovic,Male,66,36102
