name,gender,age,postCode
Jack Medina,M,29,20412
Ann Lawson,F,68,69399
Joe Ferguson,M,56,13281
Frank Larson,M,74,22283
Scott Austin,M,45,92168
Gregory Romero,M,33,81785
Denise Murray,F,19,51464
Harry Patterson,M,25,84714
Billy Patterson,M,40,44718
Eric Carroll,M,27,30354
Joyce Peters,F,70,72083
Harry Parker,M,67,14606
Jean Gibson,F,28,87943
Patrick Olson,M,41,33131
Frank Harris,M,20,32144
Louis Cooper,M,76,43600
Keith Burns,M,68,27512
Eric Sanchez,M,62,15411
Adam Weaver,M,59,35706
Henry Sims,M,25,18387
Marilyn Ramos,F,51,88737
Robert Harper,M,49,63255
Richard Larson,M,72,48201
Robert Martinez,M,43,44888
Gregory Fernandez,M,79,21523
Rose Alvarez,F,44,89975
Karen Evans,F,24,72625
Donald Hicks,M,50,98472
Cynthia Wright,F,44,73219
Kathryn Gardner,F,66,74555
Ann Robertson,F,71,70469
Stephanie Ramos,F,16,12860
Catherine Lane,F,45,86318
Ruth Gardner,F,76,47477
Gary Porter,M,46,13731
Bobby Reed,M,53,56808
Nicholas Russell,M,23,93644
Raymond Watkins,M,43,67726
Carl Sanders,M,63,58426
Adam Duncan,M,18,70259
Amanda Black,F,52,74768
Stephanie Crawford,F,44,25358
Raymond Price,M,66,15424
Gloria Cook,F,71,76804
Julie Oliver,F,19,36772
Beverly Williamson,F,37,39710
Gregory Turner,M,44,52133
Juan Tucker,M,78,14748
Nicholas Mccoy,M,79,81560
Sarah Reyes,F,31,82421
Billy Oliver,M,64,96107
Barbara Duncan,F,41,50855
Frank Williams,M,21,93414
Joe Richardson,M,48,55876
Patricia Chavez,F,80,19830
Joseph Davis,M,73,43390
George White,M,74,76372
Marie Fox,F,72,24164
Sara Hamilton,F,46,33598
Rachel Gonzales,F,59,83091
Jeremy Burton,M,79,26169
Ryan Davis,M,55,42359
Bobby Banks,M,52,49939
Sandra Bennett,F,40,32761
Michelle Simpson,F,30,34564
Richard Dunn,M,48,35234
Kelly Miller,F,56,56044
Craig Edwards,M,51,11283
Billy Cruz,M,80,81694
Matthew Richards,M,37,41700
Keith Arnold,M,34,96668
Diana Lee,F,39,26023
Deborah Barnes,F,29,40178
Debra Jones,F,16,41310
Amanda Henderson,F,43,76876
Terry Grant,M,49,10523
Michelle Mills,F,80,66625
Cynthia Bailey,F,66,52188
Helen Kim,F,33,68796
Jennifer Lopez,F,46,87520
Paula Mills,F,31,53867
Amy Hudson,F,75,30128
Timothy Fernandez,M,43,16354
Lori Jenkins,F,36,64527
John Sanchez,M,27,68957
Karen Hayes,F,30,72469
Matthew Castillo,M,45,27372
Jason Ramirez,M,19,42903
Terry James,M,18,85332
Johnny Castillo,M,27,90172
Tina Ramos,F,78,39448
Victor Nichols,M,79,76085
Gloria Nguyen,F,23,19887
Michelle Wells,F,22,36637
Thomas Young,M,26,27538
Phillip Johnson,M,80,31931
Harold Ray,M,76,24183
Ruth Ellis,F,68,35278
Margaret Wood,F,60,81431
Julia Garcia,F,80,85640
Patrick Long,M,67,54218
William Payne,M,62,52552
Margaret Andrews,F,38,70632
Keith Clark,M,59,94105
Jerry Carpenter,M,71,13082
Kenneth Williams,M,73,52259
Jack Miller,M,31,93230
Ann Taylor,F,68,26300
Harold Grant,M,25,28466
Kenneth Burke,M,64,65040
Emily Diaz,F,46,77574
Shawn Duncan,M,58,68859
Louise Jackson,F,58,63300
Virginia West,F,42,33055
Norma West,F,38,50352
Beverly Peterson,F,64,95740
Roger Bowman,M,20,52165
Linda Anderson,F,60,37109
Tammy Wells,F,61,39761
John Ruiz,M,22,70348
Anne Brooks,F,70,47846
Phillip Boyd,M,45,24748
Eric Reyes,M,72,56788
Kelly Hunt,F,63,81433
Bruce Campbell,M,77,48300
Diane Henry,F,34,47816
Adam Ryan,M,23,47666
Arthur Hansen,M,65,58872
Rebecca Medina,F,35,60873
Kimberly Sims,F,65,64197
Walter Harris,M,17,98390
Timothy Wilson,M,45,49528
Anna Gomez,F,25,30506
Jimmy Adams,M,22,35458
Patrick Graham,M,47,37424
Randy Simpson,M,79,30912
Diana Reynolds,F,17,29684
Albert Martinez,M,43,19142
Lisa Baker,F,55,54848
Fred Simmons,M,60,46312
Stephanie Lynch,F,50,92296
Terry Dunn,M,51,30713
Lori Ryan,F,45,57979
Arthur Rodriguez,M,22,97782
Gary Greene,M,64,33370
Patrick Williamson,M,74,60263
Nancy Ferguson,F,46,32970
Sara Stanley,F,51,97971
Billy Rodriguez,M,60,67370
Sarah Armstrong,F,35,87971
James Robinson,M,41,44265
Nicole Ellis,F,61,15850
Ann Hansen,F,72,90682
Robert Bell,M,27,60199
Anthony Freeman,M,37,86305
Annie Alvarez,F,75,83807
Kathryn Gray,F,70,47705
Carolyn Allen,F,22,73629
Fred Butler,M,67,35259
Debra Rogers,F,21,90771
Dorothy Duncan,F,16,40980
Kathryn Andrews,F,74,90287
Dennis Jordan,M,43,84365
Jose West,M,38,46630
Phillip Carr,M,74,69155
Gerald Oliver,M,50,45543
Amy Rogers,F,63,21869
Jose Price,M,47,14376
Carl Dunn,M,24,23515
Amy Ramirez,F,68,76706
Benjamin Martinez,M,65,48309
Jerry Willis,M,46,95173
Jacqueline Sims,F,34,79759
Katherine Lynch,F,39,87256
Jeremy Bailey,M,48,94349
Kimberly Young,F,70,42471
Bobby Ward,M,23,52585
Helen Berry,F,47,11942
Irene Collins,F,76,79553
Kimberly Moreno,F,33,74922
Teresa Chapman,F,72,40869
Cheryl Ortiz,F,65,91879
Tammy Sims,F,50,74235
Earl Watkins,M,49,70836
Robert Carter,M,45,65986
Mary Cunningham,F,25,25169
Tammy Cook,F,71,86396
Helen Hall,F,79,68229
Jason Medina,M,24,36276
Justin Harper,M,54,33420
Lawrence Butler,M,36,54789
Janice Nguyen,F,65,17299
Aaron Schmidt,M,43,60792
Wayne Long,M,65,94674
Angela Coleman,F,38,18386
Juan Robertson,M,37,41186
Marilyn Carroll,F,58,36160
Denise Ward,F,67,90018
Harry Graham,M,35,10645
Maria Knight,F,37,55684
Amanda Knight,F,37,63429
Willie Sullivan,M,72,79207
Dorothy Bryant,F,69,12512
Melissa Gordon,F,35,80220
Anna Ramos,F,74,44943
Michael Bryant,M,19,54572
Anne Boyd,F,28,67666
Irene Nichols,F,39,92193
Jennifer Rice,F,48,86108
Clarence Olson,M,39,85027
Martha Kennedy,F,33,71802
Raymond Castillo,M,41,44330
Charles Ford,M,35,54714
Chris Garrett,M,23,34043
Janet Riley,F,60,10667
Teresa Kelly,F,38,75059
Scott Boyd,M,21,15021
Scott Ramos,M,29,69643
Clarence Gonzales,M,80,10115
Dorothy Hart,F,66,75613
Christina Sanders,F,65,99676
Sandra Robertson,F,73,29399
Benjamin Rodriguez,M,53,10673
Joseph Sanchez,M,62,44480
Roger Evans,M,70,62819
Keith Murphy,M,43,39063
Ralph Carroll,M,62,38096
Katherine Freeman,F,64,54766
Victor Medina,M,71,31023
Joyce Shaw,F,17,57881
Ralph Henry,M,66,28940
Lawrence Cunningham,M,30,24143
Ronald Woods,M,56,53205
Michael Foster,M,66,24992
Terry Robertson,M,35,52222
Edward Willis,M,56,25783
Juan Howard,M,16,40166
Norma Richards,F,73,33315
Mildred Hunter,F,53,22260
Roger Davis,M,38,37469
Ryan Lee,M,58,27611
Laura Ellis,F,32,42206
Bonnie Palmer,F,72,67427
Henry Fernandez,M,49,23016
Benjamin Andrews,M,41,24045
Jean Riley,F,74,11729
Frances Moore,F,30,13409
Ronald Williams,M,32,54707
Jonathan Fuller,M,34,84758
Donald Mcdonald,M,32,87081
Benjamin Moore,M,34,27560
Sara Cunningham,F,24,36861
Phyllis Willis,F,53,80249
Lawrence Boyd,M,71,14746
Ralph Webb,M,65,53440
Marie Flores,F,60,43505
Jacqueline Reed,F,53,80852
Linda Flores,F,54,74251
Anthony Ward,M,71,48091
Henry Robinson,M,44,89555
Tina Long,F,47,19430
Ann Baker,F,53,90460
Brenda Baker,F,71,54399
Todd Kim,M,45,39508
Robert Riley,M,78,83380
Diana Reyes,F,79,29576
Steve Hudson,M,71,15066
Cheryl Mason,F,44,34218
William Cruz,M,17,78855
Johnny Carter,M,52,91064
Emily Webb,F,69,97524
Lillian Kim,F,45,84527
Debra Price,F,28,94747
Kathleen Stewart,F,27,60450
Clarence Reynolds,M,62,84656
Sean Price,M,77,31482
Justin George,M,59,35198
Emily Brown,F,52,95236
Carol Parker,F,48,73898
Adam Reid,M,70,38809
Timothy Mitchell,M,58,49468
Raymond Gardner,M,58,54274
Robin Harvey,F,25,38333
Thomas Murray,M,75,35908
Ryan West,M,22,99227
Joe Oliver,M,29,81353
Aaron Reid,M,45,77534
Barbara Gilbert,F,59,80411
Betty Mendoza,F,67,76334
Frank Long,M,19,87149
Jane Schmidt,F,66,60980
Carolyn Martinez,F,44,61959
Donna Peters,F,80,31681
James Jenkins,M,16,58271
Henry Bell,M,37,93056
Robert Rogers,M,45,16329
Phyllis Perez,F,76,47937
Robin White,F,74,22629
Linda Gonzalez,F,31,55513
Tammy Griffin,F,80,12012
Marie Perry,F,60,93337
Pamela Kim,F,41,81746
Joe Hughes,M,61,91680
Brenda Stone,F,79,78101
Brian Evans,M,25,54231
Charles Moreno,M,68,73151
Kathleen Sullivan,F,26,36314
Willie Morris,M,66,71353
Rachel Evans,F,16,48193
Sandra Ortiz,F,75,12882
John Burton,M,64,11085
James Henderson,M,73,59876
Jonathan Mason,M,18,30038
Jerry Coleman,M,54,59353
Carl Sullivan,M,67,26984
Maria Hanson,F,43,73051
Ann Murray,F,69,86614
Justin Garcia,M,31,30298
Antonio Olson,M,36,57769
Norma Little,F,35,43225
Fred Wilson,M,45,81339
Clarence Jordan,M,49,16549
Bruce Bailey,M,38,69653
Jimmy Miller,M,19,85110
Angela Sanders,F,18,74527
Bonnie Watkins,F,75,49636
Deborah Oliver,F,16,32466
Marilyn Baker,F,63,54245
Angela Ford,F,41,35883
Jeffrey Moreno,M,29,87891
Pamela Warren,F,77,13547
Walter Knight,M,61,20661
Frank Stevens,M,37,21493
Helen Alexander,F,45,59795
Christine Ford,F,41,66160
Barbara Roberts,F,46,44174
Keith Peters,M,51,86567
Marie Flores,F,69,95986
Lawrence Fields,M,29,32684
Carlos Clark,M,64,95898
Cheryl Pierce,F,39,36322
Dennis Tucker,M,22,10921
Paul Simmons,M,65,18070
Theresa Tucker,F,62,88938
Brian Cook,M,19,20420
Wanda Gonzalez,F,43,81751
Janet Watson,F,46,76814
Debra Ray,F,22,66467
Philip Moreno,M,25,46867
Victor Wagner,M,75,60031
Carl Peterson,M,42,40702
Stephen Patterson,M,38,36424
Timothy Scott,M,33,45412
Jesse Garrett,M,64,28984
David Webb,M,59,22438
Bonnie Bradley,F,38,83117
Martha Williams,F,74,49417
Jean Bennett,F,64,46220
Henry Ray,M,33,77046
Jessica Lynch,F,79,99921
Keith Lawson,M,80,56154
Debra Warren,F,77,76349
Carol Rivera,F,73,11246
Robert Daniels,M,68,66588
Roger Green,M,70,38806
Jose Thompson,M,77,16037
Frances Perez,F,51,20865
Brian Taylor,M,34,16980
Steven Fields,M,39,50776
Wayne Shaw,M,53,20272
Paul Vasquez,M,51,79139
Joseph Richards,M,32,45743
Samuel Carter,M,40,58272
Earl Moreno,M,43,90079
Brian Jones,M,60,95489
Sarah Gilbert,F,60,72208
Steven James,M,36,47392
Frank Porter,M,62,60269
Frank Russell,M,34,56019
Fred Owens,M,70,10908
Louis Ross,M,62,42426
William Simpson,M,78,35314
Samuel Murray,M,40,27880
Robin Carpenter,F,50,91259
Charles Stephens,M,22,58460
Pamela Hall,F,35,80006
Paul Stanley,M,75,13885
Melissa Nelson,F,45,64994
Terry Ortiz,M,60,38298
Phyllis Lynch,F,28,47775
John Little,M,53,38696
Jack Armstrong,M,62,43371
Lisa Harper,F,22,76546
Teresa Martin,F,55,30584
Shawn Brown,M,79,93036
Russell Richardson,M,56,81541
Deborah Hudson,F,54,61463
Cynthia Austin,F,16,17581
Terry Lane,M,32,40462
Todd Reid,M,18,42389
Jonathan Williams,M,59,18277
John James,M,76,60620
Barbara Foster,F,60,29509
Lois Howell,F,52,37640
Lois Castillo,F,77,91477
Jerry Kim,M,20,49265
Sharon Crawford,F,55,69677
Justin Ramirez,M,19,92163
Margaret Walker,F,24,28037
Jeremy Morrison,M,24,61588
Janice Stephens,F,55,27946
Andrew Alexander,M,67,74690
Steven Gray,M,36,44077
Lillian Vasquez,F,16,37962
Larry Franklin,M,40,80154
Ann Ellis,F,66,13721
Emily Mills,F,57,22745
Mildred Lewis,F,67,15183
Frank Rivera,M,61,94197
Martha Harrison,F,54,63983
Michael Lane,M,73,94485
Wayne Burton,M,43,31258
Christina Gilbert,F,30,23153
Gregory Fernandez,M,18,86540
Melissa Dean,F,49,63224
Richard Foster,M,65,68569
Jacqueline Ray,F,18,47131
Ernest Ray,M,47,15201
Catherine Romero,F,69,93685
Joyce Gonzalez,F,34,44398
Timothy Gibson,M,18,59235
Jesse Bennett,M,30,59618
Linda Hicks,F,17,96532
Julie Carr,F,68,44052
Harry Long,M,44,56842
Dorothy Edwards,F,41,34788
Mildred Hamilton,F,27,10374
Stephanie Richardson,F,57,90338
Keith Stephens,M,24,68574
Willie Ford,M,75,16958
Philip Sanders,M,21,62630
Todd Howard,M,24,97753
Billy Armstrong,M,70,46976
Jack Gordon,M,39,37345
Andrew Elliott,M,69,89554
Chris Jacobs,M,78,33315
Kathryn Murray,F,32,26100
Mary Romero,F,34,63402
Donna Stephens,F,48,65356
Pamela Green,F,77,70745
Jerry Collins,M,70,33289
Janice Powell,F,25,32788
Jacqueline Holmes,F,76,50307
Anthony Morris,M,47,42983
Randy Garcia,M,24,61263
Samuel Edwards,M,73,47260
Marie Parker,F,43,82311
Scott Mendoza,M,46,61505
Lois Brooks,F,19,72894
Alan Anderson,M,66,87186
Carol Burke,F,54,53010
Joan Perkins,F,19,75424
Mary Ward,F,50,48715
Christine Stephens,F,31,24421
Fred Crawford,M,38,69004
Christopher Nelson,M,47,11653
Phillip Harris,M,69,37715
Maria Hernandez,F,73,59723
Sara Morales,F,63,93986
Teresa Griffin,F,65,71703
Robin Tucker,F,61,62161
Harry Pierce,M,46,62882
Timothy Long,M,41,41997
Kathleen Freeman,F,21,73435
Jack Williamson,M,61,61125
Kathryn Brown,F,47,32661
Martin Ward,M,79,99746
Barbara Reynolds,F,29,70066
Philip Robinson,M,17,76790
Timothy Riley,M,16,73124
Melissa Mccoy,F,19,52012
Louis Duncan,M,68,74245
Pamela Carroll,F,22,36929
Kathleen Porter,F,71,41051
Laura Black,F,23,89034
Sarah Hamilton,F,47,98044
Cynthia Bailey,F,42,53086
Howard West,M,24,81432
Daniel Roberts,M,77,14336
Harry George,M,77,69934
Debra Stevens,F,38,82360
Debra Taylor,F,60,97029
Robin Taylor,F,80,73051
Melissa Elliott,F,51,90218
Craig Harrison,M,55,65960
Helen Fields,F,52,65397
Walter Griffin,M,71,47164
Lois Dixon,F,74,70873
Eric Boyd,M,20,92304
Edward Robinson,M,44,64061
Rebecca Fisher,F,46,98051
Wayne Mccoy,M,53,92371
Barbara George,F,72,42079
Bobby Moreno,M,31,86179
Walter Robinson,M,28,48831
Clarence Palmer,M,63,77648
Philip Gonzalez,M,80,49403
Brian Miller,M,75,97226
Eugene Nichols,M,41,35488
Ernest Sanchez,M,73,70214
Marie Brooks,F,67,28125
Benjamin Lawrence,M,27,69841
Janet Harrison,F,22,62711
Jessica Wheeler,F,63,99413
Brandon Grant,M,35,49905
Nicholas Jacobs,M,60,33613
Scott Ramirez,M,32,92358
Eugene Fuller,M,49,44466
Marie Patterson,F,71,95421
Elizabeth Frazier,F,67,31675
Chris Mason,M,64,83770
Louise Hudson,F,60,52891
Scott Nichols,M,21,49387
Anna Johnston,F,25,14413
Lawrence Murray,M,67,15466
Gregory Gordon,M,50,54103
Walter Hudson,M,64,77639
Mary Cole,F,47,30473
Clarence Chapman,M,77,12397
Mildred James,F,56,31993
Pamela Lynch,F,79,30922
Elizabeth Crawford,F,29,75341
Scott Sanders,M,73,69280
Amanda Johnston,F,17,46778
Walter Mitchell,M,18,69691
Antonio Williams,M,54,23456
Rebecca Gray,F,20,88987
Annie Hansen,F,41,76947
Debra Montgomery,F,25,88539
Michelle Hansen,F,80,53017
George Hernandez,M,76,80271
Harold Morales,M,50,20220
Shirley Daniels,F,34,27702
Marilyn Young,F,49,38016
Alice Hanson,F,51,45965
Edward Palmer,M,63,15669
Bobby Jordan,M,62,21611
Donald Ray,M,41,22795
Harold Ortiz,M,74,81606
Alan Thompson,M,77,29750
Brenda Campbell,F,71,38963
Russell Payne,M,56,51381
Rachel Fowler,F,69,46103
Ryan Ramirez,M,71,35604
Norma Matthews,F,76,96092
Wanda Ramirez,F,41,16911
Joshua Greene,M,58,47141
Craig Knight,M,44,61097
Janet Burton,F,52,13755
Benjamin Harris,M,19,11854
Robin Morales,F,22,90441
Harry Morrison,M,80,98140
Christine Weaver,F,73,77144
Ronald Cruz,M,77,51215
Bobby Reynolds,M,31,93601
Sharon Ellis,F,48,50727
Billy Brown,M,74,29130
Chris Lopez,M,16,43880
Helen Robertson,F,69,22451
Billy Reid,M,76,78839
Nancy Marshall,F,25,85600
Jennifer Fowler,F,32,58108
Janice Bailey,F,58,50612
Jason Reed,M,41,89650
Carlos Robertson,M,44,70028
Billy Duncan,M,75,65599
Louis Payne,M,79,20099
Harry Perkins,M,45,98315
Anna Greene,F,32,74991
Andrew Ford,M,53,14405
Charles Murray,M,51,66178
Amy White,F,49,87413
Andrea Scott,F,16,87451
Christine Collins,F,69,36742
Rachel Nelson,F,65,12629
Samuel Ross,M,20,41695
Roger Lawson,M,75,13575
Laura Cox,F,57,56207
Anne Perkins,F,70,66377
Harold Murray,M,52,40775
Kimberly Hudson,F,79,31323
Emily Lawson,F,58,86564
Jason Barnes,M,23,60262
Sarah Johnson,F,47,41401
Kimberly Ramirez,F,70,17014
Ann Jacobs,F,55,71396
Donna Harper,F,48,60502
Jeffrey Weaver,M,43,18082
Jacqueline Kennedy,F,33,49969
Jane Rose,F,45,38484
Jane Lawrence,F,42,49031
Deborah Griffin,F,52,93057
Christina Powell,F,37,60751
Edward Roberts,M,74,60934
Julie Harper,F,50,72737
Edward Castillo,M,30,64880
Phillip Allen,M,36,43095
Craig Hughes,M,34,77245
Philip Fox,M,71,58752
Diane Alvarez,F,77,63870
Todd Lawrence,M,55,37158
Fred Hughes,M,60,75838
Martha Price,F,75,25743
Evelyn Cox,F,62,10956
David Bell,M,76,36283
Rose Welch,F,35,78854
Paul Peterson,M,31,75130
Carolyn Wheeler,F,25,15405
Anthony Ward,M,52,57968
David Carter,M,61,48817
Bruce Lee,M,33,98040
Ernest Parker,M,42,75870
Tammy Garza,F,45,42470
Bobby Cook,M,33,49345
Brenda Black,F,38,21493
Patricia Gilbert,F,32,20063
Martin Edwards,M,72,13997
Christopher Flores,M,75,71003
Philip Riley,M,76,24065
Diana Black,F,35,86017
Diane Mccoy,F,79,26281
Brenda Mccoy,F,40,13761
Ralph Dunn,M,76,81451
Rose Castillo,F,56,88002
Thomas Larson,M,53,19401
Mark Murphy,M,20,73024
Kathy Franklin,F,57,47770
Evelyn Richards,F,50,92877
Anthony Smith,M,31,43000
Kevin Hayes,M,21,98457
Benjamin Hudson,M,31,24213
Nancy Dixon,F,69,43518
Ernest Armstrong,M,20,61744
Phyllis Sims,F,45,49341
Kevin Perez,M,36,99813
Denise Lawson,F,35,37830
Samuel Reed,M,52,98913
Beverly Gordon,F,51,78568
Adam Mcdonald,M,76,81368
Barbara Owens,F,57,21019
Jessica Dixon,F,68,62204
Tammy Fernandez,F,79,31390
Maria Jones,F,52,88986
Laura Stewart,F,41,15495
Gerald Wheeler,M,25,46907
Keith White,M,62,32759
Walter Owens,M,51,71451
Martha Wagner,F,24,29003
Katherine Ford,F,68,76842
Anthony Turner,M,70,60951
Jonathan Simpson,M,60,88105
Shawn Lawrence,M,26,80642
Ann Burton,F,21,82392
Donald Wagner,M,69,38076
Roger Burns,M,28,32293
Bobby Campbell,M,75,83706
Jane Kelley,F,60,20765
Norma Medina,F,16,65938
Sean Flores,M,24,76010
Donna Hill,F,41,44965
Albert Welch,M,50,80725
Janice Bailey,F,74,34188
Harry Ray,M,42,84709
Deborah Stephens,F,30,29774
Lisa Berry,F,71,73544
Sarah Clark,F,32,74724
Ernest Weaver,M,19,77696
Dennis Walker,M,80,68145
Alan Thomas,M,63,14877
Louise Holmes,F,29,68492
Marilyn Miller,F,42,15890
Larry Fuller,M,56,39234
Eric Armstrong,M,27,44139
Walter Perkins,M,78,30061
Juan Williams,M,16,52693
Steve Carter,M,44,22374
Todd Chapman,M,41,13504
Kelly White,F,24,97397
Katherine Porter,F,52,37472
Aaron Edwards,M,67,78766
Brandon Collins,M,40,51410
Anna Nelson,F,32,57150
Anna Lawson,F,32,52680
Dennis Fuller,M,71,48296
Roy Coleman,M,41,49568
Joseph Harris,M,32,89718
Louis Evans,M,25,40627
Frances Palmer,F,30,21860
Jeremy Larson,M,35,56646
Jessica Diaz,F,44,70909
Shawn Dunn,M,60,49818
Kevin Peterson,M,79,76125
Sean Wallace,M,18,89335
Jean Hall,F,74,27008
Roy Cunningham,M,77,71546
Charles Lawrence,M,43,10856
Doris Hicks,F,50,99464
Kimberly Gardner,F,64,20543
Linda Sims,F,17,22740
Ashley Kennedy,F,25,57364
Eric Adams,M,17,39032
Brandon Stewart,M,72,71956
Louis Green,M,58,10839
Ralph Lynch,M,30,71236
Donna Jones,F,57,63632
Nicole Martinez,F,21,98001
Kelly Thompson,F,79,44009
Julia Mccoy,F,62,42578
Brian Willis,M,47,51892
Teresa Webb,F,76,93566
Susan Mccoy,F,48,42820
Denise Berry,F,61,60052
Scott Hanson,M,33,47063
Joan Roberts,F,29,33530
Billy Arnold,M,69,77172
Willie Mason,M,54,65846
Helen Hansen,F,37,15173
Linda Turner,F,79,93275
Rose Olson,F,65,46361
Teresa Graham,F,68,36741
Janice West,F,28,16322
Sarah Sullivan,F,38,94388
Amy Lopez,F,31,52980
Kelly Hunt,F,33,87637
Pamela Barnes,F,63,87590
Brenda Burke,F,49,42130
Joseph Hamilton,M,47,65402
Catherine Warren,F,62,67591
Shirley Alvarez,F,42,88231
Johnny Phillips,M,17,81122
Terry Boyd,M,40,24736
John Murray,M,42,38184
Donna Lane,F,34,13793
Jeffrey Elliott,M,41,36168
Paula Matthews,F,29,37987
Virginia Rivera,F,74,56707
Jason Pierce,M,42,62772
Linda Garrett,F,50,38743
Joe Sanders,M,78,88665
Robert Chapman,M,68,42374
Patrick Carroll,M,43,25984
Jimmy Wallace,M,19,56732
Theresa Matthews,F,77,40597
Lawrence Garza,M,43,11974
Mildred Day,F,47,65612
Billy George,M,21,48505
Peter Vasquez,M,69,91206
Willie Black,M,75,13318
Matthew Kennedy,M,39,68973
Ernest Chapman,M,73,63644
Janice Mccoy,F,64,38239
Christine Wheeler,F,78,11459
Joshua Olson,M,34,92070
Rose Gray,F,50,91731
Donna Henderson,F,46,42804
Brenda Reynolds,F,57,56818
Rose Dixon,F,31,26239
Alan Freeman,M,49,17411
Thomas Cunningham,M,47,65963
Gregory Kennedy,M,49,29335
Patrick Howard,M,30,63346
Michael Hicks,M,28,20336
Jean Thomas,F,33,80021
Julia Russell,F,22,93008
Jean Larson,F,43,45419
Stephen Reyes,M,39,21480
Irene Lee,F,64,55138
Sharon Robertson,F,40,20512
Michelle Thomas,F,45,49511
Sharon Reed,F,77,42197
Tina Ray,F,57,44106
Sandra Hanson,F,77,69167
Harold Williams,M,48,20689
Theresa West,F,64,64346
Walter Carr,M,36,52352
Gerald Fowler,M,53,59471
Elizabeth Greene,F,24,23261
Cynthia Wright,F,72,33037
Charles Welch,M,54,41388
Chris Henry,M,63,67518
Kathryn Burton,F,21,56962
Anne Black,F,60,49009
Linda Mccoy,F,76,50882
Steven Gonzalez,M,25,33397
Benjamin Sims,M,32,31978
Elizabeth Pierce,F,33,84178
Bonnie Sims,F,42,99906
Johnny Chapman,M,71,83151
Andrea Bradley,F,65,98085
Scott Marshall,M,40,20974
Henry Hughes,M,26,78456
Samuel Myers,M,57,62509
Kathy Walker,F,67,74291
Willie Harper,M,45,25779
Christopher Fisher,M,63,48826
Carl Hansen,M,74,69012
Jerry White,M,16,10355
Amy Harris,F,76,59871
Albert Cunningham,M,27,90138
Dorothy Baker,F,73,99047
Jimmy Spencer,M,24,46770
Joseph Andrews,M,39,17741
Nancy Hernandez,F,32,87626
Brian Warren,M,22,38398
Diana Allen,F,48,64410
Gerald Cunningham,M,31,60675
John Lopez,M,30,64180
Judy Hunt,F,46,57255
Larry Hamilton,M,68,43753
Jeffrey Scott,M,18,79206
Steve Fuller,M,37,18000
Carolyn Hudson,F,66,57596
Stephen Dixon,M,58,36213
Judy Fernandez,F,71,74020
Todd Cruz,M,56,84875
Gloria Richards,F,58,94603
Lois Graham,F,35,29374
Joyce Washington,F,27,40410
Kathryn Parker,F,25,55822
Rose Griffin,F,80,13563
Philip Knight,M,57,15852
Cheryl Murray,F,71,77414
Jonathan Fernandez,M,18,84455
Eugene Sanders,M,55,73951
Jonathan Carter,M,28,31545
Bonnie Mills,F,67,95582
Walter Henry,M,40,52707
Richard Phillips,M,55,80196
Amy Taylor,F,72,99085
Clarence Williamson,M,27,64823
Carolyn Stanley,F,75,31765
Eugene Coleman,M,72,34750
Dorothy Thompson,F,68,16774
Ryan Nichols,M,21,83395
Deborah Ruiz,F,60,38152
Rebecca Moore,F,53,70921
Dennis Torres,M,50,69613
Katherine Rogers,F,41,34684
Paul Moore,M,64,24697
Diana Greene,F,69,24335
Patricia Hanson,F,64,98538
Annie Davis,F,24,61095
Sean Larson,M,51,92386
Mark Watson,M,19,39830
Roy Ortiz,M,41,91059
Victor Myers,M,27,20000
Janice Watson,F,34,11662
Steve Banks,M,65,95102
Shirley Cooper,F,32,65226
Christopher Martinez,M,65,94185
Julie Peterson,F,43,30445
Larry Dunn,M,79,43655
Sean Price,M,79,78573
Laura James,F,24,73625
Jane Ferguson,F,23,72355
Mildred Stewart,F,16,58583
Irene Mitchell,F,71,68895
Howard Perez,M,73,23660
Ernest Grant,M,19,14929
Louise Riley,F,46,18800
Elizabeth Lawrence,F,16,30981
Sharon Miller,F,79,93307
Rose Payne,F,78,72218
Jerry Wood,M,44,32015
Anna Howard,F,29,45132
Anthony Myers,M,25,19855
Bruce Nguyen,M,20,98922
Lori Jackson,F,23,93161
Richard Moreno,M,45,63100
Dennis Howard,M,59,63432
Andrew Coleman,M,31,74892
Nicholas Hicks,M,61,61725
James Adams,M,41,17719
Phillip Simpson,M,52,39456
Dorothy Oliver,F,74,15884
William Ross,M,35,19446
Roger Diaz,M,20,17940
Carolyn Collins,F,23,49781
Michelle Little,F,20,92505
Jose Jordan,M,74,57256
Kimberly Bell,F,43,21747
Diana Banks,F,17,94383
Ruby Daniels,F,19,24043
Kathy Garza,F,28,34834
Virginia Rice,F,23,71775
Gerald Warren,M,42,22891
Lisa Matthews,F,32,70093
Marie Taylor,F,70,25809
Kelly Woods,F,78,91370
Shirley Perez,F,74,92008
Kelly Allen,F,27,60531
Jonathan Black,M,18,57455
Beverly Vasquez,F,16,87074
Katherine White,F,54,60611
Anne Hawkins,F,36,92686
Heather Oliver,F,21,11417
Stephen Dunn,M,27,34512
Kelly Lee,F,26,56128
Carol Alvarez,F,74,31990
Paula Tucker,F,49,32032
Alan Hall,M,54,89984
Jesse Phillips,M,62,39692
Sharon Reynolds,F,69,35963
Phyllis Stephens,F,78,17760
Eugene Perez,M,51,66426
Laura Miller,F,75,53806
Tina Martin,F,35,15771
Richard Reid,M,29,25165
Judy Cooper,F,45,14964
Robin Murphy,F,16,95420
Gregory Williams,M,54,81991
Sandra Alvarez,F,54,76096
Marilyn Gonzalez,F,59,92967
Brian Carr,M,57,83924
Cynthia Hunt,F,21,24906
Elizabeth Olson,F,75,76749
Maria Cox,F,41,49382
Tina Grant,F,31,24676
Norma Perkins,F,79,73012
Kathleen Martin,F,54,47693
Robert Murray,M,21,30999
Jose Hanson,M,71,25098
Tina Grant,F,64,73091
Carol Nelson,F,38,13157
Henry Fuller,M,74,98899
Lois Fields,F,38,99977
Sara Johnston,F,38,48460
Frank Turner,M,75,80248
Russell Mills,M,38,23751
Cynthia Payne,F,70,66196
Michael Coleman,M,63,26098
Fred Hernandez,M,49,58618
Doris Garza,F,30,15430
Wayne Peters,M,21,48156
Ralph Graham,M,76,22640
Tina George,F,19,19773
Katherine Kennedy,F,34,30437
Janice Harris,F,44,50012
Phyllis Edwards,F,50,98302
David Torres,M,59,39749
Stephen Sullivan,M,18,17540
Ruth Powell,F,51,95038
Charles Ward,M,39,67130
Annie Brooks,F,43,29865
Andrew Alexander,M,33,85680
Bonnie Woods,F,53,65804
Ashley Lewis,F,41,37455
Clarence Hall,M,29,72367
Andrew Pierce,M,77,35840
Steve Chapman,M,59,92988
Karen Weaver,F,80,36699
Edward Cook,M,29,96054
Nicholas Washington,M,67,72160
Joan Gibson,F,58,34310
Diana Williamson,F,44,75809
Julie Carter,F,49,79456
Denise Watkins,F,72,79026
Jimmy Oliver,M,41,51689
Samuel Hayes,M,38,33164
Kenneth Chapman,M,53,68251
Johnny Bradley,M,36,25056
Marie Richardson,F,49,28331
Chris Roberts,M,65,77204
Dennis Fuller,M,38,73355
Aaron Wallace,M,22,82083
Pamela Marshall,F,48,93756
Debra Bell,F,47,20771
Elizabeth Kelly,F,16,12780
Bobby Fowler,M,26,72787
Margaret Gardner,F,78,52006
Catherine Reynolds,F,26,96568
Rachel Morrison,F,42,97931
Elizabeth Hayes,F,55,67867
Jennifer Wheeler,F,32,50232
Roger Stevens,M,41,22177
Steven Harrison,M,41,45449
David Watkins,M,40,88129
Judith Larson,F,58,39170
Carol Cole,F,63,26603
Ashley Nichols,F,66,87057
Sean Murphy,M,23,43438
Russell Stephens,M,50,22954
Thomas Evans,M,21,28046
Andrew Lopez,M,70,64563
Tammy Carter,F,65,85094
Stephanie Duncan,F,75,39337
Carolyn Peters,F,48,11882
Janet Reid,F,44,94818
Louise Mitchell,F,33,50554
Jose Harris,M,78,84989
