name;price;count
Garam Marsala;448.95;1
Lettuce - Escarole;552.71;11
Yogurt - Assorted Pack;457.42;21
Cocoa Feuilletine;541.69;17
Tea - Black Currant;652.59;4
Wasabi Powder;591.04;21
Foam Dinner Plate;826.35;21
Soup Campbells - Italian Wedding;541.1;24
Bread - Crusty Italian Poly;401.88;1
Scallops 60/80 Iqf;372.64;21
Lemonade - Mandarin, 591 Ml;564.18;15
Croissants Thaw And Serve;596.49;16
Irish Cream - Butterscotch;566.58;5
Bread Foccacia Whole;428.56;20
Olives - Stuffed;433.76;0
Vegetable - Base;517.86;19
Grenadine;469.18;0
Yogurt - Raspberry, 175 Gr;513.11;10
Canadian Emmenthal;526.84;12
Garbage Bags - Clear;391.52;20
Bread - Pumpernickel;251.84;15
Tart - Butter Plain Squares;574.8;15
Sauce - Caesar Dressing;399.92;24
Vinegar - Raspberry;406.35;10
Plaintain;680.06;25
Table Cloth 91x91 Colour;606.08;7
Rice Paper;494.73;6
Artichokes - Jerusalem;528.48;20
Mace Ground;524.65;4
Veal - Chops, Split, Frenched;438.12;8
Yogurt - Plain;486.5;2
Lemonade - Natural, 591 Ml;602.12;12
Sprouts - Brussel;556.85;13
Pate Pans Yellow;717.32;8
Wine - White, Antinore Orvieto;278.98;5
Wine - White, Mosel Gold;417.62;22
Muffin - Banana Nut Individual;440.32;2
Shrimp - 16 - 20 Cooked, Peeled;496.45;20
Flower - Daisies;521.54;14
Spice - Pepper Portions;564.16;25
Coffee - Hazelnut Cream;690.76;2
Cheese - Roquefort Pappillon;480.77;15
Rum - Spiced, Captain Morgan;351.62;7
Appetizer - Smoked Salmon / Dill;453.63;23
Carbonated Water - Blackcherry;413.7;4
Snapple - Iced Tea Peach;580.15;20
Sherry - Dry;569.89;23
Beans - Yellow;561.33;4
Pastry - Apple Large;429.06;24
Kellogs Raisan Bran Bars;546.42;22
Bread - Focaccia Quarter;492.05;9
Pimento - Canned;611.73;16
Cream - 10%;542.61;11
Puff Pastry - Sheets;374.87;21
Walkers Special Old Whiskey;504.95;2
Lemonade - Strawberry, 591 Ml;426.02;18
Arctic Char - Fresh, Whole;589.23;14
Squid Ink;523.32;24
Pasta - Cheese / Spinach Bauletti;368.79;16
Crab - Blue, Frozen;499.37;17
Cheese - Parmigiano Reggiano;473.3;20
Cactus Pads;627.17;23
Pepper - Pablano;472.04;19
Lobster - Cooked;513.39;15
Sugar - Brown, Individual;505.5;20
Sherbet - Raspberry;554.69;19
Muffin - Carrot Individual Wrap;503.13;14
Shrimp - Baby, Warm Water;589.34;25
Capon - Breast, Wing On;527.77;20
Jagermeister;573.99;19
Lemonade - Kiwi, 591 Ml;437.03;18
Sobe - Orange Carrot;508.9;24
Cocoa Powder - Natural;348.62;1
Wine - Cotes Du Rhone Parallele;442.41;15
Lemon Grass;599.88;12
Venison - Denver Leg Boneless;485.03;25
Chips Potato Reg 43g;321.7;25
Vodka - Hot, Lnferno;401.71;20
Sauce - Ranch Dressing;571.97;24
Beans - Soya Bean;365.72;4
Red Snapper - Fresh, Whole;415.66;11
Carrots - Mini, Stem On;399.1;13
Tomatoes - Heirloom;673.86;21
Juice - V8 Splash;413.84;21
Veal - Inside Round / Top, Lean;349.83;5
Halibut - Whole, Fresh;513.49;11
Beef - Striploin Aa;205.18;23
Chestnuts - Whole,canned;383.92;16
Mousse - Passion Fruit;435.03;23
Sambuca Cream;636.51;5
Zucchini - Mini, Green;585.67;3
Mustard Prepared;404.68;1
Bread - Sour Batard;538.1;8
Beef - Cooked, Corned;686.33;23
Lobster - Baby, Boiled;537.97;14
Bag - Clear 7 Lb;527.84;20
Hot Choc Vending;573.08;9
Soup - Knorr, Chicken Gumbo;344.56;4
Rice - Wild;581.06;8
Cheese - Swiss Sliced;598.97;4
