name,gender,age,postCode
King Luberti,Female,26,83054
Galina Chaudret,Female,16,13837
Tessa Bartod,Male,57,19029
Edy Hurne,Male,41,52214
Preston Jansema,Female,56,79701
Ingemar Lauga,Female,61,23558
Eadie O'Doohaine,Male,26,97801
Gottfried Frazer,Female,40,59034
Forest Radden,Female,72,45412
Guglielmo Orrett,Female,70,39249
Robbert Lissemore,Female,22,30430
Bing Frears,Female,19,48257
Fancy Stachini,Male,20,39028
Vincenz Bowhey,Male,28,58311
Trevar Farnfield,Female,54,36461
Kasey Worsnap,Male,18,60550
Leoline Holgan,Male,36,58032
Brockie Leynham,Male,69,86318
Mireielle Cossem,Male,68,95068
Carolan Ashcroft,Female,50,44056
Blondy Mathers,Male,53,70001
Koressa Sisson,Male,50,73748
Kendra Paolacci,Female,52,29088
Lisha Golden,Female,33,38394
Fairlie Laurenty,Male,79,16822
Myca Clow,Male,42,38888
Ferdinande Yarrow,Male,55,83880
Margarita Kalkofen,Female,50,54638
Winonah Kamen,Male,21,21251
Farrell Hordell,Female,74,74794
Rosita Yemm,Male,29,54784
Karyl Dray,Male,76,43393
Isabella Ragate,Female,79,60047
Xever Fiorentino,Female,60,67004
Kordula Goodluck,Male,74,81497
Rosemarie McVee,Male,21,57612
Ermanno Lockless,Male,41,68458
Dniren Roache,Male,68,28355
Lynnell Yeomans,Female,60,46957
Vivi Merigot,Male,45,61696
Marcy Deely,Male,29,70701
Dilly Benbough,Female,20,70719
Beverlie Grinstead,Female,38,74762
Celka Hindenberger,Female,76,34290
Hendrik Haughan,Female,70,49942
Brynn Riddich,Male,55,46084
Tomasine Immings,Male,25,29908
Timmy Malinson,Female,59,76048
Melicent Dunkerly,Male,77,77809
Thorvald Strapp,Male,33,28496
Gonzalo Whapples,Male,27,62428
Lay Caverhill,Male,66,62794
Morrie Abbotts,Male,42,63549
Frasier Morfield,Male,35,66201
Jaine Kennsley,Female,36,98424
Gian Tawton,Female,40,26454
Alic Baumber,Male,31,75209
Ursulina Domenici,Female,27,27382
Iorgo Ferryman,Male,63,72434
Dinny Witul,Female,70,61276
Marshal Tull,Female,49,44261
Catlee Josifovic,Female,24,33175
Terrie Renals,Female,58,43947
Jorry Verrick,Male,68,51501
Celinda Cawthera,Female,32,55177
Johnnie Threadkell,Female,73,72394
Frederich Napoleon,Female,17,15374
Boniface Stampfer,Female,73,12854
Rici Mariyushkin,Male,25,40998
Rouvin Izhaky,Male,24,83966
Mandel Newns,Male,45,80011
Worthington O'Crotty,Male,39,80429
Margalit Sposito,Male,67,78428
Justinian Dommett,Male,70,40763
Phillie Osichev,Female,21,94588
Pammy Paz,Male,21,80637
Elna Batchelar,Female,45,91728
Wyatt Tacon,Female,23,94806
Harlan Bartolic,Female,59,84176
Maddie Arnfield,Female,47,33488
Jae Preddy,Female,16,15131
Glenn Lockie,Female,33,40624
Veda Beaze,Female,49,76441
Vittoria Copland,Female,23,58704
Elisabetta Gerok,Male,34,40504
Daphne Pickthorn,Male,42,32460
Angil Callery,Female,66,81871
Marcelo Bromby,Male,72,42766
Gerri Frye,Female,32,77362
Coraline Lonnon,Female,32,45450
Frazier McCotter,Male,21,52679
Amandi Heitz,Female,70,76657
Lesli Gladding,Female,32,32921
Afton Strippel,Male,25,47901
Phyllys Bertelsen,Male,54,72828
Sim Le Prevost,Male,33,68554
Josee Vittori,Female,30,95685
Jaye Bernardeau,Female,61,77262
Judy Mum,Female,68,11905
Leonid Wykey,Female,22,18951
Lane Wedmore.,Female,27,96707
Ives Mitcheson,Female,30,27541
Erny McGirl,Female,34,25543
Barbra Cowlard,Male,19,79902
Terrijo Balcombe,Female,52,73363
Mallorie Donisthorpe,Female,66,40724
Kriste Kaas,Female,44,89001
Aeriell Syrett,Female,52,59789
Mikael Couch,Female,60,90709
Tucker Collard,Male,72,84615
Berkly Vampouille,Female,63,79663
Lorette Knath,Female,21,15590
Elena Churn,Male,62,44381
Elisa Beddis,Female,79,67710
Ned Avramovic,Male,33,58494
Christos Latore,Female,33,43327
Kitty Haselup,Female,40,18394
Kacey Vairow,Female,55,34840
Nonna Alvin,Male,64,62239
Cullan Thomelin,Male,53,25493
Marika Lammertz,Male,57,45701
Brittni Bickerstasse,Male,30,17556
Adriana Cumbes,Female,63,45151
Buddie Brugsma,Male,76,85368
Lamont Luck,Female,48,14085
Brooks Monument,Male,18,68732
Zulema Boaler,Male,27,47541
Caresa Brunsen,Male,74,17870
Winn Ivankov,Male,54,50895
Naomi Pearmain,Male,70,21442
Andrew Barles,Female,59,83745
Cinderella Klisch,Male,60,32763
Gusti Miners,Male,39,56714
Drucie Dowd,Male,54,62973
Priscilla Battams,Male,48,78445
Maighdiln Roote,Female,40,79007
Dolf Gilbeart,Female,47,71094
Bel Pirt,Female,80,43882
Lulu Burt,Male,32,80259
Dominik O'Flaherty,Male,24,51970
Mendy Archbould,Female,61,36017
Martica Kiss,Female,33,28767
Granthem Chooter,Female,65,57314
Georgie de Vaen,Male,64,26399
Fiann Vedishchev,Female,31,58646
Frans Weddup,Female,35,17569
Oates MacCaughey,Male,40,65421
Burnard Gaggen,Male,75,29766
Shandie Goodwin,Female,45,23872
Xavier Bromidge,Female,57,14085
Celestyna Silbersak,Male,51,63373
Dewain Fessier,Female,30,91031
Ewen Khristyukhin,Male,79,80441
Agatha Filon,Female,33,48147
Merrilee Earl,Male,36,21926
Dolph Paulsen,Female,21,41888
Michaela Matisoff,Female,34,79617
Jerrold Poure,Male,28,52522
Gertrudis Fenimore,Male,56,28302
Sammy Tithecote,Female,39,89234
Christine Sebastian,Male,47,53201
Duane Burland,Male,48,67909
Tamara MacLardie,Female,56,25882
Mureil Maybury,Female,19,47242
Darcey MacCoughen,Female,19,26670
Dudley Stubs,Male,23,69051
Vitia Pietsma,Male,16,44708
Lacy Burchard,Female,36,62867
Maurita Lapthorn,Female,49,81625
Bertie Jachtym,Female,55,58385
Maia Mitchard,Female,63,41850
Merrel McTerry,Male,44,40393
Pernell Stebbins,Male,70,41401
Brandyn Lambricht,Male,16,25785
Shannah Mattek,Male,72,51731
Simone Harness,Male,44,55775
Pooh Ransom,Male,52,37391
Brenda Trenholme,Female,60,90336
Ricardo Moir,Female,49,90491
Martha Epelett,Male,69,68880
Alexandro Daffey,Male,74,79713
Philly Yurukhin,Female,33,19205
Basile Boarer,Male,17,97341
Caritta Selesnick,Female,63,20164
Corena Verecker,Female,50,45721
Faustina Cheavin,Female,19,62531
Aleece Rickeard,Male,54,96886
Talbot Cleworth,Female,66,85377
Bertrand Lenham,Female,60,47048
Trace Meller,Female,52,77885
Gawain Bottby,Male,73,47482
Gert Stains,Male,37,87718
Godard MacGruer,Male,35,17377
Buffy Holley,Male,68,12235
Fan Lippett,Male,73,59954
Alphonse Flement,Male,76,98084
Jenn Annwyl,Female,58,35586
Ashby McMurdo,Female,56,34937
Arlyn Chaperling,Female,38,24565
Consuelo Shakelade,Male,35,75282
Cynthia Coulthart,Male,44,52185
Xerxes Le Friec,Female,77,97747
Bidget Groom,Male,79,68007
Bil Giddings,Female,29,47708
Tarah Jozefowicz,Female,71,52732
Mariellen Richardes,Female,65,73272
Torr Arnold,Female,16,30654
Vivyanne Piff,Male,50,17492
Cirilo Folkerts,Female,44,46861
Kata Tankin,Male,78,54615
Consuela Grove,Female,48,59364
Ambrosio Cusworth,Female,72,63547
Ermanno Georges,Male,55,91834
Joanna Trinbey,Male,22,90799
Lars Gaitskell,Male,69,32144
Beitris Bavidge,Male,71,73912
Archibold Gowdie,Male,79,10770
Loreen Skinley,Male,49,34449
Heywood Pedrozzi,Female,69,20474
Heinrik Calkin,Male,18,23595
Cindra Harmes,Male,73,34766
Rory Budd,Male,30,87510
Griswold Tynewell,Female,40,18843
Bengt Hartup,Female,61,97170
Nehemiah Huntress,Female,36,12325
Gusti Stealy,Male,69,75995
Lorenzo Clausner,Female,29,13837
Hagen Daton,Female,35,33225
Myrta Forrestill,Female,62,17771
Abbie Minnette,Female,22,19353
Brittni Grimditch,Female,20,29828
Kittie Reuss,Female,65,54515
Kore Josefowicz,Female,60,67562
Olivia Sampey,Female,20,48879
Asa Reboulet,Female,45,48015
Victoir Reeday,Male,20,89156
Emelda Van der Merwe,Male,23,22131
Ethelda Attoe,Male,50,74805
Lee Strephan,Male,52,64423
Herbert Levay,Female,66,52691
Sutherland Boulde,Female,17,30792
Carleton Allbon,Male,17,11568
Barton Clemo,Female,36,55416
Cullie Fritche,Male,68,37806
Deb Underdown,Male,24,27245
Pen MacNish,Male,46,63282
Chilton Sokell,Male,78,32879
Horace Guyers,Male,55,41753
Marlo Fidell,Female,79,63197
Genni Terese,Male,67,32658
Kimmi Swinfen,Female,49,22341
Matthiew Windsor,Female,62,67420
Merrill Anfrey,Female,26,79957
Ely Kittle,Female,37,39397
Sidoney Tomaselli,Male,78,18980
Joann Durden,Female,19,65408
Orrin Garmon,Male,22,12593
Corby Du Hamel,Female,28,27017
Dorothy Baskeyfied,Female,37,36007
Fianna Punt,Female,60,82995
Danyette Mullaly,Female,40,80006
Norry Irlam,Female,46,52885
Darius Mulderrig,Female,76,19698
Lea Bircher,Male,57,44736
Cammie Naptine,Female,16,25582
Griff Smalls,Female,76,99348
Maryann Vaszoly,Male,17,91882
Dugald Gilhooley,Male,18,71568
Colene Enstone,Female,66,52854
Jasmin Pillifant,Male,34,20096
Berkeley Casey,Male,79,43727
Hyacinthie Pennuzzi,Male,45,34306
Matty McCrackem,Male,44,99510
Miner Tortis,Female,42,83729
Gradeigh Whitwham,Male,38,97686
Gherardo Lucio,Male,20,87144
Austin Westhead,Male,71,34782
Fabiano Bineham,Male,61,34615
Tab Rakes,Male,79,54892
Freddi Oppy,Male,17,66626
Titus Goldine,Male,70,73901
Winnah Rosenfelder,Female,45,57936
Etty Piatto,Female,44,64960
Vannie Jaime,Male,70,39504
Prince Dobbyn,Male,40,40004
Theadora Laxon,Male,16,79606
Florence Scafe,Female,60,55534
Beryle Jahnel,Female,48,58716
Benedicto Missen,Male,26,22532
Maxie Godfroy,Male,18,12030
Patsy Brabin,Female,29,22193
Stan Gotcher,Female,80,80446
Homere Chrippes,Male,79,71765
Zared Follos,Male,23,41257
Mommy Moncreiffe,Male,27,95913
Sanford Niemiec,Female,30,30304
Alisander Servante,Male,58,57524
Blisse Chilcotte,Female,17,73420
Jill Maker,Male,71,50483
Janina Ethersey,Male,68,99568
Inessa Point,Male,66,25076
Marilee Vawton,Male,67,15115
Kippie Rentoll,Male,79,12257
Consalve Patton,Female,67,16321
Rem Pillifant,Male,33,47083
Gabey Matterson,Male,63,33643
Killian Moulsdale,Female,38,36380
Killie Bruckshaw,Male,35,68155
Alford Arthars,Male,69,78217
Shayne Sebring,Female,49,34662
Solly Gilhoolie,Male,24,73599
Sebastiano Speechley,Male,42,23789
Garland Rumbellow,Female,64,73176
Rochester Pettigrew,Female,65,77350
Raynell Andreutti,Female,70,23731
Brenden Pettecrew,Male,55,37932
Ernest Kleszinski,Female,43,32871
Camille Penright,Female,23,98703
George Holyland,Female,68,69506
Charlie Dreghorn,Female,43,56026
Peder Schutt,Female,48,99518
Ryley Bradick,Male,20,54564
Benetta Marquez,Female,18,41475
Halsey Bett,Male,24,81812
Lorna Simonazzi,Female,39,88130
Lothario Largan,Male,29,12261
Giffer Arnholz,Male,51,41205
Torin Brokenbrow,Female,68,70015
Myrah Mutter,Male,32,82410
Loralee Conley,Male,80,45307
Roscoe Fusco,Female,31,22380
Paton Klemencic,Female,50,57644
Luce Scyner,Female,34,14558
Talyah Jorczyk,Male,56,69670
Pearla Fowley,Male,30,63637
Cindee Scammonden,Male,35,86443
Candide Wasselin,Female,63,83329
Lauritz Scardifield,Female,60,13367
Kendricks Lillicrop,Female,56,51436
Israel Abbati,Male,43,82542
Valaree Kirkbright,Female,60,38913
Alica Brodeur,Male,38,29339
Rubie Midghall,Male,52,94612
Brenden Dunton,Female,49,34895
Pat Waeland,Female,28,80940
Anetta Leggin,Female,76,95558
Kissiah Greendale,Female,20,34428
Saloma Chippin,Male,31,50902
Sarette Hesse,Male,43,18239
Britt Dowda,Female,67,36953
Gan MacFayden,Male,43,98939
Olly Bardell,Female,42,63895
Morissa Shewan,Female,76,17250
Meier Bemwell,Female,24,98170
Michale Bennie,Female,47,83004
Cyndi Marr,Female,31,13018
Kaiser Fache,Female,78,26160
Elise Buckingham,Male,31,43745
Woodie Tetla,Female,64,34358
Donall Manass,Male,27,67377
Rex Rowcliffe,Female,39,60111
Darsie Caves,Female,56,10907
Genna Cote,Female,59,14433
Karita Jozefczak,Female,54,46173
Legra William,Male,79,82162
Vivianne Enriquez,Male,29,86172
Mirabella Collough,Female,34,84045
Solomon Durdle,Female,54,47362
Sallee Lamkin,Male,30,35414
Tarra Dooher,Male,70,50058
Shannon McQuaid,Female,73,45951
Lesley Phillippo,Male,47,43981
Elfreda Rabat,Female,22,54486
Ortensia Bilovsky,Female,73,52412
Valeda Vaudin,Female,23,58785
Sean Abeles,Male,75,20588
Hieronymus Raatz,Female,77,55513
Jessamine Luckey,Female,33,73846
Vanya Botting,Male,78,60743
Sandy Marcone,Male,19,88884
Tait Heakey,Male,30,90913
Sybil Elijahu,Female,48,23436
Deloria Whissell,Female,24,63458
Marietta Figure,Male,40,80601
Nilson Coates,Male,77,78809
Rikki Saveall,Female,76,55619
Philomena Wimlet,Male,73,89814
Candis Haw,Male,63,41582
Chilton Plumtree,Male,53,26625
Aurelia Niblock,Male,16,63379
Royall Di Frisco,Male,57,25702
Kathryn Gerritsma,Male,74,75539
Rori Brookwell,Male,39,81831
Helenelizabeth Mueller,Female,55,31558
Artemas Campanelli,Male,79,94823
Rosemaria Killock,Male,74,99402
Geri Iacomo,Male,46,15581
Norby Stollard,Female,18,15829
Jacky Despenser,Male,22,55041
Buck Jorgensen,Male,32,43136
Georgie Takos,Female,35,34102
Brennen Smallpeice,Male,80,15794
Jillie Berceros,Male,50,95261
Frannie Fassmann,Male,18,83329
Kristyn Corrigan,Female,75,69026
Natale Schimpke,Male,64,96109
Henrie Scotchmur,Male,62,78662
Elinor Liggens,Male,53,61239
Norene Fleetwood,Female,68,93954
Katuscha Ettles,Female,63,28537
Grant Mewe,Male,46,68071
Rodrick Ardron,Male,66,27847
Olivette Fairchild,Female,45,77346
Michaela Vannuccinii,Female,41,81272
Haze Stener,Female,60,58182
Berkeley Domnick,Male,44,82257
Ilene Goulston,Male,75,48895
Jenda Frugier,Male,43,67622
Wesley Dominguez,Male,56,93364
Udale Djokovic,Female,61,43206
Rory Carles,Female,76,97699
Melantha Neads,Female,40,47240
Angel Denkin,Female,32,52824
Zola Marthen,Female,75,26838
Collette Fass,Female,33,77481
Farris Gwilliam,Female,35,29090
Aharon Galbreth,Female,31,84241
Judon Conklin,Male,55,41528
Amos McGillivray,Male,20,60319
Lexie Klulisek,Female,34,51971
Marnia Sturdy,Male,45,18897
Clarita McDowall,Female,39,83994
Vic Gasnoll,Female,51,68065
Lizzy Maxstead,Female,35,47570
Lief Agutter,Male,63,69062
Malinde Leitch,Female,69,32969
Marya Earngy,Male,57,17471
Emmott Labrom,Male,71,96496
Avivah Duer,Female,16,77591
Yvette Bailey,Male,78,43982
Elizabeth Scowcraft,Male,78,21681
Timothea Glenton,Female,54,12010
Amble Franceschielli,Female,24,18014
Roseann Veltmann,Male,52,34347
Georgine Bavidge,Male,65,50885
Royal Bridgland,Male,28,20815
Laurene O'Meara,Female,76,47004
Shermie Thurgood,Female,67,67351
Steve Habercham,Female,72,45664
Randene Shales,Female,23,54953
Abbie Hann,Male,31,92097
Odo Bagnal,Male,42,46582
Pavia Pleace,Male,76,14415
Cami Peagram,Female,78,15024
Zacherie Crummey,Female,16,39377
Brion Ellsom,Female,55,20868
Reinaldo McCormick,Male,51,38448
Jacqueline Hubbert,Female,22,63374
Bryan Heino,Female,34,81913
Camey Gillbard,Male,41,18037
Florance Garbert,Female,79,19275
Inigo Sanz,Female,80,28560
Drucill Camm,Male,62,91337
Rivi Crowdace,Female,77,87000
Nanni McSkin,Male,80,36614
Erik Rain,Male,33,42705
Sheila-kathryn Alflat,Male,52,73591
Maryanna Sorton,Female,16,80310
Corabelle Corragan,Female,42,69835
Worden Szymonowicz,Female,33,67250
Jess Witty,Male,41,97282
Dante Gawthrop,Male,58,75152
Brinn Gregolin,Female,34,14770
Wilow Bygraves,Female,57,84317
Ardelle Franklen,Female,28,50685
Caressa Reavell,Male,34,40507
Micki Wynrahame,Male,68,49176
Marven Rammell,Male,31,32245
Garnet Egle of Germany,Male,79,58348
Audry Noye,Female,77,78823
Alverta Medmore,Female,58,30298
Hymie Keeffe,Male,48,83860
Vinny Schultz,Male,64,50962
Chaddie Vasyukov,Female,79,97124
Antin Gorvette,Male,54,63280
Charlotta Feechum,Male,45,37208
Manon Harp,Female,80,55757
Daune Melanaphy,Female,33,27791
Orly Marzelo,Female,79,50473
Idell Coppen,Female,52,35893
Glennis Hugland,Male,19,15712
Helli Fursey,Female,25,42103
Reuben Dougary,Female,70,67176
Karrah Greenfield,Male,18,78741
Janis Syversen,Female,67,27711
Jorrie Ovenell,Female,34,24975
Jameson Bletso,Female,79,91416
Kalinda Barszczewski,Male,26,94089
Hadleigh Vice,Female,73,65443
Annora Jordanson,Male,40,60108
Nancee Fanstone,Female,73,43767
Wyn Kybert,Male,26,13974
Laura Simoneton,Female,70,97509
Free Scading,Male,73,69419
Read Soloway,Male,53,87575
Wilton Gainfort,Female,41,81939
David Vasyaev,Male,79,99408
Levy Van der Krui,Male,73,80435
Sybille Ozanne,Female,44,17248
Harv Lomis,Male,27,19245
Alejoa Eydel,Male,42,16897
Shell Kellog,Female,64,63926
Hadrian Reimers,Male,73,30898
Karlan Rossant,Male,65,48582
Jasun Habershaw,Male,65,83462
Rosabelle Kinkead,Male,24,60915
Ernie Darey,Female,59,15839
Boone Nono,Female,59,51204
Leodora Marlen,Female,53,43730
Wren Yoselevitch,Male,56,85798
Yurik Pawlett,Female,49,61320
Beatrice Douglas,Male,24,45421
Noll Pedlingham,Female,50,78345
Orsola Pappin,Female,41,81117
Lon Cordet,Female,67,52969
Kane Mughal,Male,17,32847
Carolin Gronw,Male,37,93766
Tymothy Castells,Male,24,40257
Ollie Tewkesbury,Male,56,12417
Sid Franzman,Male,36,90047
Yolanda Roj,Female,19,67562
Deedee Kobel,Male,55,29416
Haskel Cartlidge,Female,24,86080
Barr Gomes,Female,54,10457
Haily Portch,Female,50,54503
Aundrea Cumberpatch,Female,43,49818
Anselm Downing,Female,80,51567
Christye Linfield,Male,78,91835
Batholomew Flux,Female,35,59682
Jasmin Gatrell,Female,58,42451
Chaddy Meffan,Male,38,40242
Darryl Skerritt,Female,56,25658
Kinnie Willbraham,Female,75,91434
Alexandr Pranger,Female,50,52161
Maren Francino,Male,21,79804
Ursala Milan,Female,37,74741
Corilla Casel,Female,27,58101
Carolyne Blampied,Male,54,17394
Jourdan Leverson,Male,49,56691
Maxine Birdsall,Female,38,36078
Kylila Amori,Female,39,43273
Maybelle Feltham,Male,18,32401
Karalynn Gippes,Female,65,58364
Brig Doel,Male,55,19999
Eleanor Galtone,Male,53,30431
Tabby Rawls,Female,59,35210
Phaidra Fazackerley,Female,48,33608
Reid Biss,Female,70,13779
Dunn Pescott,Female,69,12662
Emory Trowill,Female,31,31980
Rica Yearnes,Male,54,59130
Isidor Riseam,Female,43,11701
Phil Shuttell,Female,62,41631
Holt Gaspar,Male,77,18046
Larissa Bouchard,Female,78,19777
Callean Ghiraldi,Male,17,29982
Mick Hughesdon,Female,69,42201
Dar Janauschek,Male,72,92724
Hannah Madine,Female,35,50402
Nataniel Coghill,Female,64,13481
Stan Colkett,Male,56,62920
Carmelita Warman,Male,51,32047
Barclay Hammersley,Female,32,60220
Stormi Vaillant,Female,35,13051
Farand Roizin,Female,71,85365
Rosanna Kibbye,Female,26,56781
Orton Vallance,Female,31,53956
Raymond Matushevich,Male,78,27611
Fey Kaines,Female,19,24913
Drugi Dummett,Female,58,10914
Dewie Havelin,Female,64,50457
Jecho Badam,Male,60,50294
Emelita Pellingar,Female,43,38503
Farris Wrigglesworth,Male,35,40049
Culver Burns,Female,23,13553
Virgie Radden,Female,59,80632
Isobel Drugan,Male,21,50101
Albertina Bushell,Male,46,76351
Kimberlee Esby,Male,30,29545
Lesya Crat,Male,54,99845
Raimundo Wilshire,Male,38,63655
Iolande Godbehere,Female,42,65463
Yalonda Girvin,Male,49,39111
Kristofor Manie,Female,35,57355
Seka Gostick,Male,76,46919
Luigi Bisseker,Male,19,61108
Kristo Salery,Male,77,67253
Katuscha Elleyne,Male,74,37929
Kirbee Aubrun,Male,22,20936
Graham Corbitt,Female,42,73013
Cathyleen Sowthcote,Female,50,46855
Vaclav Bryer,Male,34,90051
Elianore Ewbanke,Female,26,45639
Mattie Doornbos,Female,63,88272
Ewan Grimsdike,Male,67,72233
Shari McClarence,Male,42,78110
Elvira Costard,Female,64,86993
Kira Seggie,Female,17,74430
Feliza Bernadot,Male,35,62572
Marvin Mapstone,Female,72,40887
Caroljean Heppner,Male,48,12947
Bradney McLugish,Male,28,61003
Cristina Veysey,Male,72,81861
Arlyn Meecher,Male,39,87534
Casie Skinn,Female,55,95220
Korey Crichten,Female,64,15799
Miltie Copner,Male,39,32982
Kayle Kelling,Female,37,54598
Junette Currie,Female,20,62753
Gabie Duddle,Female,62,45385
Amata Lainton,Male,53,53707
Genni Banasevich,Male,69,39909
Anabel Gwynn,Male,41,67838
Bobbie Chicken,Male,34,83218
Dian Piaggia,Male,54,18166
Ricca Andryunin,Male,71,77563
Blair Cattrall,Male,74,30073
Fiona Cottier,Female,43,37038
Harland Miere,Female,75,19342
Judah Coveney,Male,72,45220
Guss Sondland,Female,76,49381
Erda Schutte,Male,31,47251
Adriaens Lorden,Female,69,46270
Tildy Penwright,Female,17,86671
Maggy Fall,Female,53,73308
Cindy Tewkesberrie,Female,45,28040
Cherlyn Boscott,Female,69,57435
Bette-ann Gawne,Female,31,10347
Joellen Moneypenny,Male,79,75676
Sloane Baleine,Female,58,81175
Clyde Dungee,Female,74,22888
Averyl Coulson,Female,30,15139
Boony Gini,Female,68,76178
Marylou Massard,Male,40,61863
Kayne Saby,Male,38,99324
Jolynn Hendren,Female,35,15766
Lana Girod,Male,76,93284
Tabina Scholz,Female,61,23198
Zelig Rakestraw,Male,45,40875
Willamina Mollitt,Male,32,99620
Meagan Valenti,Female,25,28550
Ruby Camoletto,Male,64,88516
Les Camock,Female,51,40708
Darcee Tosspell,Female,51,51540
Lanie Dunwoody,Female,17,20440
Jerrilee Druhan,Female,57,60990
Letta Stonall,Female,45,75790
Felita Kingdom,Female,21,60975
Vilhelmina Ruggles,Male,61,26899
Dalston Blitz,Female,21,21154
Elmo McNerlin,Female,49,82813
Dierdre Prescott,Male,48,36591
Lucian Harral,Female,67,53904
Georgina McGonigal,Female,75,18914
Gerda Dorot,Female,44,84574
Eloisa Laverenz,Female,69,52430
Abigail Bracci,Female,78,87545
Mychal Upward,Male,34,74354
Montgomery Woodings,Female,39,50083
Gustavus Whitty,Female,79,10841
Joanna Cumber,Female,19,53519
Bonita Washtell,Female,50,44614
Olenolin MacGille,Male,69,15070
Micaela Spillard,Female,30,50970
Chico Mecozzi,Female,80,52812
Dorrie Packman,Male,74,60586
Corena Ashcroft,Male,37,43209
Kerk Naire,Male,64,40104
Gabriel Regis,Female,22,41670
Tabatha Antusch,Female,36,83666
Odella Wagner,Female,55,20606
Prudy Batsford,Male,40,15944
Corette Witherow,Female,44,37945
Roseline Comoletti,Female,63,73043
Krysta Vaskov,Male,53,51464
Virginie Cowpe,Male,74,40229
Flora Puddifer,Male,67,89544
Debor Riquet,Female,69,56309
Nananne Fingleton,Male,36,49272
Barb Holdey,Female,18,46851
Rosanne Miere,Male,50,16706
Sterne Cremins,Male,32,22954
Clarke Ferrier,Female,44,33760
Carine Giacomini,Male,78,11546
Batholomew Domino,Male,44,26145
Kathrine MacParland,Male,22,10346
Huberto Jodlowski,Male,61,19679
Mariam Spybey,Female,74,88306
Gothart Jeandillou,Female,16,64938
Eryn Bousfield,Female,47,71832
Cher Flott,Female,45,60309
Yoko Larvin,Female,62,54787
Consolata Lewendon,Male,24,74299
Jock Ast,Female,37,76318
Beaufort Lanfear,Female,49,80329
Rutger Handke,Male,36,83413
Gayla Bastie,Male,66,54044
Georgie Erridge,Male,57,37715
Cairistiona McGiffin,Male,67,94097
Fanechka Geerdts,Female,66,99513
Darnell Loomis,Male,50,34556
Sandie Creane,Female,73,86992
Kylie Tansley,Male,68,33705
Ralph Etoile,Male,58,14159
Nydia Goadbie,Female,55,32934
Averell Lomis,Female,24,99673
Hermia Stranks,Female,50,33825
Garrot Bemwell,Male,41,87885
Ruthe Mouatt,Female,35,66416
Gina O'Hartagan,Male,41,25989
Paulina Perfitt,Female,68,31598
Pru MacMenamy,Female,35,19573
Nonna Monkley,Male,80,46967
Dietrich Yearnsley,Female,32,56161
Debbie Rawstorn,Male,33,75902
Morris Simonsson,Female,71,66454
Deina Irons,Female,48,15077
Gonzalo Sleight,Female,64,10564
Wenda Rickardes,Male,27,80979
Yankee Lathbury,Female,75,75525
Minda McMenamin,Male,23,64944
Sunny Conisbee,Female,53,51710
Linoel Blackway,Male,70,54350
Braden Priestley,Male,68,68226
Stormie Warrender,Female,47,41728
Pollyanna Sevior,Male,25,53238
Lenci Sears,Male,63,43049
Jase Classen,Male,78,41041
Mahala Ciementini,Male,61,51762
Orv Vasilkov,Male,39,94727
Paolina Childerhouse,Female,78,30814
Lexine Ghilardi,Male,59,22236
Karita Collelton,Male,17,71721
Vida Choudhury,Female,54,90074
Catlee Langham,Female,46,52191
Morris Burtwistle,Female,24,65289
Serge Burril,Male,30,16524
Holt Todd,Female,45,79082
Abigale Bolduc,Female,22,38018
Kathy Norfolk,Male,37,51279
Anatollo Dransfield,Female,56,84257
Gib Hatherall,Female,59,94965
Haily MacCoughan,Male,17,29962
Dani Flucker,Male,62,49785
Marlene Rosengren,Female,32,28400
Ashil Alsobrook,Female,46,39742
Devan Bernon,Male,58,57268
Karel Wellard,Female,79,46873
Torrance Gernier,Male,63,83520
Wilmette Carrier,Female,65,49181
Erinna Berr,Female,25,80968
Winny Piens,Male,16,79875
Willow Hegley,Male,26,78180
Brien Carradice,Male,18,23869
Jesselyn De Normanville,Female,19,52596
Kermit Goozee,Female,70,27372
Cissiee Louche,Female,19,91776
Lita Banger,Female,31,44554
Berne Castellini,Male,18,88048
Don Ridde,Female,68,63873
Sayers Joney,Female,68,29677
Sib Franceschino,Male,38,62327
Junina Valenta,Female,63,19350
Hadrian Suermeier,Male,62,12686
Wilhelmine Ornelas,Male,20,16577
Ambur Tomblin,Male,21,15410
Dorie Lundy,Female,37,16172
Olympia Sogg,Male,25,79161
Cate Cleugh,Female,59,56638
Sergei Steggles,Female,22,82000
Eveline Van der Son,Female,56,15496
Avrit Odo,Male,43,37768
Jermaine Stammirs,Male,39,41924
Stafford Bertomieu,Female,77,46511
Stanislaus Stienham,Male,49,61841
Orly Tindley,Female,54,90327
Gordy Curnock,Male,55,88593
Elwira Robuchon,Female,40,39222
Farrah Heisman,Male,43,51975
Dalli Wakenshaw,Male,17,53485
Dasya Gabbatiss,Female,27,17681
Dani Belchem,Male,35,77725
Isiahi Janicijevic,Female,56,63568
Annetta Botler,Male,39,86017
Emmey Goodhall,Female,22,43933
Dorri Tiler,Female,42,86204
Jaclyn Ivakin,Male,60,31249
Jillayne Nicely,Male,53,94633
Allayne Graal,Female,55,56079
Tierney Laughlin,Female,25,23606
Lennard Hancox,Female,17,31451
Maximilien Doumerc,Female,58,72060
Lindy Lochhead,Male,80,87359
Barris Glassborow,Male,58,84763
Greta Lindholm,Female,56,36111
Timothee Rumble,Male,47,35895
Darbee Dunmuir,Male,64,14068
Twyla Downey,Female,62,91158
Devy Hardiker,Female,46,38221
Legra Swindles,Male,78,34330
Ricky Coulsen,Male,40,56453
Gisela McRoberts,Male,77,26732
Paige Etherson,Male,77,40389
Donnell Taaffe,Male,64,63058
Bradford Bolstridge,Female,32,65923
Jere Hens,Male,78,79852
Rochester Tattershaw,Male,73,85422
Berget Skeene,Male,68,10874
Kore Bliss,Male,36,38690
Nathalie Addekin,Male,73,64725
Dulcy Maudling,Male,54,92860
Oran Thompsett,Female,45,23185
Hermione Rigeby,Male,25,29905
Forrester Jewar,Male,45,36858
Melisse Reneke,Male,22,75878
Ronna Coulthard,Male,23,51245
Mimi Korba,Male,79,34220
Raffarty Cadden,Female,57,18933
Doreen Marti,Male,73,43635
Frasquito Morehall,Female,67,13397
Jobie Rumbold,Female,66,35305
Dorothea Wythe,Male,61,68806
Teodora Dutnall,Female,20,65562
Leanna Deacock,Female,68,50363
Murial Peterkin,Female,29,31568
Rutter Errichi,Male,45,71481
Lucinda Hundley,Male,39,75127
Victoria Baughn,Male,30,49448
Fraser Thames,Male,76,59031
Jud Ca,Female,64,56929
Damien Sagerson,Female,76,49934
Patten Lassey,Female,69,94927
Melody Flewin,Male,22,67669
Hedy Boath,Male,56,14551
Catrina Chotty,Female,77,96958
Cos Davydzenko,Male,58,38259
Christalle Adnett,Female,21,91212
Happy Forsbey,Female,56,45729
Purcell Benitti,Female,20,75868
Moreen Pettiford,Male,26,40812
Ashlan Dunton,Female,68,72004
Gayla Farragher,Female,76,36094
Rickard Di Nisco,Male,30,79772
Linus O'Dreain,Female,27,91237
Sheryl Reiach,Male,56,57492
Cordy Carslaw,Female,32,43825
Julee Linnell,Female,55,19361
Perren Speck,Female,68,56060
Darcee Abbotson,Male,53,29992
Clayborne Tremathack,Female,36,71603
Hattie Dunaway,Male,24,73429
Gwendolyn Thewys,Female,22,64378
Merwyn Havill,Female,58,40594
Emily Bertlin,Female,45,53337
Dorie Mewitt,Male,20,50086
Ursola Tainton,Male,32,98422
Bealle Giscken,Male,23,31823
Web Jacob,Male,27,34641
Octavius Rydzynski,Female,58,35599
Kata Mackinder,Female,63,90854
Trista Gandy,Male,26,17356
Astrix Davidovitz,Female,32,27654
Lisabeth Hartshorne,Male,26,54582
Fanny Robotham,Male,75,22318
Deonne Clementet,Female,76,43616
Leonardo Butlin,Male,50,41707
Rani Faust,Male,17,49278
Allegra Caudell,Female,41,62044
Rouvin Geal,Female,16,85907
Kenneth Bust,Female,33,95038
Basil Abela,Male,59,38406
Erica Bielefeld,Female,55,43077
Brand Osipov,Male,54,69181
Wilmar Esilmon,Male,50,14086
Sandor Chantrell,Male,43,98569
Tessi Westfalen,Female,28,97990
Delmor Bartoloma,Female,26,93514
Corabelle MacCaughan,Female,40,53869
Rowney Roantree,Male,59,68466
Myranda O'Rowane,Male,40,73764
Albertine Bricksey,Female,38,67202
Elsie Daelman,Male,76,36124
Carlin Devin,Male,65,47390
Aguie Wincott,Male,61,80244
Rufe Snedden,Male,57,85158
Riobard Adcock,Female,66,23351
Tonie Constance,Male,48,57201
Jessika Morbey,Female,20,86281
Ann-marie McPartling,Female,45,44288
Imojean Quarrie,Female,22,52307
Allsun Bayley,Female,36,27490
Killy Ferebee,Male,16,33718
Ardenia Garnam,Male,52,32867
Sherwynd Bellin,Male,34,57875
Dee dee O'Shiel,Male,43,44220
Nathaniel Grammer,Female,31,98033
Netti Pollastrino,Male,27,16266
Debby Dever,Female,24,29612
Quentin Crosher,Female,38,44531
Drucy Burgher,Male,26,85448
Josefina Huxster,Male,17,93373
Lynette Birchett,Male,28,97772
Mufinella Vayro,Male,67,40862
Artemus Guittet,Female,75,32636
Jacintha Gavini,Male,61,49912
Ellswerth Fury,Female,61,39101
Sidney Innocent,Female,18,37820
Toddy Checketts,Female,54,78897
Thornie Vallentin,Male,67,63194
Beverie Rowbury,Male,40,45234
Yvor Rennocks,Male,52,41035
Christina Gayther,Female,70,51615
Payton Igo,Male,79,47739
Guillemette Darwood,Male,21,21481
Asia Whatling,Male,75,74489
Rahal Mottini,Male,24,15358
Yehudi Colborn,Male,63,88061
Jeanelle Loidl,Female,60,71160
Rubia Cammocke,Female,32,66119
Sheff Featenby,Male,37,27016
Lorry Chape,Male,37,90628
Iris Westberg,Male,40,23886
Kate Grubb,Female,38,13985
Odelia Simonitto,Female,30,49767
Van Hugnet,Female,49,98605
Noelle Lamond,Male,50,21981
Sibbie Holme,Male,31,60678
Tedmund Messenbird,Male,64,76339
Trueman Delouch,Female,48,87713
Rutger Clericoates,Male,19,53555
Dominica Rosenblad,Female,16,90964
Alberto Sleight,Male,42,20846
Burr Autin,Female,69,39528
Tessa Symcoxe,Female,40,28148
Diane-marie Bearham,Male,30,82726
Ardisj Edgett,Female,57,44593
Myron Fantone,Female,35,20942
Cosimo De Fraine,Male,44,57868
Kasey Kohrt,Female,38,66983
Shalne Convery,Female,62,83838
Brad Dewane,Female,47,51537
Bernie Itzkovich,Male,20,15524
Kelcey Lammert,Male,54,22515
Terrijo Ramshaw,Female,64,83937
Lilly Huntley,Male,45,61663
Lena Brockett,Female,25,99798
Mayor Fitzroy,Female,68,66982
Wanda Linnitt,Male,47,97404
Tomasina Trevena,Female,27,72841
Adelind Samart,Male,68,17772
Gustaf Porter,Female,19,28312
Lionello Iacavone,Male,20,45864
Rollin Gyves,Male,45,16647
Mame Giddens,Female,17,48619
Nettle Kingswoode,Female,25,99934
Mindy Sysland,Female,51,40371
Arden Rosenau,Female,40,12217
Carce Halstead,Male,73,48801
Sherlocke Rydings,Female,66,81486
Nora Symington,Female,54,95309
Cherri Thick,Female,61,71057
Godfry Collibear,Male,45,47844
Perri Vassar,Female,76,64690
Joya Whitsey,Male,57,76624
Man Callinan,Female,69,90057
Norris Cancott,Female,34,13009
Cookie Still,Male,16,95340
Carolyne Osinin,Female,20,21345
Willi Samsworth,Female,27,36329
Ana Waslin,Female,65,70791
Barbara-anne Flanagan,Female,54,82855
Jami McCluney,Male,64,25079
Mallissa Opy,Female,78,42010
Vanna Duval,Female,75,59680
Hugibert Di Biasio,Male,76,62003
Loella Roads,Male,74,23646
Florette Sherebrook,Male,55,56643
Elton Gaitung,Male,20,66318
Lauritz Weale,Female,53,64778
Ranice Gallimore,Male,64,61181
Bastien Weston,Female,33,62952
Percy Nitto,Male,22,43861
Liuka Reichhardt,Male,75,29182
Graig McGawn,Male,51,64118
Kissiah Kapelhof,Female,18,16647
Berkley Vaudin,Female,61,75233
Edmon Laidlaw,Female,20,11059
Ketty Sealand,Male,23,87960
Garrot Esseby,Male,44,14700
Adrian Ferraretto,Male,34,45561
