UID        PID  PPID  C STIME TTY          TIME CMD
root         1     0  0 08:49 ?        00:00:05 /sbin/init splash
root         2     0  0 08:49 ?        00:00:00 [kthreadd]
root         4     2  0 08:49 ?        00:00:00 [kworker/0:0H]
root         6     2  0 08:49 ?        00:00:00 [mm_percpu_wq]
root         7     2  0 08:49 ?        00:00:00 [ksoftirqd/0]
root         8     2  0 08:49 ?        00:00:01 [rcu_sched]
root         9     2  0 08:49 ?        00:00:00 [rcu_bh]
root        10     2  0 08:49 ?        00:00:00 [migration/0]
root        11     2  0 08:49 ?        00:00:00 [watchdog/0]
root        12     2  0 08:49 ?        00:00:00 [cpuhp/0]
root        13     2  0 08:49 ?        00:00:00 [cpuhp/1]
root        14     2  0 08:49 ?        00:00:00 [watchdog/1]
root        15     2  0 08:49 ?        00:00:00 [migration/1]
root        16     2  0 08:49 ?        00:00:00 [ksoftirqd/1]
root        18     2  0 08:49 ?        00:00:00 [kworker/1:0H]
root        19     2  0 08:49 ?        00:00:00 [cpuhp/2]
root        20     2  0 08:49 ?        00:00:00 [watchdog/2]
root        21     2  0 08:49 ?        00:00:00 [migration/2]
root        22     2  0 08:49 ?        00:00:00 [ksoftirqd/2]
root        24     2  0 08:49 ?        00:00:00 [kworker/2:0H]
root        25     2  0 08:49 ?        00:00:00 [cpuhp/3]
root        26     2  0 08:49 ?        00:00:00 [watchdog/3]
root        27     2  0 08:49 ?        00:00:00 [migration/3]
root        28     2  0 08:49 ?        00:00:00 [ksoftirqd/3]
root        30     2  0 08:49 ?        00:00:00 [kworker/3:0H]
root        31     2  0 08:49 ?        00:00:00 [kdevtmpfs]
root        32     2  0 08:49 ?        00:00:00 [netns]
root        33     2  0 08:49 ?        00:00:00 [rcu_tasks_kthre]
root        34     2  0 08:49 ?        00:00:00 [kauditd]
root        35     2  0 08:49 ?        00:00:00 [kworker/0:1]
root        36     2  0 08:49 ?        00:00:00 [khungtaskd]
root        37     2  0 08:49 ?        00:00:00 [oom_reaper]
root        38     2  0 08:49 ?        00:00:00 [writeback]
root        39     2  0 08:49 ?        00:00:00 [kcompactd0]
root        40     2  0 08:49 ?        00:00:00 [ksmd]
root        41     2  0 08:49 ?        00:00:00 [khugepaged]
root        42     2  0 08:49 ?        00:00:00 [crypto]
root        43     2  0 08:49 ?        00:00:00 [kintegrityd]
root        44     2  0 08:49 ?        00:00:00 [kblockd]
root        45     2  0 08:49 ?        00:00:00 [ata_sff]
root        46     2  0 08:49 ?        00:00:00 [md]
root        47     2  0 08:49 ?        00:00:00 [edac-poller]
root        48     2  0 08:49 ?        00:00:00 [devfreq_wq]
root        49     2  0 08:49 ?        00:00:00 [watchdogd]
root        51     2  0 08:49 ?        00:00:00 [kworker/2:1]
root        53     2  0 08:49 ?        00:00:00 [kswapd0]
root        54     2  0 08:49 ?        00:00:00 [ecryptfs-kthrea]
root        98     2  0 08:49 ?        00:00:00 [kthrotld]
root        99     2  0 08:49 ?        00:00:00 [acpi_thermal_pm]
root       100     2  0 08:49 ?        00:00:00 [scsi_eh_0]
root       101     2  0 08:49 ?        00:00:00 [scsi_tmf_0]
root       102     2  0 08:49 ?        00:00:00 [scsi_eh_1]
root       103     2  0 08:49 ?        00:00:00 [scsi_tmf_1]
root       110     2  0 08:49 ?        00:00:00 [ipv6_addrconf]
root       119     2  0 08:49 ?        00:00:00 [kstrp]
root       136     2  0 08:49 ?        00:00:00 [charger_manager]
root       193     2  0 08:49 ?        00:00:00 [kworker/1:2]
root       195     2  0 08:49 ?        00:00:00 [kworker/3:1H]
root       196     2  0 08:49 ?        00:00:00 [scsi_eh_2]
root       197     2  0 08:49 ?        00:00:00 [scsi_tmf_2]
root       199     2  0 08:49 ?        00:00:00 [kworker/1:1H]
root       200     2  0 08:49 ?        00:00:00 [kworker/2:1H]
root       210     2  0 08:49 ?        00:00:00 [kworker/0:1H]
root       221     2  0 08:49 ?        00:00:00 [jbd2/sda1-8]
root       222     2  0 08:49 ?        00:00:00 [ext4-rsv-conver]
root       259     1  0 08:49 ?        00:00:00 /lib/systemd/systemd-journald
root       265     2  0 08:49 ?        00:00:00 [kworker/2:2]
root       278     1  0 08:49 ?        00:00:00 /lib/systemd/systemd-udevd
root       308     2  0 08:49 ?        00:00:00 [loop0]
root       310     2  0 08:49 ?        00:00:00 [loop1]
root       311     2  0 08:49 ?        00:00:00 [loop2]
root       312     2  0 08:49 ?        00:00:00 [loop3]
root       313     2  0 08:49 ?        00:00:00 [loop4]
root       314     2  0 08:49 ?        00:00:00 [loop5]
root       317     2  0 08:49 ?        00:00:00 [loop6]
root       318     2  0 08:49 ?        00:00:00 [loop7]
root       319     2  0 08:49 ?        00:00:00 [loop8]
root       320     2  0 08:49 ?        00:00:00 [loop9]
root       323     2  0 08:49 ?        00:00:00 [loop10]
root       324     2  0 08:49 ?        00:00:00 [loop11]
root       325     2  0 08:49 ?        00:00:00 [loop12]
root       326     2  0 08:49 ?        00:00:00 [loop13]
root       327     2  0 08:49 ?        00:00:00 [loop14]
root       328     2  0 08:49 ?        00:00:00 [loop15]
root       329     2  0 08:49 ?        00:00:01 [loop16]
root       330     2  0 08:49 ?        00:00:00 [loop17]
root       331     2  0 08:49 ?        00:00:00 [loop18]
root       332     2  0 08:49 ?        00:00:00 [loop19]
root       333     2  0 08:49 ?        00:00:00 [loop20]
systemd+   339     1  0 08:49 ?        00:00:00 /lib/systemd/systemd-resolved
root       401     2  0 08:49 ?        00:00:00 [iprt-VBoxWQueue]
root       416     2  0 08:49 ?        00:00:00 [ttm_swap]
root       618     1  0 08:49 ?        00:00:00 /usr/sbin/ModemManager
root       625     1  0 08:49 ?        00:00:01 /usr/sbin/irqbalance --foreground
root       634     1  0 08:49 ?        00:00:00 /usr/bin/python3 /usr/bin/networkd-dispatcher
avahi      644     1  0 08:49 ?        00:00:00 avahi-daemon: running [vbox1804.local]
root       646     1  0 08:49 ?        00:00:00 /lib/systemd/systemd-logind
root       647     1  0 08:49 ?        00:00:00 /usr/lib/udisks2/udisksd
message+   648     1  0 08:49 ?        00:00:03 /usr/bin/dbus-daemon --system --address=systemd: --nofork --nopidfile --systemd-activation --syslog-only
avahi      662   644  0 08:49 ?        00:00:00 avahi-daemon: chroot helper
root       664     2  0 09:36 ?        00:00:07 [kworker/3:0]
root       679     1  0 08:49 ?        00:00:00 /sbin/wpa_supplicant -u -s -O /run/wpa_supplicant
root       680     1  0 08:49 ?        00:00:00 /usr/sbin/cron -f
syslog     681     1  0 08:49 ?        00:00:00 /usr/sbin/rsyslogd -n
root       684     1  0 08:49 ?        00:00:00 /usr/sbin/NetworkManager --no-daemon
root       686     1  0 08:49 ?        00:00:00 /usr/sbin/acpid
root       689     1  0 08:49 ?        00:00:00 /usr/lib/accountsservice/accounts-daemon
root       691     1  0 08:49 ?        00:00:02 /usr/lib/snapd/snapd
root       705     1  0 08:49 ?        00:00:00 /usr/lib/policykit-1/polkitd --no-debug
root       869     1  0 08:49 ?        00:00:00 /usr/sbin/gdm3
root       880     1  0 08:49 ?        00:00:05 /usr/sbin/VBoxService --pidfile /var/run/vboxadd-service.sh
root       889   684  0 08:49 ?        00:00:00 /sbin/dhclient -d -q -sf /usr/lib/NetworkManager/nm-dhcp-helper -pf /run/dhclient-enp0s3.pid -lf /var/lib/NetworkManager/dhclient-2419a0ee-1e29-3f5c-9e37-74941a9ef2d5-enp0s3.lease -cf /var/lib/NetworkManager/dhclient-enp0s3.conf enp0s3
root       895   869  0 08:49 ?        00:00:00 gdm-session-worker [pam/gdm-autologin]
whoopsie   916     1  0 08:49 ?        00:00:00 /usr/bin/whoopsie -f
kernoops   919     1  0 08:49 ?        00:00:00 /usr/sbin/kerneloops --test
kernoops   921     1  0 08:49 ?        00:00:00 /usr/sbin/kerneloops
jens       957     1  0 08:49 ?        00:00:00 /lib/systemd/systemd --user
jens       974   957  0 08:49 ?        00:00:00 (sd-pam)
jens      1019     1  0 08:49 ?        00:00:00 /usr/bin/gnome-keyring-daemon --daemonize --login
jens      1023   895  0 08:49 tty1     00:00:00 /usr/lib/gdm3/gdm-x-session --run-script env GNOME_SHELL_SESSION_MODE=ubuntu gnome-session --session=ubuntu
jens      1025  1023  2 08:49 tty1     00:05:56 /usr/lib/xorg/Xorg vt1 -displayfd 3 -auth /run/user/1000/gdm/Xauthority -background none -noreset -keeptty -verbose 3
jens      1041   957  0 08:49 ?        00:00:00 /usr/bin/dbus-daemon --session --address=systemd: --nofork --nopidfile --systemd-activation --syslog-only
jens      1044  1023  0 08:49 tty1     00:00:00 /usr/lib/gnome-session/gnome-session-binary --session=ubuntu
jens      1168     1  0 08:49 ?        00:00:00 /usr/bin/VBoxClient --clipboard
jens      1169  1168  0 08:49 ?        00:00:00 /usr/bin/VBoxClient --clipboard
jens      1178     1  0 08:49 ?        00:00:00 /usr/bin/VBoxClient --display
jens      1179  1178  0 08:49 ?        00:00:00 /usr/bin/VBoxClient --display
jens      1185     1  0 08:49 ?        00:00:00 /usr/bin/VBoxClient --seamless
jens      1187  1185  0 08:49 ?        00:00:00 /usr/bin/VBoxClient --seamless
jens      1191     1  0 08:49 ?        00:00:00 /usr/bin/VBoxClient --draganddrop
jens      1192  1191  0 08:49 ?        00:00:36 /usr/bin/VBoxClient --draganddrop
jens      1212  1044  0 08:49 ?        00:00:00 /usr/bin/ssh-agent /usr/bin/im-launch env GNOME_SHELL_SESSION_MODE=ubuntu gnome-session --session=ubuntu
jens      1235   957  0 08:49 ?        00:00:00 /usr/lib/gvfs/gvfsd
jens      1250   957  0 08:49 ?        00:00:00 /usr/lib/gvfs/gvfsd-fuse /run/user/1000/gvfs -f -o big_writes
jens      1304   957  0 08:49 ?        00:00:00 /usr/lib/at-spi2-core/at-spi-bus-launcher
jens      1331  1304  0 08:49 ?        00:00:00 /usr/bin/dbus-daemon --config-file=/usr/share/defaults/at-spi2/accessibility.conf --nofork --print-address 3
jens      1336   957  0 08:49 ?        00:00:01 /usr/lib/at-spi2-core/at-spi2-registryd --use-gnome-session
root      1349     2  0 10:58 ?        00:00:00 [kworker/u8:0]
root      1394     2  0 11:02 ?        00:00:00 [kworker/0:0]
jens      1470  1044 13 08:49 tty1     00:38:45 /usr/bin/gnome-shell
root      1527     1  0 08:49 ?        00:00:00 /usr/lib/upower/upowerd
root      1549     1  0 08:49 ?        00:00:12 /usr/lib/packagekit/packagekitd
jens      1565     1  0 08:49 ?        00:00:00 /usr/bin/pulseaudio --start --log-target=syslog
rtkit     1566     1  0 08:49 ?        00:00:00 /usr/lib/rtkit/rtkit-daemon
root      1617     2  0 12:00 ?        00:00:00 [kworker/1:1]
root      1640     2  0 12:24 ?        00:00:00 [kworker/u8:1]
root      1828     2  0 13:04 ?        00:00:00 [kworker/3:2]
root      1841     2  0 13:17 ?        00:00:00 [kworker/u8:2]
jens      1920   957  0 13:41 ?        00:00:01 /usr/lib/gnome-terminal/gnome-terminal-server
jens      1930  1920  0 13:41 pts/0    00:00:00 bash
jens      1941  1930  0 13:41 pts/0    00:00:00 man readdir
jens      1952  1941  0 13:41 pts/0    00:00:00 pager
jens      1959  1470  0 08:49 tty1     00:00:03 ibus-daemon --xim --panel disable
jens      1963  1959  0 08:49 tty1     00:00:00 /usr/lib/ibus/ibus-dconf
jens      1965     1  0 08:49 tty1     00:00:01 /usr/lib/ibus/ibus-x11 --kill-daemon
jens      1969   957  0 08:49 ?        00:00:00 /usr/lib/ibus/ibus-portal
jens      1978   957  0 08:49 ?        00:00:00 /usr/lib/gnome-shell/gnome-shell-calendar-server
jens      1982   957  0 08:49 ?        00:00:00 /usr/lib/evolution/evolution-source-registry
jens      1990   957  0 08:49 ?        00:00:00 /usr/lib/gnome-online-accounts/goa-daemon
jens      2001   957  0 08:49 ?        00:00:00 /usr/lib/gnome-online-accounts/goa-identity-service
root      2005     1  0 08:49 ?        00:00:00 /usr/lib/x86_64-linux-gnu/boltd
jens      2010   957  0 08:49 ?        00:00:00 /usr/lib/gvfs/gvfs-udisks2-volume-monitor
jens      2017   957  0 08:49 ?        00:00:00 /usr/lib/gvfs/gvfs-gphoto2-volume-monitor
jens      2021   957  0 08:49 ?        00:00:00 /usr/lib/gvfs/gvfs-mtp-volume-monitor
jens      2025   957  0 08:49 ?        00:00:00 /usr/lib/gvfs/gvfs-goa-volume-monitor
jens      2029   957  0 08:49 ?        00:00:00 /usr/lib/gvfs/gvfs-afc-volume-monitor
jens      2034  1044  0 08:49 tty1     00:00:00 /usr/lib/gnome-settings-daemon/gsd-power
jens      2036  1044  0 08:49 tty1     00:00:00 /usr/lib/gnome-settings-daemon/gsd-print-notifications
jens      2037  1044  0 08:49 tty1     00:00:00 /usr/lib/gnome-settings-daemon/gsd-rfkill
jens      2040  1044  0 08:49 tty1     00:00:00 /usr/lib/gnome-settings-daemon/gsd-screensaver-proxy
jens      2041  1044  0 08:49 tty1     00:00:00 /usr/lib/gnome-settings-daemon/gsd-sharing
jens      2050  1044  0 08:49 tty1     00:00:00 /usr/lib/gnome-settings-daemon/gsd-xsettings
jens      2052  1044  0 08:49 tty1     00:00:00 /usr/lib/gnome-settings-daemon/gsd-wacom
jens      2057  1044  0 08:49 tty1     00:00:00 /usr/lib/gnome-settings-daemon/gsd-smartcard
jens      2060  1044  0 08:49 tty1     00:00:00 /usr/lib/gnome-settings-daemon/gsd-sound
jens      2065  1044  0 08:49 tty1     00:00:00 /usr/lib/gnome-settings-daemon/gsd-a11y-settings
jens      2069  1044  0 08:49 tty1     00:00:00 /usr/lib/gnome-settings-daemon/gsd-clipboard
jens      2072  1044  0 08:49 tty1     00:00:03 /usr/lib/gnome-settings-daemon/gsd-color
jens      2073  1044  0 08:49 tty1     00:00:00 /usr/lib/gnome-settings-daemon/gsd-datetime
jens      2076  1044  0 08:49 tty1     00:00:00 /usr/lib/gnome-settings-daemon/gsd-housekeeping
jens      2084  1044  0 08:49 tty1     00:00:00 /usr/lib/gnome-settings-daemon/gsd-keyboard
jens      2088  1044  0 08:49 tty1     00:00:00 /usr/lib/gnome-settings-daemon/gsd-media-keys
jens      2089  1044  0 08:49 tty1     00:00:00 /usr/lib/gnome-settings-daemon/gsd-mouse
jens      2099  7149  0 13:43 pts/1    00:00:00 /bin/bash --rcfile /snap/clion/25/plugins/terminal/jediterm-bash.in -i
jens      2115     1  0 08:49 tty1     00:00:00 /usr/lib/gnome-settings-daemon/gsd-printer
colord    2117     1  0 08:49 ?        00:00:00 /usr/lib/colord/colord
jens      2151  1044  0 08:49 tty1     00:00:06 nautilus-desktop
jens      2155  1044  0 08:49 tty1     00:00:06 /usr/bin/gnome-software --gapplication-service
jens      2158  1044  0 08:49 tty1     00:00:00 /usr/lib/gnome-disk-utility/gsd-disk-utility-notify
jens      2179  1235  0 08:49 ?        00:00:00 /usr/lib/gvfs/gvfsd-trash --spawner :1.7 /org/gtk/gvfs/exec_spaw/0
jens      2192  7149  0 13:45 tty1     00:00:00 /home/jens/Courses/cxx/cxx-systems-programming/gitlab/cxx-systems-programming/solutions/2-io/2.2-file-system/cmake-build-debug/ps-redirect
jens      2193  2192  0 13:45 tty1     00:00:00 ps -ef
jens      2199   957  0 08:49 ?        00:00:00 /usr/lib/evolution/evolution-calendar-factory
jens      2216   957  0 08:49 ?        00:00:00 /usr/lib/dconf/dconf-service
jens      2238  1959  0 08:49 tty1     00:00:00 /usr/lib/ibus/ibus-engine-simple
jens      2251  2199  0 08:49 ?        00:00:00 /usr/lib/evolution/evolution-calendar-factory-subprocess --factory all --bus-name org.gnome.evolution.dataserver.Subprocess.Backend.Calendarx2199x2 --own-path /org/gnome/evolution/dataserver/Subprocess/Backend/Calendar/2199/2
jens      2270   957  0 08:49 ?        00:00:00 /usr/lib/evolution/evolution-addressbook-factory
jens      2281   957  0 08:49 ?        00:00:00 /usr/lib/gvfs/gvfsd-metadata
jens      2284  2270  0 08:49 ?        00:00:00 /usr/lib/evolution/evolution-addressbook-factory-subprocess --factory all --bus-name org.gnome.evolution.dataserver.Subprocess.Backend.AddressBookx2270x2 --own-path /org/gnome/evolution/dataserver/Subprocess/Backend/AddressBook/2270/2
root      2303     1  0 08:49 ?        00:00:00 /usr/lib/fwupd/fwupd
root      3071     2  0 08:50 ?        00:00:00 [xfsalloc]
root      3073     2  0 08:50 ?        00:00:00 [xfs_mru_cache]
root      3078     2  0 08:50 ?        00:00:00 [jfsIO]
root      3079     2  0 08:50 ?        00:00:00 [jfsCommit]
root      3080     2  0 08:50 ?        00:00:00 [jfsCommit]
root      3081     2  0 08:50 ?        00:00:00 [jfsCommit]
root      3082     2  0 08:50 ?        00:00:00 [jfsCommit]
root      3083     2  0 08:50 ?        00:00:00 [jfsSync]
jens      3244  1044  0 08:50 tty1     00:00:01 update-notifier
jens      7085  1470  0 08:53 tty1     00:00:00 /bin/sh /snap/clion/25/bin/clion.sh
jens      7149  7085  8 08:53 tty1     00:25:35 /snap/clion/25/jre64/bin/java -classpath /snap/clion/25/lib/bootstrap.jar:/snap/clion/25/lib/extensions.jar:/snap/clion/25/lib/util.jar:/snap/clion/25/lib/jdom.jar:/snap/clion/25/lib/log4j.jar:/snap/clion/25/lib/trove4j.jar:/snap/clion/25/lib/jna.jar -Xss2m -Xms256m -Xmx2000m -XX:NewSize=128m -XX:MaxNewSize=128m -XX:ReservedCodeCacheSize=240m -XX:+UseConcMarkSweepGC -XX:SoftRefLRUPolicyMSPerMB=50 -ea -Dsun.io.useCanonCaches=false -Djava.net.preferIPv4Stack=true -XX:+HeapDumpOnOutOfMemoryError -XX:-OmitStackTraceInFastThrow -Dawt.useSystemAAFontSettings=lcd -Dsun.java2d.renderer=sun.java2d.marlin.MarlinRenderingEngine -XX:ErrorFile=/home/jens/java_error_in_CL_%p.log -XX:HeapDumpPath=/home/jens/java_error_in_CL.hprof -Didea.paths.selector=CLion2018.1 -Djb.vmOptionsFile=/snap/clion/25/bin/clion64.vmoptions -Didea.platform.prefix=CLion com.intellij.idea.Main
jens      7167   957  0 08:53 ?        00:00:05 /usr/bin/nautilus --gapplication-service
jens      7201  7149  0 08:53 tty1     00:00:01 /snap/clion/25/bin/fsnotifier64
root      7474     1  0 08:54 ?        00:00:00 /usr/sbin/cupsd -l
root      7475     1  0 08:54 ?        00:00:00 /usr/sbin/cups-browsed
lp        7477  7474  0 08:54 ?        00:00:00 /usr/lib/cups/notifier/dbus dbus://
jens      7611  1019  0 08:57 ?        00:00:00 /usr/bin/ssh-agent -D -a /run/user/1000/keyring/.ssh
