{
  "main.css": "./static/css/main.f8f93970.chunk.css",
  "main.js": "./static/js/main.0046889e.chunk.js",
  "main.js.map": "./static/js/main.0046889e.chunk.js.map",
  "static/css/1.a525a79d.chunk.css": "./static/css/1.a525a79d.chunk.css",
  "static/js/1.9ae756ff.chunk.js": "./static/js/1.9ae756ff.chunk.js",
  "static/js/1.9ae756ff.chunk.js.map": "./static/js/1.9ae756ff.chunk.js.map",
  "runtime~main.js": "./static/js/runtime~main.4a686d48.js",
  "runtime~main.js.map": "./static/js/runtime~main.4a686d48.js.map",
  "static/css/1.a525a79d.chunk.css.map": "./static/css/1.a525a79d.chunk.css.map",
  "static/css/main.f8f93970.chunk.css.map": "./static/css/main.f8f93970.chunk.css.map",
  "index.html": "./index.html",
  "precache-manifest.4daf81ab414d6c641d50dec1607f49d4.js": "./precache-manifest.4daf81ab414d6c641d50dec1607f49d4.js",
  "service-worker.js": "./service-worker.js"
}