0d28a558eff83636c3241c6b3c7554da187e00e471c025ac2ce49fdfac8310f8 vendor.trustonic.tee@1.0::ITee
72b2445e9835a12280ec9a4695409ad830919a96e74dabfd4398d3b65452c288 vendor.trustonic.tee.tui@1.0::ITui
7f755730e05400be0e0bf5397d561dc5500b1527e953b2c8d1473b186719462b vendor.trustonic.tee.tui@1.0::ITuiCallback
b53d717dee2c3b3915baa2670b6f990ecec0dded3d20ef51416ee2c3aae2804f vendor.trustonic.teeregistry@1.0::ITeeRegistry
df4e9d0468863a98511d667b660f0085dd7024d8e0e21452b86ac0d72721ff4d vendor.trustonic.tee@1.0::ITeeCallback
