%YAML 1.1
%TAG !u! tag:unity3d.com,2011:
--- !u!74 &7400000
AnimationClip:
  m_ObjectHideFlags: 0
  m_CorrespondingSourceObject: {fileID: 0}
  m_PrefabInstance: {fileID: 0}
  m_PrefabAsset: {fileID: 0}
  m_Name: sword2
  serializedVersion: 6
  m_Legacy: 0
  m_Compressed: 0
  m_UseHighQualityCurve: 1
  m_RotationCurves: []
  m_CompressedRotationCurves: []
  m_EulerCurves: []
  m_PositionCurves: []
  m_ScaleCurves: []
  m_FloatCurves: []
  m_PPtrCurves:
  - curve:
    - time: 0
      value: {fileID: 219350219241575109, guid: 5be522e727cfe164f86b9344acfb760d,
        type: 3}
    - time: 0.083333336
      value: {fileID: -6614553716716569517, guid: 5be522e727cfe164f86b9344acfb760d,
        type: 3}
    - time: 0.16666667
      value: {fileID: 5400990648422445621, guid: 5be522e727cfe164f86b9344acfb760d,
        type: 3}
    - time: 0.25
      value: {fileID: 3396168869994285779, guid: 5be522e727cfe164f86b9344acfb760d,
        type: 3}
    - time: 0.33333334
      value: {fileID: 1333135607626812550, guid: 5be522e727cfe164f86b9344acfb760d,
        type: 3}
    - time: 0.41666666
      value: {fileID: 2153963937573919760, guid: 5be522e727cfe164f86b9344acfb760d,
        type: 3}
    - time: 0.5
      value: {fileID: -8393056122415092879, guid: 5be522e727cfe164f86b9344acfb760d,
        type: 3}
    - time: 0.5833333
      value: {fileID: 2735325422632410334, guid: 5be522e727cfe164f86b9344acfb760d,
        type: 3}
    - time: 0.6666667
      value: {fileID: 6352698427240483559, guid: 5be522e727cfe164f86b9344acfb760d,
        type: 3}
    - time: 0.75
      value: {fileID: -3394248308948723397, guid: 5be522e727cfe164f86b9344acfb760d,
        type: 3}
    - time: 0.8333333
      value: {fileID: 5023528524811917801, guid: 5be522e727cfe164f86b9344acfb760d,
        type: 3}
    - time: 0.9166667
      value: {fileID: 968227638939749726, guid: 5be522e727cfe164f86b9344acfb760d,
        type: 3}
    - time: 1
      value: {fileID: 3391308122341947190, guid: 5be522e727cfe164f86b9344acfb760d,
        type: 3}
    - time: 1.0833334
      value: {fileID: 2949478493969897272, guid: 5be522e727cfe164f86b9344acfb760d,
        type: 3}
    attribute: m_Sprite
    path: 
    classID: 212
    script: {fileID: 0}
  m_SampleRate: 12
  m_WrapMode: 0
  m_Bounds:
    m_Center: {x: 0, y: 0, z: 0}
    m_Extent: {x: 0, y: 0, z: 0}
  m_ClipBindingConstant:
    genericBindings:
    - serializedVersion: 2
      path: 0
      attribute: 0
      script: {fileID: 0}
      typeID: 212
      customType: 23
      isPPtrCurve: 1
    pptrCurveMapping:
    - {fileID: 219350219241575109, guid: 5be522e727cfe164f86b9344acfb760d, type: 3}
    - {fileID: -6614553716716569517, guid: 5be522e727cfe164f86b9344acfb760d, type: 3}
    - {fileID: 5400990648422445621, guid: 5be522e727cfe164f86b9344acfb760d, type: 3}
    - {fileID: 3396168869994285779, guid: 5be522e727cfe164f86b9344acfb760d, type: 3}
    - {fileID: 1333135607626812550, guid: 5be522e727cfe164f86b9344acfb760d, type: 3}
    - {fileID: 2153963937573919760, guid: 5be522e727cfe164f86b9344acfb760d, type: 3}
    - {fileID: -8393056122415092879, guid: 5be522e727cfe164f86b9344acfb760d, type: 3}
    - {fileID: 2735325422632410334, guid: 5be522e727cfe164f86b9344acfb760d, type: 3}
    - {fileID: 6352698427240483559, guid: 5be522e727cfe164f86b9344acfb760d, type: 3}
    - {fileID: -3394248308948723397, guid: 5be522e727cfe164f86b9344acfb760d, type: 3}
    - {fileID: 5023528524811917801, guid: 5be522e727cfe164f86b9344acfb760d, type: 3}
    - {fileID: 968227638939749726, guid: 5be522e727cfe164f86b9344acfb760d, type: 3}
    - {fileID: 3391308122341947190, guid: 5be522e727cfe164f86b9344acfb760d, type: 3}
    - {fileID: 2949478493969897272, guid: 5be522e727cfe164f86b9344acfb760d, type: 3}
  m_AnimationClipSettings:
    serializedVersion: 2
    m_AdditiveReferencePoseClip: {fileID: 0}
    m_AdditiveReferencePoseTime: 0
    m_StartTime: 0
    m_StopTime: 1.1666667
    m_OrientationOffsetY: 0
    m_Level: 0
    m_CycleOffset: 0
    m_HasAdditiveReferencePose: 0
    m_LoopTime: 0
    m_LoopBlend: 0
    m_LoopBlendOrientation: 0
    m_LoopBlendPositionY: 0
    m_LoopBlendPositionXZ: 0
    m_KeepOriginalOrientation: 0
    m_KeepOriginalPositionY: 1
    m_KeepOriginalPositionXZ: 0
    m_HeightFromFeet: 0
    m_Mirror: 0
  m_EditorCurves: []
  m_EulerEditorCurves: []
  m_HasGenericRootTransform: 0
  m_HasMotionFloatCurves: 0
  m_Events: []
