%YAML 1.1
%TAG !u! tag:unity3d.com,2011:
--- !u!74 &7400000
AnimationClip:
  m_ObjectHideFlags: 0
  m_CorrespondingSourceObject: {fileID: 0}
  m_PrefabInstance: {fileID: 0}
  m_PrefabAsset: {fileID: 0}
  m_Name: sword3
  serializedVersion: 6
  m_Legacy: 0
  m_Compressed: 0
  m_UseHighQualityCurve: 1
  m_RotationCurves: []
  m_CompressedRotationCurves: []
  m_EulerCurves: []
  m_PositionCurves: []
  m_ScaleCurves: []
  m_FloatCurves: []
  m_PPtrCurves:
  - curve:
    - time: 0
      value: {fileID: -1185836175237326733, guid: 137c93e9765bd86409ea964be37cba1c,
        type: 3}
    - time: 0.083333336
      value: {fileID: 9071703033844179826, guid: 137c93e9765bd86409ea964be37cba1c,
        type: 3}
    - time: 0.16666667
      value: {fileID: 499764791610113792, guid: 137c93e9765bd86409ea964be37cba1c,
        type: 3}
    - time: 0.25
      value: {fileID: -4652191046054281535, guid: 137c93e9765bd86409ea964be37cba1c,
        type: 3}
    - time: 0.33333334
      value: {fileID: -9083116862239537733, guid: 137c93e9765bd86409ea964be37cba1c,
        type: 3}
    - time: 0.41666666
      value: {fileID: -1264439020348542508, guid: 137c93e9765bd86409ea964be37cba1c,
        type: 3}
    - time: 0.5
      value: {fileID: -5715597546585846797, guid: 137c93e9765bd86409ea964be37cba1c,
        type: 3}
    - time: 0.5833333
      value: {fileID: 3563251688491319314, guid: 137c93e9765bd86409ea964be37cba1c,
        type: 3}
    - time: 0.6666667
      value: {fileID: 1483664025674169950, guid: 137c93e9765bd86409ea964be37cba1c,
        type: 3}
    - time: 0.75
      value: {fileID: -3833271743878329146, guid: 137c93e9765bd86409ea964be37cba1c,
        type: 3}
    - time: 0.8333333
      value: {fileID: 4664235123290505916, guid: 137c93e9765bd86409ea964be37cba1c,
        type: 3}
    - time: 0.9166667
      value: {fileID: 5492277623302099617, guid: 137c93e9765bd86409ea964be37cba1c,
        type: 3}
    - time: 1
      value: {fileID: -3839135664646741221, guid: 137c93e9765bd86409ea964be37cba1c,
        type: 3}
    attribute: m_Sprite
    path: 
    classID: 212
    script: {fileID: 0}
  m_SampleRate: 12
  m_WrapMode: 0
  m_Bounds:
    m_Center: {x: 0, y: 0, z: 0}
    m_Extent: {x: 0, y: 0, z: 0}
  m_ClipBindingConstant:
    genericBindings:
    - serializedVersion: 2
      path: 0
      attribute: 0
      script: {fileID: 0}
      typeID: 212
      customType: 23
      isPPtrCurve: 1
    pptrCurveMapping:
    - {fileID: -1185836175237326733, guid: 137c93e9765bd86409ea964be37cba1c, type: 3}
    - {fileID: 9071703033844179826, guid: 137c93e9765bd86409ea964be37cba1c, type: 3}
    - {fileID: 499764791610113792, guid: 137c93e9765bd86409ea964be37cba1c, type: 3}
    - {fileID: -4652191046054281535, guid: 137c93e9765bd86409ea964be37cba1c, type: 3}
    - {fileID: -9083116862239537733, guid: 137c93e9765bd86409ea964be37cba1c, type: 3}
    - {fileID: -1264439020348542508, guid: 137c93e9765bd86409ea964be37cba1c, type: 3}
    - {fileID: -5715597546585846797, guid: 137c93e9765bd86409ea964be37cba1c, type: 3}
    - {fileID: 3563251688491319314, guid: 137c93e9765bd86409ea964be37cba1c, type: 3}
    - {fileID: 1483664025674169950, guid: 137c93e9765bd86409ea964be37cba1c, type: 3}
    - {fileID: -3833271743878329146, guid: 137c93e9765bd86409ea964be37cba1c, type: 3}
    - {fileID: 4664235123290505916, guid: 137c93e9765bd86409ea964be37cba1c, type: 3}
    - {fileID: 5492277623302099617, guid: 137c93e9765bd86409ea964be37cba1c, type: 3}
    - {fileID: -3839135664646741221, guid: 137c93e9765bd86409ea964be37cba1c, type: 3}
  m_AnimationClipSettings:
    serializedVersion: 2
    m_AdditiveReferencePoseClip: {fileID: 0}
    m_AdditiveReferencePoseTime: 0
    m_StartTime: 0
    m_StopTime: 1.0833334
    m_OrientationOffsetY: 0
    m_Level: 0
    m_CycleOffset: 0
    m_HasAdditiveReferencePose: 0
    m_LoopTime: 0
    m_LoopBlend: 0
    m_LoopBlendOrientation: 0
    m_LoopBlendPositionY: 0
    m_LoopBlendPositionXZ: 0
    m_KeepOriginalOrientation: 0
    m_KeepOriginalPositionY: 1
    m_KeepOriginalPositionXZ: 0
    m_HeightFromFeet: 0
    m_Mirror: 0
  m_EditorCurves: []
  m_EulerEditorCurves: []
  m_HasGenericRootTransform: 0
  m_HasMotionFloatCurves: 0
  m_Events: []
